[
  {
    "type": 2,
    "title": "Whoami",
    "description": "Whoami testing tool",
    "note": "",
    "categories": ["testing"],
    "platform": "linux",
    "logo": "https://portainer-io-assets.sfo2.digitaloceanspaces.com/logos/wordpress.png",
    "repository": {
      "url": "https://gitlab.com/schnelle.cloud/dst001",
      "stackfile": "stacks/whoami/docker-compose.yml"
    },
    "env": [
      {
        "name": "SC_STACK",
        "label": "stack name",
        "description": ""
      },
      {
        "name": "SC_STACK_DOMAIN",
        "label": "stack entrypoint domain",
        "description": ""
      }
    ]
  },
  {
    "type": 2,
    "title": "WordPress",
    "description": "WordPress (without db)",
    "note": "",
    "categories": ["CMS"],
    "platform": "linux",
    "logo": "https://portainer-io-assets.sfo2.digitaloceanspaces.com/logos/wordpress.png",
    "repository": {
      "url": "https://gitlab.com/schnelle.cloud/dst001",
      "stackfile": "stacks/wordpress/docker-compose.yml"
    },
    "env": [
      {
        "name": "SC_STACK",
        "label": "stack name",
        "description": ""
      },
      {
        "name": "SC_STACK_DOMAIN",
        "label": "stack entrypoint domain",
        "description": ""
      },
      {
        "name": "SC_STACK_WP_VOLUME_NAME",
        "label": "wordpress volume name",
        "description": ""
      },
      {
        "name": "SC_STACK_WP_REPLICAS",
        "label": "replica amount",
        "description": ""
      },
      {
        "name": "SC_STACK_DB_HOST",
        "label": "db host",
        "description": ""
      },
      {
        "name": "SC_STACK_DB_PORT",
        "label": "db port",
        "description": ""
      },
      {
        "name": "SC_STACK_DB_USER",
        "label": "db user",
        "description": ""
      },
      {
        "name": "SC_STACK_DB_NAME",
        "label": "db name",
        "description": ""
      },
      {
        "name": "SC_STACK_DB_PASSWORD",
        "label": "db password",
        "description": ""
      },
      {
        "name": "SC_STACK_WP_USER",
        "label": "wp admin user",
        "description": ""
      },
      {
        "name": "SC_STACK_WP_PASSWORD",
        "label": "wp admin password",
        "description": ""
      }
    ]
  },
  {
    "type": 2,
    "title": "Directus APP",
    "description": "Directus APP",
    "note": "The Directus 7 App is a free and open source admin GUI for managing Directus API instances",
    "categories": ["API"],
    "platform": "linux",
    "logo": "https://portainer-io-assets.sfo2.digitaloceanspaces.com/logos/wordpress.png",
    "repository": {
      "url": "https://gitlab.com/schnelle.cloud/dst001",
      "stackfile": "stacks/directus/docker-compose.yml"
    },
    "env": [
      {
        "name": "SC_STACK",
        "label": "stack name",
        "description": ""
      },
      {
        "name": "SC_STACK_DOMAIN",
        "label": "stack entrypoint domain",
        "description": ""
      },
      {
        "name": "SC_STACK_DIRECTUS_REPLICAS",
        "label": "replica amount",
        "description": ""
      },
      {
        "name": "SC_WHITELIST_SR",
        "label": "whitelist sourcerange",
        "description": ""
      }
    ]
  }
]
