<svg width="568" height="500.117" fill="none" xmlns="http://www.w3.org/2000/svg">
    <path d="M123.121 33.664C188.241 82.552 258.281 181.68 284 234.873c25.719-53.192 95.759-152.321 160.879-201.21C491.866-1.611 568-28.906 568 57.947c0 17.346-9.945 145.713-15.778 166.555-20.275 72.453-94.155 90.933-159.875 79.748 114.875 19.55 144.097 84.31 80.986 149.07-119.86 122.993-172.272-30.858-185.702-70.28-2.462-7.227-3.614-10.608-3.631-7.733-.017-2.875-1.169.506-3.631 7.733-13.43 39.422-65.842 193.273-185.702 70.28-63.111-64.76-33.889-129.52 80.986-149.07-65.72 11.185-139.6-7.295-159.875-79.748C9.945 203.659 0 75.29 0 57.946 0-28.906 76.134-1.612 123.121 33.664z" fill="#fff"/>
</svg>
