( pcb2gcode 2.0.0 )
( Software-independent Gcode )

G94 ( Millimeters per minute feed rate. )
G21 ( Units == Millimeters. )

G90 ( Absolute coordinates. )
G00 S1 ( RPM spindle speed. )
G64 P0.01000 ( set maximum deviation from commanded toolpath )
G01 F2000.00000 ( Feedrate. )


G00 Z10.00000 (Retract to tool change height)
T0
M5      (Spindle stop.)
G04 P1.00000 (Wait for spindle to stop)
(MSG, Change tool bit to mill diameter 0.40000mm)
M6      (Tool change.)
M0      (Temporary machine stop.)
M3 ( Spindle on clockwise. )
G04 P1.00000 (Wait for spindle to get up to speed)
G04 P0 ( dwell for no time -- G64 should not smooth over this point )
G00 Z2.00000 ( retract )

G00 X0.63000 Y43.60501 ( rapid move to begin. )
G01 F1000.00000
G01 Z0.00000
G04 P0 ( dwell for no time -- G64 should not smooth over this point )
G01 F2000.00000
G01 X0.63000 Y43.60501
G01 X2.45758 Y43.60501
G01 X2.46819 Y43.64001
G01 X2.45758 Y43.67501
G01 X0.63000 Y43.67501
G01 X0.63000 Y43.60501
G01 X0.43000 Y43.40501
G01 X2.62999 Y43.40501
G01 X2.63766 Y43.51306
G01 X2.68818 Y43.64001
G01 X2.63766 Y43.76699
G01 X2.62999 Y43.87501
G01 X0.43000 Y43.87501
G01 X0.43000 Y43.40501
G01 X0.23000 Y43.20501
G01 X2.82999 Y43.20501
G01 X2.82999 Y43.43503
G01 X2.84521 Y43.51156
G01 X2.91887 Y43.60133
G01 X3.02999 Y43.63503
G01 X12.93505 Y43.63503
G01 X13.01161 Y43.61979
G01 X13.07648 Y43.57643
G01 X14.24127 Y42.40623
G01 X14.27498 Y42.29511
G01 X14.27498 Y20.30501
G01 X14.28499 Y20.30501
G01 X14.28331 Y42.38228
G01 X13.01016 Y43.64501
G01 X3.02999 Y43.64501
G01 X2.91887 Y43.67872
G01 X2.84521 Y43.76848
G01 X2.82999 Y43.84501
G01 X2.82999 Y44.07501
G01 X0.23000 Y44.07501
G01 X0.23000 Y43.20501
G04 P0 ( dwell for no time -- G64 should not smooth over this point )
G00 Z2.00000 ( retract )

G00 X0.63000 Y41.06501 ( rapid move to begin. )
G01 F1000.00000
G01 Z0.00000
G04 P0 ( dwell for no time -- G64 should not smooth over this point )
G01 F2000.00000
G01 X0.63000 Y41.06501
G01 X2.45758 Y41.06501
G01 X2.46819 Y41.10001
G01 X2.45758 Y41.13501
G01 X0.63000 Y41.13501
G01 X0.63000 Y41.06501
G01 X0.43000 Y40.86501
G01 X2.62999 Y40.86501
G01 X2.63766 Y40.97306
G01 X2.68818 Y41.10001
G01 X2.63766 Y41.22699
G01 X2.62999 Y41.33501
G01 X0.43000 Y41.33501
G01 X0.43000 Y40.86501
G01 X0.23000 Y40.66501
G01 X2.82999 Y40.66501
G01 X2.82999 Y40.89503
G01 X2.84521 Y40.97156
G01 X2.91887 Y41.06133
G01 X3.02999 Y41.09503
G01 X12.27506 Y41.09503
G01 X12.35161 Y41.07979
G01 X12.41649 Y41.03643
G01 X13.59129 Y39.85622
G01 X13.62499 Y39.74510
G01 X13.63497 Y20.30501
G01 X13.63335 Y39.83227
G01 X12.35014 Y41.10501
G01 X3.02999 Y41.10501
G01 X2.91887 Y41.13872
G01 X2.84521 Y41.22848
G01 X2.82999 Y41.30501
G01 X2.82999 Y41.53501
G01 X0.23000 Y41.53501
G01 X0.23000 Y40.66501
G04 P0 ( dwell for no time -- G64 should not smooth over this point )
G00 Z2.00000 ( retract )

G00 X0.63000 Y38.52501 ( rapid move to begin. )
G01 F1000.00000
G01 Z0.00000
G04 P0 ( dwell for no time -- G64 should not smooth over this point )
G01 F2000.00000
G01 X0.63000 Y38.52501
G01 X2.45758 Y38.52501
G01 X2.46819 Y38.56004
G01 X2.45758 Y38.59501
G01 X0.63000 Y38.59501
G01 X0.63000 Y38.52501
G01 X0.43000 Y38.32501
G01 X2.62999 Y38.32501
G01 X2.63766 Y38.43306
G01 X2.68818 Y38.56004
G01 X2.63766 Y38.68699
G01 X2.62999 Y38.79504
G01 X0.43000 Y38.79504
G01 X0.43000 Y38.32501
G01 X0.23000 Y38.12501
G01 X2.82999 Y38.12501
G01 X2.82999 Y38.35503
G01 X2.84521 Y38.43156
G01 X2.91887 Y38.52133
G01 X3.02999 Y38.55503
G01 X10.35408 Y38.55117
G01 X10.45647 Y38.49643
G01 X12.94127 Y36.00622
G01 X12.97498 Y35.89509
G01 X12.97498 Y20.30501
G01 X12.98499 Y20.30501
G01 X12.98331 Y35.98227
G01 X10.40077 Y38.56397
G01 X3.02999 Y38.56501
G01 X2.91887 Y38.59875
G01 X2.84521 Y38.68848
G01 X2.82999 Y38.76504
G01 X2.82999 Y38.99501
G01 X0.23000 Y38.99501
G01 X0.23000 Y38.12501
G04 P0 ( dwell for no time -- G64 should not smooth over this point )
G00 Z2.00000 ( retract )

G00 X0.63000 Y35.98501 ( rapid move to begin. )
G01 F1000.00000
G01 Z0.00000
G04 P0 ( dwell for no time -- G64 should not smooth over this point )
G01 F2000.00000
G01 X0.63000 Y35.98501
G01 X2.45758 Y35.98501
G01 X2.46819 Y36.02001
G01 X2.45758 Y36.05501
G01 X0.63000 Y36.05501
G01 X0.63000 Y35.98501
G01 X0.43000 Y35.78501
G01 X2.62999 Y35.78501
G01 X2.63766 Y35.89306
G01 X2.68818 Y36.02001
G01 X2.63766 Y36.14699
G01 X2.62999 Y36.25501
G01 X0.43000 Y36.25501
G01 X0.43000 Y35.78501
G01 X0.23000 Y35.58501
G01 X2.82999 Y35.58501
G01 X2.82999 Y35.81503
G01 X2.84521 Y35.89156
G01 X2.91887 Y35.98133
G01 X3.02999 Y36.01503
G01 X10.85505 Y36.01503
G01 X10.93160 Y35.99979
G01 X10.99647 Y35.95643
G01 X12.29126 Y34.65623
G01 X12.32499 Y34.54511
G01 X12.33498 Y20.30501
G01 X12.33333 Y34.63226
G01 X10.94077 Y36.02397
G01 X3.02999 Y36.02501
G01 X2.91887 Y36.05872
G01 X2.84521 Y36.14848
G01 X2.82999 Y36.22501
G01 X2.82999 Y36.45501
G01 X0.23000 Y36.45501
G01 X0.23000 Y35.58501
G04 P0 ( dwell for no time -- G64 should not smooth over this point )
G00 Z2.00000 ( retract )

G00 X0.63000 Y33.44501 ( rapid move to begin. )
G01 F1000.00000
G01 Z0.00000
G04 P0 ( dwell for no time -- G64 should not smooth over this point )
G01 F2000.00000
G01 X0.63000 Y33.44501
G01 X2.45758 Y33.44501
G01 X2.46819 Y33.48001
G01 X2.45758 Y33.51501
G01 X0.63000 Y33.51501
G01 X0.63000 Y33.44501
G01 X0.43000 Y33.24501
G01 X2.62999 Y33.24501
G01 X2.63766 Y33.35306
G01 X2.68818 Y33.48001
G01 X2.63766 Y33.60699
G01 X2.62999 Y33.71501
G01 X0.43000 Y33.71501
G01 X0.43000 Y33.24501
G01 X0.23000 Y33.04501
G01 X2.82999 Y33.04501
G01 X2.82999 Y33.27503
G01 X2.84521 Y33.35156
G01 X2.91887 Y33.44133
G01 X3.02999 Y33.47503
G01 X10.69505 Y33.47503
G01 X10.77161 Y33.45979
G01 X10.83648 Y33.41643
G01 X11.61639 Y32.63655
G01 X11.65974 Y32.57171
G01 X11.67498 Y32.49513
G01 X11.67498 Y20.30501
G01 X11.68499 Y20.30501
G01 X11.67656 Y32.59053
G01 X10.77013 Y33.48501
G01 X3.02999 Y33.48501
G01 X2.91887 Y33.51872
G01 X2.84521 Y33.60848
G01 X2.82999 Y33.68501
G01 X2.82999 Y33.91501
G01 X0.23000 Y33.91501
G01 X0.23000 Y33.04501
G04 P0 ( dwell for no time -- G64 should not smooth over this point )
G00 Z2.00000 ( retract )

G00 X0.63000 Y30.90501 ( rapid move to begin. )
G01 F1000.00000
G01 Z0.00000
G04 P0 ( dwell for no time -- G64 should not smooth over this point )
G01 F2000.00000
G01 X0.63000 Y30.90501
G01 X2.45758 Y30.90501
G01 X2.46819 Y30.94001
G01 X2.45758 Y30.97501
G01 X0.63000 Y30.97501
G01 X0.63000 Y30.90501
G01 X0.43000 Y30.70501
G01 X2.62999 Y30.70501
G01 X2.63766 Y30.81306
G01 X2.68818 Y30.94001
G01 X2.63766 Y31.06699
G01 X2.62999 Y31.17501
G01 X0.43000 Y31.17501
G01 X0.43000 Y30.70501
G01 X0.23000 Y30.50501
G01 X2.82999 Y30.50501
G01 X2.82999 Y30.73503
G01 X2.84521 Y30.81156
G01 X2.91887 Y30.90133
G01 X3.02999 Y30.93503
G01 X9.83506 Y30.93503
G01 X9.91161 Y30.91979
G01 X9.97649 Y30.87643
G01 X10.96637 Y29.88652
G01 X11.02111 Y29.78413
G01 X11.03498 Y20.30501
G01 X11.02655 Y29.84052
G01 X9.92076 Y30.94397
G01 X3.02999 Y30.94501
G01 X2.91887 Y30.97872
G01 X2.84521 Y31.06848
G01 X2.82999 Y31.14501
G01 X2.82999 Y31.37501
G01 X0.23000 Y31.37501
G01 X0.23000 Y30.50501
G04 P0 ( dwell for no time -- G64 should not smooth over this point )
G00 Z2.00000 ( retract )

G00 X0.63000 Y28.26501 ( rapid move to begin. )
G01 F1000.00000
G01 Z0.00000
G04 P0 ( dwell for no time -- G64 should not smooth over this point )
G01 F2000.00000
G01 X0.63000 Y28.26501
G01 X2.45758 Y28.26501
G01 X2.46819 Y28.30004
G01 X2.45758 Y28.33501
G01 X0.63000 Y28.33501
G01 X0.63000 Y28.26501
G01 X0.43000 Y28.06501
G01 X2.62999 Y28.06501
G01 X2.63766 Y28.17306
G01 X2.68818 Y28.30004
G01 X2.63766 Y28.42699
G01 X2.62999 Y28.53501
G01 X0.43000 Y28.53501
G01 X0.43000 Y28.06501
G01 X0.23000 Y27.86501
G01 X2.82999 Y27.86501
G01 X2.82999 Y28.09503
G01 X2.84521 Y28.17156
G01 X2.91887 Y28.26133
G01 X3.02999 Y28.29503
G01 X9.77506 Y28.29503
G01 X9.88616 Y28.26133
G01 X10.31639 Y27.83654
G01 X10.35975 Y27.77167
G01 X10.37499 Y27.69511
G01 X10.37499 Y20.30501
G01 X10.38499 Y20.30501
G01 X10.38497 Y27.77019
G01 X9.86221 Y28.30339
G01 X3.02999 Y28.30502
G01 X2.91887 Y28.33872
G01 X2.84521 Y28.42848
G01 X2.82999 Y28.50501
G01 X2.82999 Y28.73501
G01 X0.23000 Y28.73501
G01 X0.23000 Y27.86501
G04 P0 ( dwell for no time -- G64 should not smooth over this point )
G00 Z2.00000 ( retract )

G00 X0.63000 Y25.76501 ( rapid move to begin. )
G01 F1000.00000
G01 Z0.00000
G04 P0 ( dwell for no time -- G64 should not smooth over this point )
G01 F2000.00000
G01 X0.63000 Y25.76501
G01 X2.45758 Y25.76501
G01 X2.46819 Y25.80002
G01 X2.45758 Y25.83502
G01 X0.63000 Y25.83502
G01 X0.63000 Y25.76501
G01 X0.43000 Y25.56502
G01 X2.62999 Y25.56502
G01 X2.63766 Y25.67307
G01 X2.68818 Y25.80004
G01 X2.63766 Y25.92699
G01 X2.62999 Y26.03502
G01 X0.43000 Y26.03502
G01 X0.43000 Y25.56502
G01 X0.23000 Y25.36502
G01 X2.82999 Y25.36502
G01 X2.82999 Y25.59504
G01 X2.84521 Y25.67157
G01 X2.91887 Y25.76133
G01 X3.02999 Y25.79504
G01 X9.52497 Y25.79504
G01 X9.60151 Y25.77980
G01 X9.69127 Y25.70614
G01 X9.72497 Y25.59504
G01 X9.72497 Y20.30501
G01 X9.73498 Y20.30501
G01 X9.73191 Y25.83342
G01 X9.62398 Y25.80502
G01 X3.02999 Y25.80502
G01 X2.91887 Y25.83873
G01 X2.84521 Y25.92849
G01 X2.82999 Y26.00502
G01 X2.82999 Y26.23502
G01 X0.23000 Y26.23502
G01 X0.23000 Y25.36502
G04 P0 ( dwell for no time -- G64 should not smooth over this point )
G00 Z2.00000 ( retract )

G00 X0.63000 Y23.22501 ( rapid move to begin. )
G01 F1000.00000
G01 Z0.00000
G04 P0 ( dwell for no time -- G64 should not smooth over this point )
G01 F2000.00000
G01 X0.63000 Y23.22501
G01 X2.45758 Y23.22501
G01 X2.46819 Y23.26004
G01 X2.45758 Y23.29502
G01 X0.63000 Y23.29502
G01 X0.63000 Y23.22501
G01 X0.43000 Y23.02502
G01 X2.62999 Y23.02502
G01 X2.63766 Y23.13307
G01 X2.68818 Y23.26004
G01 X2.63766 Y23.38699
G01 X2.62999 Y23.49502
G01 X0.43000 Y23.49502
G01 X0.43000 Y23.02502
G01 X0.23000 Y22.82502
G01 X2.82999 Y22.82502
G01 X2.82999 Y23.05504
G01 X2.84521 Y23.13157
G01 X2.91887 Y23.22133
G01 X3.02999 Y23.25504
G01 X8.91400 Y23.25118
G01 X8.98609 Y23.22133
G01 X9.04128 Y23.16614
G01 X9.07499 Y23.05504
G01 X9.07499 Y20.30501
G01 X9.08500 Y20.30501
G01 X9.08497 Y23.17020
G01 X9.00151 Y23.26375
G01 X3.02999 Y23.26502
G01 X2.91887 Y23.29873
G01 X2.84521 Y23.38849
G01 X2.82999 Y23.46502
G01 X2.82999 Y23.69502
G01 X0.23000 Y23.69502
G01 X0.23000 Y22.82502
G04 P0 ( dwell for no time -- G64 should not smooth over this point )
G00 Z2.00000 ( retract )

G00 X0.63000 Y20.68501 ( rapid move to begin. )
G01 F1000.00000
G01 Z0.00000
G04 P0 ( dwell for no time -- G64 should not smooth over this point )
G01 F2000.00000
G01 X0.63000 Y20.68501
G01 X2.43589 Y20.68501
G01 X2.44544 Y20.75502
G01 X0.63000 Y20.75502
G01 X0.63000 Y20.68501
G01 X0.43000 Y20.48502
G01 X2.62999 Y20.48502
G01 X2.63766 Y20.70307
G01 X2.68818 Y20.83002
G01 X2.63827 Y20.95502
G01 X0.43000 Y20.95502
G01 X0.43000 Y20.48502
G01 X0.23000 Y20.28502
G01 X2.82999 Y20.28502
G01 X2.82999 Y20.62505
G01 X2.84521 Y20.70158
G01 X2.91887 Y20.79134
G01 X3.02999 Y20.82505
G01 X8.22498 Y20.82505
G01 X8.33610 Y20.79134
G01 X8.40976 Y20.70158
G01 X8.42498 Y20.62505
G01 X8.42498 Y20.30501
G01 X8.43498 Y20.30501
G01 X8.43498 Y21.35502
G01 X8.42498 Y21.35502
G01 X8.42498 Y21.03503
G01 X8.40976 Y20.95850
G01 X8.33610 Y20.86873
G01 X8.22498 Y20.83503
G01 X3.02999 Y20.83503
G01 X2.91887 Y20.86873
G01 X2.86370 Y20.92393
G01 X2.83383 Y20.99601
G01 X2.82999 Y21.15502
G01 X0.23000 Y21.15502
G01 X0.23000 Y20.28502
G04 P0 ( dwell for no time -- G64 should not smooth over this point )
G00 Z2.00000 ( retract )

G00 X0.63000 Y18.14501 ( rapid move to begin. )
G01 F1000.00000
G01 Z0.00000
G04 P0 ( dwell for no time -- G64 should not smooth over this point )
G01 F2000.00000
G01 X0.63000 Y18.14501
G01 X2.45758 Y18.14501
G01 X2.46819 Y18.18002
G01 X2.45758 Y18.21502
G01 X0.63000 Y18.21502
G01 X0.63000 Y18.14501
G01 X0.43000 Y17.94502
G01 X2.62999 Y17.94502
G01 X2.63766 Y18.05307
G01 X2.68818 Y18.18002
G01 X2.63766 Y18.30699
G01 X2.62999 Y18.41502
G01 X0.43000 Y18.41502
G01 X0.43000 Y17.94502
G01 X0.23000 Y17.74502
G01 X2.82999 Y17.74502
G01 X2.82999 Y17.97504
G01 X2.84521 Y18.05157
G01 X2.91887 Y18.14133
G01 X3.02999 Y18.17504
G01 X7.34505 Y18.17504
G01 X7.42160 Y18.15980
G01 X7.48647 Y18.11644
G01 X8.36638 Y17.23653
G01 X8.42112 Y17.13415
G01 X8.42498 Y14.40502
G01 X8.43498 Y14.40502
G01 X8.43392 Y17.18083
G01 X7.43151 Y18.18375
G01 X3.02999 Y18.18502
G01 X2.91887 Y18.21873
G01 X2.84521 Y18.30849
G01 X2.82999 Y18.38502
G01 X2.82999 Y18.61502
G01 X0.23000 Y18.61502
G01 X0.23000 Y17.74502
G04 P0 ( dwell for no time -- G64 should not smooth over this point )
G00 Z2.00000 ( retract )

G00 X0.63000 Y15.60502 ( rapid move to begin. )
G01 F1000.00000
G01 Z0.00000
G04 P0 ( dwell for no time -- G64 should not smooth over this point )
G01 F2000.00000
G01 X0.63000 Y15.60502
G01 X2.45758 Y15.60502
G01 X2.46819 Y15.64004
G01 X2.45758 Y15.67502
G01 X0.63000 Y15.67502
G01 X0.63000 Y15.60502
G01 X0.43000 Y15.40502
G01 X2.62999 Y15.40502
G01 X2.63766 Y15.51307
G01 X2.68818 Y15.64002
G01 X2.63766 Y15.76699
G01 X2.62999 Y15.87502
G01 X0.43000 Y15.87502
G01 X0.43000 Y15.40502
G01 X0.23000 Y15.20502
G01 X2.82999 Y15.20502
G01 X2.83383 Y15.47405
G01 X2.88856 Y15.57644
G01 X2.99098 Y15.63118
G01 X3.19504 Y15.63504
G01 X3.27160 Y15.61980
G01 X3.33647 Y15.57644
G01 X5.68919 Y13.22608
G01 X8.35574 Y13.22608
G01 X9.08393 Y13.95424
G01 X9.08500 Y15.45500
G01 X9.07499 Y15.45500
G01 X9.07499 Y14.03994
G01 X9.05975 Y13.96339
G01 X9.01639 Y13.89852
G01 X8.38116 Y13.26872
G01 X8.27006 Y13.23502
G01 X5.77489 Y13.23502
G01 X5.69834 Y13.25026
G01 X5.63347 Y13.29362
G01 X3.29042 Y15.63664
G01 X2.99098 Y15.64888
G01 X2.88856 Y15.70362
G01 X2.83383 Y15.80601
G01 X2.82999 Y16.07502
G01 X0.23000 Y16.07502
G01 X0.23000 Y15.20502
G04 P0 ( dwell for no time -- G64 should not smooth over this point )
G00 Z2.00000 ( retract )

G00 X0.63000 Y13.06501 ( rapid move to begin. )
G01 F1000.00000
G01 Z0.00000
G04 P0 ( dwell for no time -- G64 should not smooth over this point )
G01 F2000.00000
G01 X0.63000 Y13.06501
G01 X2.45758 Y13.06501
G01 X2.46819 Y13.10004
G01 X2.45758 Y13.13502
G01 X0.63000 Y13.13502
G01 X0.63000 Y13.06501
G01 X0.43000 Y12.86502
G01 X2.62999 Y12.86502
G01 X2.63766 Y12.97307
G01 X2.68818 Y13.10004
G01 X2.63766 Y13.22699
G01 X2.62999 Y13.33502
G01 X0.43000 Y13.33502
G01 X0.43000 Y12.86502
G01 X0.23000 Y12.66502
G01 X2.82999 Y12.66502
G01 X2.83383 Y12.93405
G01 X2.88856 Y13.03644
G01 X2.99098 Y13.09118
G01 X3.19504 Y13.09504
G01 X3.27160 Y13.07980
G01 X3.33647 Y13.03644
G01 X3.94917 Y12.42608
G01 X9.33077 Y12.42608
G01 X9.73392 Y12.82925
G01 X9.73498 Y15.45500
G01 X9.72497 Y15.45500
G01 X9.72111 Y12.87591
G01 X9.66638 Y12.77352
G01 X9.38647 Y12.49362
G01 X9.28408 Y12.43888
G01 X3.99585 Y12.43888
G01 X3.89346 Y12.49362
G01 X3.28221 Y13.10337
G01 X2.99098 Y13.10888
G01 X2.88856 Y13.16362
G01 X2.83383 Y13.26601
G01 X2.82999 Y13.53502
G01 X0.23000 Y13.53502
G01 X0.23000 Y12.66502
G04 P0 ( dwell for no time -- G64 should not smooth over this point )
G00 Z2.00000 ( retract )

G00 X0.63000 Y10.52502 ( rapid move to begin. )
G01 F1000.00000
G01 Z0.00000
G04 P0 ( dwell for no time -- G64 should not smooth over this point )
G01 F2000.00000
G01 X0.63000 Y10.52502
G01 X2.45758 Y10.52502
G01 X2.46819 Y10.56004
G01 X2.45758 Y10.59502
G01 X0.63000 Y10.59502
G01 X0.63000 Y10.52502
G01 X0.43000 Y10.32502
G01 X2.62999 Y10.32502
G01 X2.63766 Y10.43307
G01 X2.68818 Y10.56004
G01 X2.63766 Y10.68699
G01 X2.62999 Y10.79502
G01 X0.43000 Y10.79502
G01 X0.43000 Y10.32502
G01 X0.23000 Y10.12502
G01 X2.82999 Y10.12502
G01 X2.82999 Y10.35504
G01 X2.84521 Y10.43157
G01 X2.91887 Y10.52133
G01 X3.02999 Y10.55504
G01 X8.66221 Y10.55666
G01 X10.38370 Y12.27848
G01 X10.38499 Y15.45500
G01 X10.37499 Y15.45500
G01 X10.37499 Y12.36494
G01 X10.35975 Y12.28838
G01 X10.31639 Y12.22351
G01 X8.71647 Y10.62362
G01 X8.65160 Y10.58026
G01 X8.57504 Y10.56502
G01 X3.02999 Y10.56502
G01 X2.91887 Y10.59873
G01 X2.84521 Y10.68849
G01 X2.82999 Y10.76502
G01 X2.82999 Y10.99502
G01 X0.23000 Y10.99502
G01 X0.23000 Y10.12502
G04 P0 ( dwell for no time -- G64 should not smooth over this point )
G00 Z2.00000 ( retract )

G00 X0.63000 Y7.98502 ( rapid move to begin. )
G01 F1000.00000
G01 Z0.00000
G04 P0 ( dwell for no time -- G64 should not smooth over this point )
G01 F2000.00000
G01 X0.63000 Y7.98502
G01 X2.42999 Y7.98502
G01 X2.42999 Y8.05502
G01 X0.63000 Y8.05502
G01 X0.63000 Y7.98502
G01 X0.43000 Y7.78502
G01 X2.62999 Y7.78502
G01 X2.62999 Y8.25502
G01 X0.43000 Y8.25502
G01 X0.43000 Y7.78502
G01 X0.23000 Y7.58502
G01 X2.82999 Y7.58502
G01 X2.82999 Y8.45502
G01 X0.23000 Y8.45502
G01 X0.23000 Y7.58502
G04 P0 ( dwell for no time -- G64 should not smooth over this point )
G00 Z2.00000 ( retract )

G00 X0.63000 Y5.44501 ( rapid move to begin. )
G01 F1000.00000
G01 Z0.00000
G04 P0 ( dwell for no time -- G64 should not smooth over this point )
G01 F2000.00000
G01 X0.63000 Y5.44501
G01 X2.45758 Y5.44501
G01 X2.46819 Y5.48002
G01 X2.45758 Y5.51502
G01 X0.63000 Y5.51502
G01 X0.63000 Y5.44501
G01 X0.43000 Y5.24502
G01 X2.62999 Y5.24502
G01 X2.63766 Y5.35307
G01 X2.68818 Y5.48004
G01 X2.63766 Y5.60699
G01 X2.62999 Y5.71502
G01 X0.43000 Y5.71502
G01 X0.43000 Y5.24502
G01 X0.23000 Y5.04502
G01 X2.82999 Y5.04502
G01 X2.82999 Y5.27504
G01 X2.84521 Y5.35157
G01 X2.91887 Y5.44133
G01 X2.99098 Y5.47118
G01 X5.38152 Y5.47631
G01 X7.57347 Y7.66645
G01 X7.67585 Y7.72119
G01 X12.16401 Y7.72119
G01 X12.23609 Y7.69134
G01 X12.29126 Y7.63615
G01 X12.32499 Y7.52505
G01 X12.32499 Y4.15495
G01 X12.29126 Y4.04382
G01 X11.68646 Y3.43361
G01 X11.62159 Y3.39026
G01 X11.54506 Y3.37502
G01 X11.34097 Y3.37888
G01 X11.26886 Y3.40872
G01 X11.21369 Y3.46392
G01 X11.17999 Y3.57502
G01 X11.17999 Y3.97001
G01 X10.07999 Y3.97001
G01 X10.07999 Y2.77001
G01 X11.17999 Y2.77001
G01 X11.18382 Y3.20405
G01 X11.23856 Y3.30644
G01 X11.34097 Y3.36117
G01 X11.63221 Y3.36666
G01 X12.33391 Y4.06925
G01 X12.33498 Y9.45004
G01 X12.35019 Y9.52657
G01 X12.42385 Y9.61633
G01 X12.49596 Y9.64617
G01 X13.55499 Y9.65004
G01 X13.66609 Y9.61633
G01 X13.72128 Y9.56114
G01 X13.75115 Y9.48905
G01 X13.75667 Y9.36040
G01 X13.78676 Y9.33160
G01 X14.25296 Y9.33005
G01 X14.28709 Y9.33815
G01 X14.30388 Y9.36909
G01 X14.30498 Y9.93292
G01 X14.27775 Y9.97630
G01 X13.77851 Y9.97627
G01 X13.75753 Y9.95313
G01 X13.75077 Y9.81915
G01 X13.72052 Y9.74780
G01 X13.66543 Y9.69329
G01 X13.59375 Y9.66383
G01 X12.53495 Y9.66002
G01 X12.42385 Y9.69372
G01 X12.35019 Y9.78349
G01 X12.33498 Y9.86002
G01 X12.33498 Y15.45500
G01 X12.32499 Y7.93503
G01 X12.30975 Y7.85850
G01 X12.26640 Y7.79363
G01 X12.20153 Y7.75027
G01 X12.12500 Y7.73503
G01 X7.62843 Y7.73376
G01 X5.43649 Y5.54362
G01 X5.33410 Y5.48888
G01 X2.99098 Y5.48888
G01 X2.91887 Y5.51873
G01 X2.84521 Y5.60849
G01 X2.82999 Y5.68502
G01 X2.82999 Y5.91502
G01 X0.23000 Y5.91502
G01 X0.23000 Y5.04502
G04 P0 ( dwell for no time -- G64 should not smooth over this point )
G00 Z2.00000 ( retract )

G00 X0.63000 Y2.90502 ( rapid move to begin. )
G01 F1000.00000
G01 Z0.00000
G04 P0 ( dwell for no time -- G64 should not smooth over this point )
G01 F2000.00000
G01 X0.63000 Y2.90502
G01 X2.45758 Y2.90502
G01 X2.46819 Y2.94002
G01 X2.45758 Y2.97502
G01 X0.63000 Y2.97502
G01 X0.63000 Y2.90502
G01 X0.43000 Y2.70502
G01 X2.62999 Y2.70502
G01 X2.63766 Y2.81307
G01 X2.68818 Y2.94004
G01 X2.63766 Y3.06699
G01 X2.62999 Y3.17502
G01 X0.43000 Y3.17502
G01 X0.43000 Y2.70502
G01 X0.23000 Y2.50502
G01 X2.82999 Y2.50502
G01 X2.82999 Y2.73504
G01 X2.84521 Y2.81157
G01 X2.91887 Y2.90133
G01 X2.99098 Y2.93118
G01 X5.07408 Y2.93118
G01 X5.17647 Y2.87644
G01 X7.22772 Y0.82666
G01 X7.71901 Y0.82117
G01 X7.82140 Y0.76644
G01 X7.87613 Y0.66405
G01 X7.87999 Y0.23001
G01 X8.97999 Y0.23001
G01 X8.98383 Y0.66405
G01 X9.01370 Y0.73613
G01 X9.06887 Y0.79133
G01 X9.17999 Y0.82503
G01 X9.87999 Y0.82503
G01 X9.99109 Y0.79133
G01 X10.06475 Y0.70156
G01 X10.07999 Y0.62503
G01 X10.07999 Y0.23001
G01 X11.17999 Y0.23001
G01 X11.18382 Y0.66405
G01 X11.23856 Y0.76644
G01 X11.34097 Y0.82117
G01 X11.64046 Y0.83344
G01 X15.63393 Y4.82924
G01 X15.63393 Y12.43080
G01 X15.03223 Y13.03337
G01 X14.63990 Y13.03502
G01 X14.52877 Y13.06872
G01 X13.66868 Y13.92882
G01 X13.63497 Y14.03994
G01 X13.63497 Y15.45500
G01 X13.62664 Y13.95277
G01 X14.55273 Y13.02669
G01 X14.94506 Y13.02504
G01 X15.05618 Y12.99133
G01 X15.56639 Y12.48653
G01 X15.62113 Y12.38414
G01 X15.62113 Y4.87590
G01 X15.56639 Y4.77352
G01 X11.68646 Y0.89361
G01 X11.62159 Y0.85026
G01 X11.54506 Y0.83502
G01 X11.34097 Y0.83888
G01 X11.23856 Y0.89359
G01 X11.18382 Y0.99600
G01 X11.17999 Y1.43001
G01 X10.07999 Y1.43001
G01 X10.07615 Y0.99600
G01 X10.04628 Y0.92392
G01 X9.99109 Y0.86872
G01 X9.87999 Y0.83502
G01 X9.17999 Y0.83502
G01 X9.06887 Y0.86872
G01 X8.99521 Y0.95849
G01 X8.97999 Y1.03502
G01 X8.97999 Y1.43001
G01 X7.87999 Y1.43001
G01 X7.87613 Y0.99600
G01 X7.82140 Y0.89361
G01 X7.71901 Y0.83888
G01 X7.27586 Y0.83888
G01 X7.17347 Y0.89361
G01 X5.12222 Y2.94339
G01 X2.99098 Y2.94888
G01 X2.91887 Y2.97873
G01 X2.84521 Y3.06849
G01 X2.82999 Y3.14502
G01 X2.82999 Y3.37502
G01 X0.23000 Y3.37502
G01 X0.23000 Y2.50502
G04 P0 ( dwell for no time -- G64 should not smooth over this point )
G00 Z2.00000 ( retract )

G00 X8.02178 Y0.83004 ( rapid move to begin. )
G01 F1000.00000
G01 Z0.00000
G04 P0 ( dwell for no time -- G64 should not smooth over this point )
G01 F2000.00000
G01 X8.02178 Y0.83004
G01 X8.07230 Y0.70306
G01 X8.07999 Y0.43001
G01 X8.77999 Y0.43001
G01 X8.78766 Y0.70306
G01 X8.83818 Y0.83001
G01 X8.61820 Y0.83001
G01 X8.58048 Y0.63001
G01 X8.27949 Y0.63001
G01 X8.24177 Y0.83001
G01 X8.02178 Y0.83004
G01 X8.07230 Y0.95699
G01 X8.07999 Y1.23001
G01 X8.77999 Y1.23001
G01 X8.78766 Y0.95699
G01 X8.83816 Y0.83001
G04 P0 ( dwell for no time -- G64 should not smooth over this point )
G00 Z2.00000 ( retract )

G00 X8.61817 Y0.83001 ( rapid move to begin. )
G01 F1000.00000
G01 Z0.00000
G04 P0 ( dwell for no time -- G64 should not smooth over this point )
G01 F2000.00000
G01 X8.61817 Y0.83001
G01 X8.24177 Y0.83001
G01 X8.27949 Y1.03001
G01 X8.58048 Y1.03001
G01 X8.61820 Y0.83001
G04 P0 ( dwell for no time -- G64 should not smooth over this point )
G00 Z2.00000 ( retract )

G00 X8.83818 Y0.83001 ( rapid move to begin. )
G01 F1000.00000
G01 Z0.00000
G04 P0 ( dwell for no time -- G64 should not smooth over this point )
G01 F2000.00000
G01 X8.83818 Y0.83001
G01 X10.22177 Y0.83001
G01 X10.27229 Y0.70306
G01 X10.27999 Y0.43001
G01 X10.97999 Y0.43001
G01 X10.98768 Y0.70306
G01 X11.03818 Y0.83001
G01 X10.98768 Y0.95699
G01 X10.97999 Y1.23001
G01 X10.27999 Y1.23001
G01 X10.27229 Y0.95699
G01 X10.22177 Y0.83001
G01 X10.44179 Y0.83001
G01 X10.47948 Y1.03001
G01 X10.78047 Y1.03001
G01 X10.81819 Y0.83004
G01 X10.78047 Y0.63001
G01 X10.47951 Y0.63001
G01 X10.44179 Y0.83001
G04 P0 ( dwell for no time -- G64 should not smooth over this point )
G00 Z2.00000 ( retract )

G00 X7.87999 Y2.77001 ( rapid move to begin. )
G01 F1000.00000
G01 Z0.00000
G04 P0 ( dwell for no time -- G64 should not smooth over this point )
G01 F2000.00000
G01 X7.87999 Y2.77001
G01 X7.87999 Y3.97001
G01 X8.26399 Y3.97385
G01 X8.36638 Y4.02858
G01 X8.40974 Y4.09348
G01 X8.42498 Y4.17001
G01 X8.42663 Y5.20727
G01 X9.55274 Y6.33335
G01 X10.03059 Y6.33937
G01 X10.10656 Y6.37321
G01 X10.19691 Y6.47783
G01 X10.26853 Y6.51918
G01 X10.35078 Y6.52782
G01 X10.42944 Y6.50226
G01 X10.49089 Y6.44694
G01 X10.52888 Y6.33000
G01 X10.49089 Y6.21311
G01 X10.39147 Y6.14085
G01 X10.30920 Y6.13221
G01 X10.23054 Y6.15776
G01 X10.10656 Y6.28682
G01 X10.03056 Y6.32065
G01 X9.63991 Y6.32502
G01 X9.52878 Y6.29132
G01 X8.49356 Y5.26153
G01 X8.45020 Y5.19665
G01 X8.43496 Y5.12010
G01 X8.43496 Y4.17001
G01 X8.45020 Y4.09348
G01 X8.49356 Y4.02858
G01 X8.59594 Y3.97385
G01 X8.97999 Y3.97001
G01 X8.97999 Y2.77001
G01 X7.87999 Y2.77001
G01 X8.07999 Y2.97001
G01 X8.07999 Y3.77001
G01 X8.30301 Y3.77771
G01 X8.42996 Y3.82820
G01 X8.55693 Y3.77771
G01 X8.77999 Y3.77001
G01 X8.77999 Y2.97001
G01 X8.07999 Y2.97001
G01 X8.27999 Y3.17001
G01 X8.27999 Y3.57542
G01 X8.42996 Y3.60821
G01 X8.57999 Y3.57542
G01 X8.57999 Y3.17001
G01 X8.27999 Y3.17001
G04 P0 ( dwell for no time -- G64 should not smooth over this point )
G00 Z2.00000 ( retract )

G00 X10.27999 Y2.97001 ( rapid move to begin. )
G01 F1000.00000
G01 Z0.00000
G04 P0 ( dwell for no time -- G64 should not smooth over this point )
G01 F2000.00000
G01 X10.27999 Y2.97001
G01 X10.27999 Y3.77001
G01 X10.97999 Y3.77001
G01 X10.98766 Y3.49699
G01 X11.03818 Y3.37001
G01 X10.98766 Y3.24306
G01 X10.97999 Y2.97001
G01 X10.27999 Y2.97001
G01 X10.47999 Y3.17001
G01 X10.47999 Y3.57001
G01 X10.78047 Y3.57001
G01 X10.81819 Y3.37001
G01 X10.78047 Y3.17001
G01 X10.47999 Y3.17001
G04 P0 ( dwell for no time -- G64 should not smooth over this point )
G00 Z2.00000 ( retract )

G00 X10.13110 Y9.13002 ( rapid move to begin. )
G01 F1000.00000
G01 Z0.00000
G04 P0 ( dwell for no time -- G64 should not smooth over this point )
G01 F2000.00000
G01 X10.13110 Y9.13002
G01 X10.14829 Y9.21092
G01 X10.19691 Y9.27782
G01 X10.33762 Y9.34915
G01 X10.41004 Y9.43853
G01 X10.42497 Y9.51437
G01 X10.42660 Y9.75725
G01 X10.96637 Y10.29852
G01 X11.02111 Y10.40091
G01 X11.03498 Y15.45500
G01 X11.03391 Y10.35425
G01 X10.49355 Y9.81153
G01 X10.45020 Y9.74666
G01 X10.43496 Y9.67010
G01 X10.43831 Y9.34938
G01 X10.51169 Y9.21092
G01 X10.52888 Y9.13002
G01 X10.49089 Y9.01311
G01 X10.39145 Y8.94084
G01 X10.26853 Y8.94084
G01 X10.16907 Y9.01311
G01 X10.13110 Y9.13002
G04 P0 ( dwell for no time -- G64 should not smooth over this point )
G00 Z2.00000 ( retract )

G00 X12.97498 Y11.98986 ( rapid move to begin. )
G01 F1000.00000
G01 Z0.00000
G04 P0 ( dwell for no time -- G64 should not smooth over this point )
G01 F2000.00000
G01 X12.97498 Y11.98986
G01 X12.97498 Y15.45500
G01 X12.98499 Y15.45500
G01 X12.98882 Y12.02593
G01 X13.04356 Y11.92351
G01 X13.41369 Y11.55338
G01 X13.52121 Y11.49771
G01 X13.60261 Y11.50055
G01 X13.67612 Y11.53558
G01 X13.72956 Y11.59705
G01 X13.75730 Y11.70175
G01 X13.78537 Y11.72834
G01 X14.28011 Y11.72664
G01 X14.30383 Y11.69611
G01 X14.29685 Y11.09791
G01 X14.25768 Y11.08000
G01 X13.77287 Y11.08816
G01 X13.75585 Y11.11996
G01 X13.75019 Y11.24361
G01 X13.71572 Y11.31904
G01 X13.65364 Y11.37401
G01 X13.54450 Y11.40845
G01 X12.97498 Y11.98986
G04 P0 ( dwell for no time -- G64 should not smooth over this point )
G00 Z2.00000 ( retract )

G00 X13.86769 Y11.44762 ( rapid move to begin. )
G01 F1000.00000
G01 Z0.00000
G04 P0 ( dwell for no time -- G64 should not smooth over this point )
G01 F2000.00000
G01 X13.86769 Y11.44762
G01 X13.91722 Y11.52974
G01 X14.10383 Y11.52931
G01 X14.10383 Y11.28000
G01 X13.94620 Y11.28000
G01 X13.91884 Y11.36621
G01 X13.86769 Y11.44762
G04 P0 ( dwell for no time -- G64 should not smooth over this point )
G00 Z2.00000 ( retract )

G00 X13.89672 Y9.65514 ( rapid move to begin. )
G01 F1000.00000
G01 Z0.00000
G04 P0 ( dwell for no time -- G64 should not smooth over this point )
G01 F2000.00000
G01 X13.89672 Y9.65514
G01 X13.94648 Y9.53076
G01 X14.10419 Y9.53038
G01 X14.10467 Y9.78001
G01 X13.94673 Y9.78001
G01 X13.89672 Y9.65514

G04 P0 ( dwell for no time -- G64 should not smooth over this point )
G00 Z10.000 ( retract )

M5 ( Spindle off. )
G04 P1.000000
M9 ( Coolant off. )
M2 ( Program end. )

