EESchema Schematic File Version 4
EELAYER 29 0
EELAYER END
$Descr A4 11693 8268
encoding utf-8
Sheet 1 1
Title ""
Date ""
Rev ""
Comp ""
Comment1 ""
Comment2 ""
Comment3 ""
Comment4 ""
$EndDescr
$Comp
L Motor:Stepper_Motor_bipolar M?
U 1 1 5D22D46C
P 4100 5350
F 0 "M?" H 4288 5474 50  0000 L CNN
F 1 "Stepper_Motor_bipolar" H 4288 5383 50  0000 L CNN
F 2 "" H 4110 5340 50  0001 C CNN
F 3 "http://www.infineon.com/dgdl/Application-Note-TLE8110EE_driving_UniPolarStepperMotor_V1.1.pdf?fileId=db3a30431be39b97011be5d0aa0a00b0" H 4110 5340 50  0001 C CNN
	1    4100 5350
	0    -1   -1   0   
$EndComp
$Comp
L Driver_Motor:L293D U?
U 1 1 5D23292A
P 2900 5850
F 0 "U?" H 2900 7031 50  0000 C CNN
F 1 "L293D" H 2900 6940 50  0000 C CNN
F 2 "Package_DIP:DIP-16_W7.62mm" H 3150 5100 50  0001 L CNN
F 3 "http://www.ti.com/lit/ds/symlink/l293.pdf" H 2600 6550 50  0001 C CNN
	1    2900 5850
	1    0    0    -1  
$EndComp
Wire Wire Line
	3800 5250 3550 5250
Wire Wire Line
	3550 5250 3550 5450
Wire Wire Line
	3550 5450 3400 5450
Wire Wire Line
	3800 5450 3650 5450
Wire Wire Line
	3650 5450 3650 5350
Wire Wire Line
	3650 5350 3450 5350
Wire Wire Line
	3450 5350 3450 5250
Wire Wire Line
	3450 5250 3400 5250
Wire Wire Line
	3400 5850 4000 5850
Wire Wire Line
	4000 5850 4000 5650
Wire Wire Line
	3400 6050 4200 6050
Wire Wire Line
	4200 6050 4200 5650
$Comp
L power:+3.3V #PWR?
U 1 1 5D2F081E
P 2250 5650
F 0 "#PWR?" H 2250 5500 50  0001 C CNN
F 1 "+3.3V" H 2265 5823 50  0000 C CNN
F 2 "" H 2250 5650 50  0001 C CNN
F 3 "" H 2250 5650 50  0001 C CNN
	1    2250 5650
	1    0    0    -1  
$EndComp
$Comp
L power:+3.3V #PWR?
U 1 1 5D2F113F
P 2200 6250
F 0 "#PWR?" H 2200 6100 50  0001 C CNN
F 1 "+3.3V" H 2215 6423 50  0000 C CNN
F 2 "" H 2200 6250 50  0001 C CNN
F 3 "" H 2200 6250 50  0001 C CNN
	1    2200 6250
	1    0    0    -1  
$EndComp
Wire Wire Line
	2200 6250 2400 6250
Wire Wire Line
	2250 5650 2400 5650
$Comp
L power:+3.3V #PWR?
U 1 1 5D2F5EF5
P 2800 4850
F 0 "#PWR?" H 2800 4700 50  0001 C CNN
F 1 "+3.3V" H 2815 5023 50  0000 C CNN
F 2 "" H 2800 4850 50  0001 C CNN
F 3 "" H 2800 4850 50  0001 C CNN
	1    2800 4850
	1    0    0    -1  
$EndComp
$Comp
L power:+12V #PWR?
U 1 1 5D2F6B12
P 3000 4850
F 0 "#PWR?" H 3000 4700 50  0001 C CNN
F 1 "+12V" H 3015 5023 50  0000 C CNN
F 2 "" H 3000 4850 50  0001 C CNN
F 3 "" H 3000 4850 50  0001 C CNN
	1    3000 4850
	1    0    0    -1  
$EndComp
$Comp
L power:Earth #PWR?
U 1 1 5D2F9692
P 2900 6850
F 0 "#PWR?" H 2900 6600 50  0001 C CNN
F 1 "Earth" H 2900 6700 50  0001 C CNN
F 2 "" H 2900 6850 50  0001 C CNN
F 3 "~" H 2900 6850 50  0001 C CNN
	1    2900 6850
	1    0    0    -1  
$EndComp
Wire Wire Line
	2700 6650 2700 6850
Wire Wire Line
	2800 6650 2800 6850
Wire Wire Line
	2700 6850 2800 6850
Connection ~ 2800 6850
Wire Wire Line
	2800 6850 2900 6850
Wire Wire Line
	3000 6650 3000 6850
Wire Wire Line
	3000 6850 2900 6850
Connection ~ 2900 6850
Wire Wire Line
	3100 6650 3100 6850
Wire Wire Line
	3100 6850 3000 6850
Connection ~ 3000 6850
$Comp
L 74xx_IEEE:74157 U?
U 1 1 5D300D08
P 1750 4100
F 0 "U?" V 1704 4678 50  0000 L CNN
F 1 "74157" V 1795 4678 50  0000 L CNN
F 2 "" H 1750 4100 50  0001 C CNN
F 3 "" H 1750 4100 50  0001 C CNN
	1    1750 4100
	0    1    1    0   
$EndComp
Wire Wire Line
	1650 4650 1650 5450
Wire Wire Line
	1650 5450 2400 5450
Wire Wire Line
	1850 4650 1850 5250
Wire Wire Line
	1850 5250 2400 5250
Wire Wire Line
	1450 4650 1450 5850
Wire Wire Line
	1450 5850 2400 5850
Wire Wire Line
	1250 4650 1250 6050
Wire Wire Line
	1250 6050 2400 6050
$Comp
L MCU_ST_STM32F1:STM32F103C8Tx U?
U 1 1 5D31002B
P 5550 2100
F 0 "U?" V 5454 556 50  0000 R CNN
F 1 "STM32F103C8Tx" V 5545 556 50  0000 R CNN
F 2 "Package_QFP:LQFP-48_7x7mm_P0.5mm" H 4950 700 50  0001 R CNN
F 3 "http://www.st.com/st-web-ui/static/active/en/resource/technical/document/datasheet/CD00161566.pdf" H 5550 2100 50  0001 C CNN
	1    5550 2100
	0    1    1    0   
$EndComp
Wire Wire Line
	5650 2700 5650 3250
Wire Wire Line
	5650 3250 1900 3250
Wire Wire Line
	1900 3250 1900 3550
Wire Wire Line
	5550 2700 5550 3200
Wire Wire Line
	5550 3200 1700 3200
Wire Wire Line
	1700 3200 1700 3550
Wire Wire Line
	5450 2700 5450 3150
Wire Wire Line
	5450 3150 1500 3150
Wire Wire Line
	1500 3150 1500 3550
Wire Wire Line
	5350 2700 5350 3100
Wire Wire Line
	5350 3100 1300 3100
Wire Wire Line
	1300 3100 1300 3550
Wire Wire Line
	5050 1400 5050 950 
Wire Wire Line
	5050 950  1800 950 
Wire Wire Line
	1800 950  1800 3550
Wire Wire Line
	5150 1400 5150 850 
Wire Wire Line
	5150 850  1600 850 
Wire Wire Line
	1600 850  1600 3550
Wire Wire Line
	5150 2700 5150 2950
Wire Wire Line
	5150 2950 1200 2950
Wire Wire Line
	1200 2950 1200 3550
Wire Wire Line
	5050 2700 5050 2900
Wire Wire Line
	5050 2900 1400 2900
Wire Wire Line
	1400 2900 1400 3550
$EndSCHEMATC
