<?xml version="1.0" standalone="no"?>
<!DOCTYPE svg PUBLIC "-//W3C//DTD SVG 1.1//EN"
"http://www.w3.org/Graphics/SVG/1.1/DTD/svg11.dtd">
<svg width="59.9622" height="167.452" viewBox="0 0 1249.21 3488.58" version="1.1"
xmlns="http://www.w3.org/2000/svg"
xmlns:xlink="http://www.w3.org/1999/xlink">
<g fill-rule="evenodd"><path d="M 5.68434e-14,3488.58 L 5.68434e-14,4.12115e-13 L 1249.21,4.12115e-13 L 1249.21,3488.58 L 5.68434e-14,3488.58 z " style="fill-opacity:0.200000;fill:rgb(103,198,105);"/></g>
<polyline points="651.968,3238.98 651.968,3207.05 663.776,3204.47 675.59,3207.05 675.59,3238.98 651.968,3238.98 636.22,3254.72 636.22,3191.73 653.78,3191.13 663.776,3187.15 673.774,3191.13 691.338,3191.73 691.338,3254.72 636.22,3254.72 620.472,3270.47 620.472,3175.98 650.708,3175.68 658.77,3171.37 662.184,3166.26 663.384,3160.24 663.514,3078.56 752.184,2989.89 789.81,2989.42 795.792,2986.76 802.906,2978.52 808.546,2975.26 815.022,2974.58 821.216,2976.59 826.054,2980.95 829.046,2990.16 826.054,2999.36 818.226,3005.05 811.748,3005.73 805.554,3003.72 795.792,2993.56 789.808,2990.89 759.048,2990.55 750.298,2993.2 668.784,3074.29 665.37,3079.4 664.17,3085.43 664.17,3160.24 665.37,3166.26 668.784,3171.37 676.846,3175.68 707.086,3175.98 707.086,3270.47 620.472,3270.47" style="stroke:rgb(103,198,105);stroke-width:31.496063;fill:none;stroke-opacity:0.5;stroke-linecap:round;stroke-linejoin:round;;fill:none"/>
<polyline points="651.968,3238.98 651.968,3207.05 663.776,3204.47 675.59,3207.05 675.59,3238.98 651.968,3238.98 636.22,3254.72 636.22,3191.73 653.78,3191.13 663.776,3187.15 673.774,3191.13 691.338,3191.73 691.338,3254.72 636.22,3254.72 620.472,3270.47 620.472,3175.98 650.708,3175.68 658.77,3171.37 662.184,3166.26 663.384,3160.24 663.514,3078.56 752.184,2989.89 789.81,2989.42 795.792,2986.76 802.906,2978.52 808.546,2975.26 815.022,2974.58 821.216,2976.59 826.054,2980.95 829.046,2990.16 826.054,2999.36 818.226,3005.05 811.748,3005.73 805.554,3003.72 795.792,2993.56 789.808,2990.89 759.048,2990.55 750.298,2993.2 668.784,3074.29 665.37,3079.4 664.17,3085.43 664.17,3160.24 665.37,3166.26 668.784,3171.37 676.846,3175.68 707.086,3175.98 707.086,3270.47 620.472,3270.47" style="stroke:rgb(0,0,0);stroke-width:1px;fill:none;stroke-opacity:1;stroke-linecap:round;stroke-linejoin:round;;fill:none"/>
<polyline points="49.606,2459.84 49.606,2454.33 193.51,2454.33 194.346,2457.08 193.51,2459.84 49.606,2459.84 33.858,2475.59 33.858,2438.58 207.086,2438.58 207.69,2447.09 211.668,2457.08 207.69,2467.08 207.086,2475.59 33.858,2475.59 18.11,2491.34 18.11,2422.83 222.834,2422.83 223.136,2444.02 227.446,2452.08 235.51,2456.39 258.442,2456.82 306.572,2504.83 314.634,2509.14 731.03,2509.14 739.092,2504.83 761.132,2482.79 765.442,2474.73 765.746,2271.65 766.534,2271.65 766.45,2478.41 734.706,2510.15 310.958,2510.15 262.714,2462.09 257.606,2458.68 251.578,2457.48 235.51,2457.78 227.446,2462.09 223.136,2470.15 222.834,2491.34 18.11,2491.34" style="stroke:rgb(103,198,105);stroke-width:31.496063;fill:none;stroke-opacity:0.5;stroke-linecap:round;stroke-linejoin:round;;fill:none"/>
<polyline points="49.606,2459.84 49.606,2454.33 193.51,2454.33 194.346,2457.08 193.51,2459.84 49.606,2459.84 33.858,2475.59 33.858,2438.58 207.086,2438.58 207.69,2447.09 211.668,2457.08 207.69,2467.08 207.086,2475.59 33.858,2475.59 18.11,2491.34 18.11,2422.83 222.834,2422.83 223.136,2444.02 227.446,2452.08 235.51,2456.39 258.442,2456.82 306.572,2504.83 314.634,2509.14 731.03,2509.14 739.092,2504.83 761.132,2482.79 765.442,2474.73 765.746,2271.65 766.534,2271.65 766.45,2478.41 734.706,2510.15 310.958,2510.15 262.714,2462.09 257.606,2458.68 251.578,2457.48 235.51,2457.78 227.446,2462.09 223.136,2470.15 222.834,2491.34 18.11,2491.34" style="stroke:rgb(0,0,0);stroke-width:1px;fill:none;stroke-opacity:1;stroke-linecap:round;stroke-linejoin:round;;fill:none"/>
<polyline points="49.606,2059.84 49.606,2054.33 193.51,2054.33 194.346,2057.09 193.51,2059.84 49.606,2059.84 33.858,2075.59 33.858,2038.58 207.086,2038.58 207.69,2047.09 211.668,2057.09 207.69,2067.08 207.086,2075.59 33.858,2075.59 18.11,2091.34 18.11,2022.83 222.834,2022.83 222.834,2040.94 224.032,2046.97 229.832,2054.04 238.582,2056.69 585.158,2056.79 664.088,2135.76 664.172,2354.33 663.384,2354.33 663.08,2139.44 658.77,2131.38 589.486,2062.09 584.378,2058.68 578.35,2057.48 238.582,2057.48 229.832,2060.13 224.032,2067.2 222.834,2073.23 222.834,2091.34 18.11,2091.34" style="stroke:rgb(103,198,105);stroke-width:31.496063;fill:none;stroke-opacity:0.5;stroke-linecap:round;stroke-linejoin:round;;fill:none"/>
<polyline points="49.606,2059.84 49.606,2054.33 193.51,2054.33 194.346,2057.09 193.51,2059.84 49.606,2059.84 33.858,2075.59 33.858,2038.58 207.086,2038.58 207.69,2047.09 211.668,2057.09 207.69,2067.08 207.086,2075.59 33.858,2075.59 18.11,2091.34 18.11,2022.83 222.834,2022.83 222.834,2040.94 224.032,2046.97 229.832,2054.04 238.582,2056.69 585.158,2056.79 664.088,2135.76 664.172,2354.33 663.384,2354.33 663.08,2139.44 658.77,2131.38 589.486,2062.09 584.378,2058.68 578.35,2057.48 238.582,2057.48 229.832,2060.13 224.032,2067.2 222.834,2073.23 222.834,2091.34 18.11,2091.34" style="stroke:rgb(0,0,0);stroke-width:1px;fill:none;stroke-opacity:1;stroke-linecap:round;stroke-linejoin:round;;fill:none"/>
<polyline points="49.606,2259.84 49.606,2254.33 193.51,2254.33 194.346,2257.08 193.51,2259.84 49.606,2259.84 33.858,2275.59 33.858,2238.58 207.086,2238.58 207.69,2247.09 211.668,2257.09 207.69,2267.08 207.086,2275.59 33.858,2275.59 18.11,2291.34 18.11,2222.83 222.834,2222.83 223.136,2244.02 227.446,2252.08 235.51,2256.39 259.088,2257.35 443.58,2441.84 448.688,2445.26 454.716,2446.46 651.186,2446.46 659.934,2443.8 709.952,2394.21 713.366,2389.1 714.566,2383.08 714.566,2271.65 715.354,2271.65 715.27,2389.82 657.932,2447.16 447.968,2447.16 262.714,2262.09 257.606,2258.68 251.578,2257.48 235.51,2257.78 227.446,2262.09 223.136,2270.15 222.834,2291.34 18.11,2291.34" style="stroke:rgb(103,198,105);stroke-width:31.496063;fill:none;stroke-opacity:0.5;stroke-linecap:round;stroke-linejoin:round;;fill:none"/>
<polyline points="49.606,2259.84 49.606,2254.33 193.51,2254.33 194.346,2257.08 193.51,2259.84 49.606,2259.84 33.858,2275.59 33.858,2238.58 207.086,2238.58 207.69,2247.09 211.668,2257.09 207.69,2267.08 207.086,2275.59 33.858,2275.59 18.11,2291.34 18.11,2222.83 222.834,2222.83 223.136,2244.02 227.446,2252.08 235.51,2256.39 259.088,2257.35 443.58,2441.84 448.688,2445.26 454.716,2446.46 651.186,2446.46 659.934,2443.8 709.952,2394.21 713.366,2389.1 714.566,2383.08 714.566,2271.65 715.354,2271.65 715.27,2389.82 657.932,2447.16 447.968,2447.16 262.714,2262.09 257.606,2258.68 251.578,2257.48 235.51,2257.78 227.446,2262.09 223.136,2270.15 222.834,2291.34 18.11,2291.34" style="stroke:rgb(0,0,0);stroke-width:1px;fill:none;stroke-opacity:1;stroke-linecap:round;stroke-linejoin:round;;fill:none"/>
<polyline points="49.606,3059.84 49.606,3054.33 193.51,3054.33 194.346,3057.09 193.51,3059.84 49.606,3059.84 33.858,3075.59 33.858,3038.58 207.086,3038.58 207.69,3047.09 211.668,3057.08 207.69,3067.08 207.086,3075.59 33.858,3075.59 18.11,3091.34 18.11,3022.83 222.834,3022.83 222.834,3040.94 224.032,3046.97 229.832,3054.04 235.51,3056.39 420.008,3056.39 428.07,3052.08 600.664,2879.63 954.724,2879.53 960.75,2878.33 965.858,2874.91 969.272,2869.8 970.472,2863.78 971.258,2271.65 971.258,2712.2 972.458,2718.23 978.258,2725.3 987.006,2727.95 1070.37,2727.65 1076.02,2725.33 1080.36,2721.04 1082.74,2715.42 1083.27,2704.87 1084.92,2703.05 1124.23,2703.05 1126.38,2706.46 1126.29,2750.86 1124.97,2753.3 1122.28,2753.93 1085.57,2753.81 1083.2,2751.54 1082.77,2741.41 1080.42,2735.74 1076.07,2731.39 1067.32,2728.74 983.934,2729.04 978.258,2731.39 972.458,2738.46 971.258,2744.49 971.176,3168.17 915.922,3223.49 892.99,3223.92 884.926,3228.23 880.616,3236.3 880.314,3270.47 793.7,3270.47 793.7,3175.98 880.314,3175.98 880.314,3207.09 882.968,3215.83 887.312,3220.18 892.99,3222.53 909.06,3222.83 915.086,3221.63 920.194,3218.22 967.818,3170.17 970.472,3161.42 970.472,2896.06 967.818,2887.31 963.472,2882.97 957.796,2880.62 604.398,2880.62 596.336,2884.93 423.742,3057.38 235.51,3057.78 229.832,3060.13 224.032,3067.2 222.834,3073.23 222.834,3091.34 18.11,3091.34" style="stroke:rgb(103,198,105);stroke-width:31.496063;fill:none;stroke-opacity:0.5;stroke-linecap:round;stroke-linejoin:round;;fill:none"/>
<polyline points="49.606,3059.84 49.606,3054.33 193.51,3054.33 194.346,3057.09 193.51,3059.84 49.606,3059.84 33.858,3075.59 33.858,3038.58 207.086,3038.58 207.69,3047.09 211.668,3057.08 207.69,3067.08 207.086,3075.59 33.858,3075.59 18.11,3091.34 18.11,3022.83 222.834,3022.83 222.834,3040.94 224.032,3046.97 229.832,3054.04 235.51,3056.39 420.008,3056.39 428.07,3052.08 600.664,2879.63 954.724,2879.53 960.75,2878.33 965.858,2874.91 969.272,2869.8 970.472,2863.78 971.258,2271.65 971.258,2712.2 972.458,2718.23 978.258,2725.3 987.006,2727.95 1070.37,2727.65 1076.02,2725.33 1080.36,2721.04 1082.74,2715.42 1083.27,2704.87 1084.92,2703.05 1124.23,2703.05 1126.38,2706.46 1126.29,2750.86 1124.97,2753.3 1122.28,2753.93 1085.57,2753.81 1083.2,2751.54 1082.77,2741.41 1080.42,2735.74 1076.07,2731.39 1067.32,2728.74 983.934,2729.04 978.258,2731.39 972.458,2738.46 971.258,2744.49 971.176,3168.17 915.922,3223.49 892.99,3223.92 884.926,3228.23 880.616,3236.3 880.314,3270.47 793.7,3270.47 793.7,3175.98 880.314,3175.98 880.314,3207.09 882.968,3215.83 887.312,3220.18 892.99,3222.53 909.06,3222.83 915.086,3221.63 920.194,3218.22 967.818,3170.17 970.472,3161.42 970.472,2896.06 967.818,2887.31 963.472,2882.97 957.796,2880.62 604.398,2880.62 596.336,2884.93 423.742,3057.38 235.51,3057.78 229.832,3060.13 224.032,3067.2 222.834,3073.23 222.834,3091.34 18.11,3091.34" style="stroke:rgb(0,0,0);stroke-width:1px;fill:none;stroke-opacity:1;stroke-linecap:round;stroke-linejoin:round;;fill:none"/>
<polyline points="49.606,3259.84 49.606,3254.33 193.51,3254.33 194.346,3257.09 193.51,3259.84 49.606,3259.84 33.858,3275.59 33.858,3238.58 207.086,3238.58 207.69,3247.09 211.668,3257.08 207.69,3267.08 207.086,3275.59 33.858,3275.59 18.11,3291.34 18.11,3222.83 222.834,3222.83 222.834,3240.94 224.032,3246.97 229.832,3254.04 235.51,3256.39 403.324,3256.82 564.84,3418.22 572.902,3422.53 607.796,3422.53 615.858,3418.22 620.168,3410.16 620.472,3375.98 707.086,3375.98 707.086,3407.09 708.284,3413.11 714.084,3420.18 722.834,3422.83 777.952,3422.83 786.7,3420.18 791.046,3415.83 793.398,3410.16 793.7,3375.98 880.314,3375.98 880.616,3410.16 884.926,3418.22 892.99,3422.53 909.06,3422.83 915.086,3421.63 920.194,3418.22 1225.7,3112.72 1230.01,3104.65 1230.01,2513.45 1225.7,2505.39 1185.53,2465.64 1176.78,2462.99 1145.88,2462.86 1072.96,2389.94 1073.62,2271.65 1073.62,2383.08 1076.27,2391.83 1144,2459.55 1152.75,2462.2 1183.64,2462.33 1231.02,2509.78 1231.02,3108.33 916.572,3422.96 892.99,3423.92 884.926,3428.23 880.616,3436.3 880.314,3470.47 793.7,3470.47 793.7,3439.37 792.5,3433.34 786.7,3426.27 777.952,3423.62 722.834,3423.62 714.084,3426.27 709.74,3430.62 707.388,3436.3 707.086,3470.47 620.472,3470.47 620.168,3436.3 615.858,3428.23 607.796,3423.92 569.112,3423.49 407.596,3262.09 399.534,3257.78 235.51,3257.78 229.832,3260.13 224.032,3267.2 222.834,3273.23 222.834,3291.34 18.11,3291.34" style="stroke:rgb(103,198,105);stroke-width:31.496063;fill:none;stroke-opacity:0.5;stroke-linecap:round;stroke-linejoin:round;;fill:none"/>
<polyline points="49.606,3259.84 49.606,3254.33 193.51,3254.33 194.346,3257.09 193.51,3259.84 49.606,3259.84 33.858,3275.59 33.858,3238.58 207.086,3238.58 207.69,3247.09 211.668,3257.08 207.69,3267.08 207.086,3275.59 33.858,3275.59 18.11,3291.34 18.11,3222.83 222.834,3222.83 222.834,3240.94 224.032,3246.97 229.832,3254.04 235.51,3256.39 403.324,3256.82 564.84,3418.22 572.902,3422.53 607.796,3422.53 615.858,3418.22 620.168,3410.16 620.472,3375.98 707.086,3375.98 707.086,3407.09 708.284,3413.11 714.084,3420.18 722.834,3422.83 777.952,3422.83 786.7,3420.18 791.046,3415.83 793.398,3410.16 793.7,3375.98 880.314,3375.98 880.616,3410.16 884.926,3418.22 892.99,3422.53 909.06,3422.83 915.086,3421.63 920.194,3418.22 1225.7,3112.72 1230.01,3104.65 1230.01,2513.45 1225.7,2505.39 1185.53,2465.64 1176.78,2462.99 1145.88,2462.86 1072.96,2389.94 1073.62,2271.65 1073.62,2383.08 1076.27,2391.83 1144,2459.55 1152.75,2462.2 1183.64,2462.33 1231.02,2509.78 1231.02,3108.33 916.572,3422.96 892.99,3423.92 884.926,3428.23 880.616,3436.3 880.314,3470.47 793.7,3470.47 793.7,3439.37 792.5,3433.34 786.7,3426.27 777.952,3423.62 722.834,3423.62 714.084,3426.27 709.74,3430.62 707.388,3436.3 707.086,3470.47 620.472,3470.47 620.168,3436.3 615.858,3428.23 607.796,3423.92 569.112,3423.49 407.596,3262.09 399.534,3257.78 235.51,3257.78 229.832,3260.13 224.032,3267.2 222.834,3273.23 222.834,3291.34 18.11,3291.34" style="stroke:rgb(0,0,0);stroke-width:1px;fill:none;stroke-opacity:1;stroke-linecap:round;stroke-linejoin:round;;fill:none"/>
<polyline points="49.606,2659.84 49.606,2654.33 193.51,2654.33 194.346,2657.08 193.51,2659.84 49.606,2659.84 33.858,2675.59 33.858,2638.58 207.086,2638.58 207.69,2647.09 211.668,2657.08 207.69,2667.08 207.086,2675.59 33.858,2675.59 18.11,2691.34 18.11,2622.83 222.834,2622.83 222.834,2640.94 224.032,2646.97 229.832,2654.04 238.582,2656.69 675.2,2656.69 681.228,2655.49 686.336,2652.08 812.314,2526.1 815.728,2520.99 816.928,2514.97 816.928,2271.65 817.716,2271.65 817.614,2521.77 682.064,2657.35 238.582,2657.48 229.832,2660.13 224.032,2667.2 222.834,2673.23 222.834,2691.34 18.11,2691.34" style="stroke:rgb(103,198,105);stroke-width:31.496063;fill:none;stroke-opacity:0.5;stroke-linecap:round;stroke-linejoin:round;;fill:none"/>
<polyline points="49.606,2659.84 49.606,2654.33 193.51,2654.33 194.346,2657.08 193.51,2659.84 49.606,2659.84 33.858,2675.59 33.858,2638.58 207.086,2638.58 207.69,2647.09 211.668,2657.08 207.69,2667.08 207.086,2675.59 33.858,2675.59 18.11,2691.34 18.11,2622.83 222.834,2622.83 222.834,2640.94 224.032,2646.97 229.832,2654.04 238.582,2656.69 675.2,2656.69 681.228,2655.49 686.336,2652.08 812.314,2526.1 815.728,2520.99 816.928,2514.97 816.928,2271.65 817.716,2271.65 817.614,2521.77 682.064,2657.35 238.582,2657.48 229.832,2660.13 224.032,2667.2 222.834,2673.23 222.834,2691.34 18.11,2691.34" style="stroke:rgb(0,0,0);stroke-width:1px;fill:none;stroke-opacity:1;stroke-linecap:round;stroke-linejoin:round;;fill:none"/>
<polyline points="49.606,1262.99 49.606,1257.48 193.51,1257.48 194.346,1260.23 193.51,1262.99 49.606,1262.99 33.858,1278.74 33.858,1241.73 207.086,1241.73 207.69,1250.24 211.668,1260.23 207.69,1270.23 207.086,1278.74 33.858,1278.74 18.11,1294.49 18.11,1225.98 222.834,1225.98 222.834,1244.09 224.032,1250.12 229.832,1257.19 238.582,1259.84 776.552,1259.97 817.714,1301.95 817.716,1889.76 816.928,1889.76 816.928,1307.87 815.728,1301.84 812.314,1296.73 778.438,1263.28 769.69,1260.63 238.582,1260.63 229.832,1263.28 224.032,1270.35 222.834,1276.38 222.834,1294.49 18.11,1294.49" style="stroke:rgb(103,198,105);stroke-width:31.496063;fill:none;stroke-opacity:0.5;stroke-linecap:round;stroke-linejoin:round;;fill:none"/>
<polyline points="49.606,1262.99 49.606,1257.48 193.51,1257.48 194.346,1260.23 193.51,1262.99 49.606,1262.99 33.858,1278.74 33.858,1241.73 207.086,1241.73 207.69,1250.24 211.668,1260.23 207.69,1270.23 207.086,1278.74 33.858,1278.74 18.11,1294.49 18.11,1225.98 222.834,1225.98 222.834,1244.09 224.032,1250.12 229.832,1257.19 238.582,1259.84 776.552,1259.97 817.714,1301.95 817.716,1889.76 816.928,1889.76 816.928,1307.87 815.728,1301.84 812.314,1296.73 778.438,1263.28 769.69,1260.63 238.582,1260.63 229.832,1263.28 224.032,1270.35 222.834,1276.38 222.834,1294.49 18.11,1294.49" style="stroke:rgb(0,0,0);stroke-width:1px;fill:none;stroke-opacity:1;stroke-linecap:round;stroke-linejoin:round;;fill:none"/>
<polyline points="49.606,1659.84 49.606,1654.33 193.51,1654.33 194.346,1657.08 193.51,1659.84 49.606,1659.84 33.858,1675.59 33.858,1638.58 207.086,1638.58 207.69,1647.09 211.668,1657.08 207.69,1667.08 207.086,1675.59 33.858,1675.59 18.11,1691.34 18.11,1622.83 222.834,1622.83 222.834,1640.94 224.032,1646.97 229.832,1654.04 238.582,1656.69 708.78,1656.79 715.352,1664.16 715.354,1889.76 714.566,1889.76 714.566,1673.23 711.912,1664.48 707.566,1660.13 701.89,1657.78 238.582,1657.48 229.832,1660.13 224.032,1667.2 222.834,1673.23 222.834,1691.34 18.11,1691.34" style="stroke:rgb(103,198,105);stroke-width:31.496063;fill:none;stroke-opacity:0.5;stroke-linecap:round;stroke-linejoin:round;;fill:none"/>
<polyline points="49.606,1659.84 49.606,1654.33 193.51,1654.33 194.346,1657.08 193.51,1659.84 49.606,1659.84 33.858,1675.59 33.858,1638.58 207.086,1638.58 207.69,1647.09 211.668,1657.08 207.69,1667.08 207.086,1675.59 33.858,1675.59 18.11,1691.34 18.11,1622.83 222.834,1622.83 222.834,1640.94 224.032,1646.97 229.832,1654.04 238.582,1656.69 708.78,1656.79 715.352,1664.16 715.354,1889.76 714.566,1889.76 714.566,1673.23 711.912,1664.48 707.566,1660.13 701.89,1657.78 238.582,1657.48 229.832,1660.13 224.032,1667.2 222.834,1673.23 222.834,1691.34 18.11,1691.34" style="stroke:rgb(0,0,0);stroke-width:1px;fill:none;stroke-opacity:1;stroke-linecap:round;stroke-linejoin:round;;fill:none"/>
<polyline points="49.606,55.1174 49.606,49.6054 193.51,49.6054 194.346,52.3614 193.51,55.1174 49.606,55.1174 33.858,70.8654 33.858,33.8574 207.086,33.8574 207.69,42.3634 211.668,52.3614 207.69,62.3574 207.086,70.8654 33.858,70.8654 18.11,86.6134 18.11,18.1094 222.834,18.1094 222.834,36.2194 224.032,42.2454 229.832,49.3134 238.582,51.9674 1024.42,51.9674 1124.67,151.395 1124.8,1889.76 1124.01,1889.76 1124.01,158.259 1121.36,149.509 1029.64,57.3674 1024.54,53.9534 1018.51,52.7534 238.582,52.7534 229.832,55.4074 224.032,62.4754 222.834,68.5014 222.834,86.6134 18.11,86.6134" style="stroke:rgb(103,198,105);stroke-width:31.496063;fill:none;stroke-opacity:0.5;stroke-linecap:round;stroke-linejoin:round;;fill:none"/>
<polyline points="49.606,55.1174 49.606,49.6054 193.51,49.6054 194.346,52.3614 193.51,55.1174 49.606,55.1174 33.858,70.8654 33.858,33.8574 207.086,33.8574 207.69,42.3634 211.668,52.3614 207.69,62.3574 207.086,70.8654 33.858,70.8654 18.11,86.6134 18.11,18.1094 222.834,18.1094 222.834,36.2194 224.032,42.2454 229.832,49.3134 238.582,51.9674 1024.42,51.9674 1124.67,151.395 1124.8,1889.76 1124.01,1889.76 1124.01,158.259 1121.36,149.509 1029.64,57.3674 1024.54,53.9534 1018.51,52.7534 238.582,52.7534 229.832,55.4074 224.032,62.4754 222.834,68.5014 222.834,86.6134 18.11,86.6134" style="stroke:rgb(0,0,0);stroke-width:1px;fill:none;stroke-opacity:1;stroke-linecap:round;stroke-linejoin:round;;fill:none"/>
<polyline points="49.606,255.117 49.606,249.605 193.51,249.605 194.346,252.361 193.51,255.117 49.606,255.117 33.858,270.865 33.858,233.857 207.086,233.857 207.69,242.363 211.668,252.361 207.69,262.357 207.086,270.865 33.858,270.865 18.11,286.613 18.11,218.109 222.834,218.109 222.834,236.219 224.032,242.245 229.832,249.313 238.582,251.967 972.452,251.967 1073.49,352.183 1073.62,1889.76 1072.83,359.047 1070.18,350.297 977.676,257.367 972.568,253.953 966.54,252.753 238.582,252.753 229.832,255.407 224.032,262.475 222.834,268.501 222.834,286.613 18.11,286.613" style="stroke:rgb(103,198,105);stroke-width:31.496063;fill:none;stroke-opacity:0.5;stroke-linecap:round;stroke-linejoin:round;;fill:none"/>
<polyline points="49.606,255.117 49.606,249.605 193.51,249.605 194.346,252.361 193.51,255.117 49.606,255.117 33.858,270.865 33.858,233.857 207.086,233.857 207.69,242.363 211.668,252.361 207.69,262.357 207.086,270.865 33.858,270.865 18.11,286.613 18.11,218.109 222.834,218.109 222.834,236.219 224.032,242.245 229.832,249.313 238.582,251.967 972.452,251.967 1073.49,352.183 1073.62,1889.76 1072.83,359.047 1070.18,350.297 977.676,257.367 972.568,253.953 966.54,252.753 238.582,252.753 229.832,255.407 224.032,262.475 222.834,268.501 222.834,286.613 18.11,286.613" style="stroke:rgb(0,0,0);stroke-width:1px;fill:none;stroke-opacity:1;stroke-linecap:round;stroke-linejoin:round;;fill:none"/>
<polyline points="49.606,455.117 49.606,449.605 193.51,449.605 194.346,452.359 193.51,455.117 49.606,455.117 33.858,470.865 33.858,433.857 207.086,433.857 207.69,442.363 211.668,452.359 207.69,462.357 207.086,470.865 33.858,470.865 18.11,486.613 18.11,418.109 222.834,418.109 222.834,436.217 224.032,442.245 229.832,449.311 238.582,451.967 818.958,452.049 1022.31,655.333 1022.44,1889.76 1021.65,1889.76 1021.65,662.197 1019,653.447 823.344,457.367 815.282,453.057 238.582,452.753 229.832,455.407 224.032,462.475 222.834,468.501 222.834,486.613 18.11,486.613" style="stroke:rgb(103,198,105);stroke-width:31.496063;fill:none;stroke-opacity:0.5;stroke-linecap:round;stroke-linejoin:round;;fill:none"/>
<polyline points="49.606,455.117 49.606,449.605 193.51,449.605 194.346,452.359 193.51,455.117 49.606,455.117 33.858,470.865 33.858,433.857 207.086,433.857 207.69,442.363 211.668,452.359 207.69,462.357 207.086,470.865 33.858,470.865 18.11,486.613 18.11,418.109 222.834,418.109 222.834,436.217 224.032,442.245 229.832,449.311 238.582,451.967 818.958,452.049 1022.31,655.333 1022.44,1889.76 1021.65,1889.76 1021.65,662.197 1019,653.447 823.344,457.367 815.282,453.057 238.582,452.753 229.832,455.407 224.032,462.475 222.834,468.501 222.834,486.613 18.11,486.613" style="stroke:rgb(0,0,0);stroke-width:1px;fill:none;stroke-opacity:1;stroke-linecap:round;stroke-linejoin:round;;fill:none"/>
<polyline points="49.606,655.117 49.606,649.605 193.51,649.605 194.346,652.361 193.51,655.117 49.606,655.117 33.858,670.865 33.858,633.857 207.086,633.857 207.69,642.363 211.668,652.361 207.69,662.357 207.086,670.865 33.858,670.865 18.11,686.613 18.11,618.109 222.834,618.109 222.834,636.219 224.032,642.245 229.832,649.313 238.582,651.967 861.478,652.049 971.13,761.633 971.258,1889.76 970.472,768.495 967.818,759.745 865.864,657.367 860.756,653.953 854.728,652.753 238.582,652.753 229.832,655.407 224.032,662.475 222.834,668.501 222.834,686.613 18.11,686.613" style="stroke:rgb(103,198,105);stroke-width:31.496063;fill:none;stroke-opacity:0.5;stroke-linecap:round;stroke-linejoin:round;;fill:none"/>
<polyline points="49.606,655.117 49.606,649.605 193.51,649.605 194.346,652.361 193.51,655.117 49.606,655.117 33.858,670.865 33.858,633.857 207.086,633.857 207.69,642.363 211.668,652.361 207.69,662.357 207.086,670.865 33.858,670.865 18.11,686.613 18.11,618.109 222.834,618.109 222.834,636.219 224.032,642.245 229.832,649.313 238.582,651.967 861.478,652.049 971.13,761.633 971.258,1889.76 970.472,768.495 967.818,759.745 865.864,657.367 860.756,653.953 854.728,652.753 238.582,652.753 229.832,655.407 224.032,662.475 222.834,668.501 222.834,686.613 18.11,686.613" style="stroke:rgb(0,0,0);stroke-width:1px;fill:none;stroke-opacity:1;stroke-linecap:round;stroke-linejoin:round;;fill:none"/>
<polyline points="49.606,855.117 49.606,849.605 193.51,849.605 194.346,852.361 193.51,855.117 49.606,855.117 33.858,870.865 33.858,833.857 207.086,833.857 207.69,842.363 211.668,852.361 207.69,862.357 207.086,870.865 33.858,870.865 18.11,886.613 18.11,818.109 222.834,818.109 222.834,836.219 224.032,842.245 229.832,849.313 238.582,851.967 848.042,851.967 919.414,922.399 920.078,1889.76 919.29,1889.76 919.29,929.911 918.09,923.883 914.676,918.775 853.266,857.367 848.158,853.953 842.13,852.753 238.582,852.753 229.832,855.407 224.032,862.475 222.834,868.501 222.834,886.613 18.11,886.613" style="stroke:rgb(103,198,105);stroke-width:31.496063;fill:none;stroke-opacity:0.5;stroke-linecap:round;stroke-linejoin:round;;fill:none"/>
<polyline points="49.606,855.117 49.606,849.605 193.51,849.605 194.346,852.361 193.51,855.117 49.606,855.117 33.858,870.865 33.858,833.857 207.086,833.857 207.69,842.363 211.668,852.361 207.69,862.357 207.086,870.865 33.858,870.865 18.11,886.613 18.11,818.109 222.834,818.109 222.834,836.219 224.032,842.245 229.832,849.313 238.582,851.967 848.042,851.967 919.414,922.399 920.078,1889.76 919.29,1889.76 919.29,929.911 918.09,923.883 914.676,918.775 853.266,857.367 848.158,853.953 842.13,852.753 238.582,852.753 229.832,855.407 224.032,862.475 222.834,868.501 222.834,886.613 18.11,886.613" style="stroke:rgb(0,0,0);stroke-width:1px;fill:none;stroke-opacity:1;stroke-linecap:round;stroke-linejoin:round;;fill:none"/>
<polyline points="49.606,1055.12 49.606,1049.61 193.51,1049.61 194.346,1052.36 193.51,1055.12 49.606,1055.12 33.858,1070.87 33.858,1033.86 207.086,1033.86 207.69,1042.36 211.668,1052.36 207.69,1062.36 207.086,1070.87 33.858,1070.87 18.11,1086.61 18.11,1018.11 222.834,1018.11 222.834,1036.22 224.032,1042.25 229.832,1049.31 238.582,1051.97 781.162,1052.05 868.232,1138.94 868.896,1889.76 867.804,1143.38 863.494,1135.31 785.55,1057.37 780.442,1053.95 774.414,1052.75 238.582,1052.75 229.832,1055.41 224.032,1062.48 222.834,1068.5 222.834,1086.61 18.11,1086.61" style="stroke:rgb(103,198,105);stroke-width:31.496063;fill:none;stroke-opacity:0.5;stroke-linecap:round;stroke-linejoin:round;;fill:none"/>
<polyline points="49.606,1055.12 49.606,1049.61 193.51,1049.61 194.346,1052.36 193.51,1055.12 49.606,1055.12 33.858,1070.87 33.858,1033.86 207.086,1033.86 207.69,1042.36 211.668,1052.36 207.69,1062.36 207.086,1070.87 33.858,1070.87 18.11,1086.61 18.11,1018.11 222.834,1018.11 222.834,1036.22 224.032,1042.25 229.832,1049.31 238.582,1051.97 781.162,1052.05 868.232,1138.94 868.896,1889.76 867.804,1143.38 863.494,1135.31 785.55,1057.37 780.442,1053.95 774.414,1052.75 238.582,1052.75 229.832,1055.41 224.032,1062.48 222.834,1068.5 222.834,1086.61 18.11,1086.61" style="stroke:rgb(0,0,0);stroke-width:1px;fill:none;stroke-opacity:1;stroke-linecap:round;stroke-linejoin:round;;fill:none"/>
<polyline points="49.606,2859.84 49.606,2854.33 191.338,2854.33 191.338,2859.84 49.606,2859.84 33.858,2875.59 33.858,2838.58 207.086,2838.58 207.086,2875.59 33.858,2875.59 18.11,2891.34 18.11,2822.83 222.834,2822.83 222.834,2891.34 18.11,2891.34" style="stroke:rgb(103,198,105);stroke-width:31.496063;fill:none;stroke-opacity:0.5;stroke-linecap:round;stroke-linejoin:round;;fill:none"/>
<polyline points="49.606,2859.84 49.606,2854.33 191.338,2854.33 191.338,2859.84 49.606,2859.84 33.858,2875.59 33.858,2838.58 207.086,2838.58 207.086,2875.59 33.858,2875.59 18.11,2891.34 18.11,2822.83 222.834,2822.83 222.834,2891.34 18.11,2891.34" style="stroke:rgb(0,0,0);stroke-width:1px;fill:none;stroke-opacity:1;stroke-linecap:round;stroke-linejoin:round;;fill:none"/>
<polyline points="49.606,1859.84 49.606,1854.33 192.554,1854.33 191.802,1859.84 49.606,1859.84 33.858,1875.59 33.858,1838.58 207.738,1838.58 211.668,1848.42 207.69,1858.42 207.086,1875.59 33.858,1875.59 18.11,1891.34 18.11,1822.83 222.834,1822.83 223.136,1835.35 225.488,1841.03 229.832,1845.38 238.582,1848.03 647.636,1848.03 656.386,1845.38 662.186,1838.31 663.384,1832.28 663.384,1807.09 664.172,1807.09 664.172,1889.76 663.384,1889.76 663.384,1864.56 662.186,1858.54 656.386,1851.47 647.636,1848.82 238.582,1848.82 229.832,1851.47 224.032,1858.54 222.834,1864.56 222.834,1891.34 18.11,1891.34" style="stroke:rgb(103,198,105);stroke-width:31.496063;fill:none;stroke-opacity:0.5;stroke-linecap:round;stroke-linejoin:round;;fill:none"/>
<polyline points="49.606,1859.84 49.606,1854.33 192.554,1854.33 191.802,1859.84 49.606,1859.84 33.858,1875.59 33.858,1838.58 207.738,1838.58 211.668,1848.42 207.69,1858.42 207.086,1875.59 33.858,1875.59 18.11,1891.34 18.11,1822.83 222.834,1822.83 223.136,1835.35 225.488,1841.03 229.832,1845.38 238.582,1848.03 647.636,1848.03 656.386,1845.38 662.186,1838.31 663.384,1832.28 663.384,1807.09 664.172,1807.09 664.172,1889.76 663.384,1889.76 663.384,1864.56 662.186,1858.54 656.386,1851.47 647.636,1848.82 238.582,1848.82 229.832,1851.47 224.032,1858.54 222.834,1864.56 222.834,1891.34 18.11,1891.34" style="stroke:rgb(0,0,0);stroke-width:1px;fill:none;stroke-opacity:1;stroke-linecap:round;stroke-linejoin:round;;fill:none"/>
<polyline points="49.606,1459.84 49.606,1454.33 193.51,1454.33 194.346,1457.09 193.51,1459.84 49.606,1459.84 33.858,1475.59 33.858,1438.58 207.086,1438.58 207.69,1447.09 211.668,1457.08 207.69,1467.08 207.086,1475.59 33.858,1475.59 18.11,1491.34 18.11,1422.83 222.834,1422.83 222.834,1440.94 224.032,1446.97 229.832,1454.04 238.582,1456.69 757.794,1456.69 766.292,1454.46 766.534,1889.76 765.746,1889.76 765.746,1473.23 763.092,1464.48 756.024,1458.68 749.998,1457.48 238.582,1457.48 229.832,1460.13 224.032,1467.2 222.834,1473.23 222.834,1491.34 18.11,1491.34" style="stroke:rgb(103,198,105);stroke-width:31.496063;fill:none;stroke-opacity:0.5;stroke-linecap:round;stroke-linejoin:round;;fill:none"/>
<polyline points="49.606,1459.84 49.606,1454.33 193.51,1454.33 194.346,1457.09 193.51,1459.84 49.606,1459.84 33.858,1475.59 33.858,1438.58 207.086,1438.58 207.69,1447.09 211.668,1457.08 207.69,1467.08 207.086,1475.59 33.858,1475.59 18.11,1491.34 18.11,1422.83 222.834,1422.83 222.834,1440.94 224.032,1446.97 229.832,1454.04 238.582,1456.69 757.794,1456.69 766.292,1454.46 766.534,1889.76 765.746,1889.76 765.746,1473.23 763.092,1464.48 756.024,1458.68 749.998,1457.48 238.582,1457.48 229.832,1460.13 224.032,1467.2 222.834,1473.23 222.834,1491.34 18.11,1491.34" style="stroke:rgb(0,0,0);stroke-width:1px;fill:none;stroke-opacity:1;stroke-linecap:round;stroke-linejoin:round;;fill:none"/>
<polyline points="797.724,2769.68 800.714,2778.89 808.546,2784.58 818.224,2784.58 826.054,2778.89 829.046,2769.68 827.692,2763.31 821.914,2752.41 821.65,2727.16 822.85,2721.13 826.264,2716.02 868.812,2673.29 868.896,2271.65 867.804,2669.61 863.494,2677.68 820.992,2720.3 820.864,2739.42 819.688,2745.39 813.986,2752.43 802.906,2758.05 799.078,2763.31 797.724,2769.68" style="stroke:rgb(103,198,105);stroke-width:31.496063;fill:none;stroke-opacity:0.5;stroke-linecap:round;stroke-linejoin:round;;fill:none"/>
<polyline points="797.724,2769.68 800.714,2778.89 808.546,2784.58 818.224,2784.58 826.054,2778.89 829.046,2769.68 827.692,2763.31 821.914,2752.41 821.65,2727.16 822.85,2721.13 826.264,2716.02 868.812,2673.29 868.896,2271.65 867.804,2669.61 863.494,2677.68 820.992,2720.3 820.864,2739.42 819.688,2745.39 813.986,2752.43 802.906,2758.05 799.078,2763.31 797.724,2769.68" style="stroke:rgb(0,0,0);stroke-width:1px;fill:none;stroke-opacity:1;stroke-linecap:round;stroke-linejoin:round;;fill:none"/>
<polyline points="1021.65,2544.5 1021.65,2271.65 1022.44,2271.65 1022.74,2541.66 1027.05,2549.72 1056.2,2578.87 1064.66,2583.25 1071.07,2583.03 1076.86,2580.27 1081.07,2575.43 1083.25,2567.19 1085.46,2565.09 1124.42,2565.23 1126.29,2567.63 1125.74,2614.73 1122.65,2616.14 1084.48,2615.5 1083.14,2613 1082.69,2603.26 1079.98,2597.32 1075.09,2592.99 1066.5,2590.28 1021.65,2544.5" style="stroke:rgb(103,198,105);stroke-width:31.496063;fill:none;stroke-opacity:0.5;stroke-linecap:round;stroke-linejoin:round;;fill:none"/>
<polyline points="1021.65,2544.5 1021.65,2271.65 1022.44,2271.65 1022.74,2541.66 1027.05,2549.72 1056.2,2578.87 1064.66,2583.25 1071.07,2583.03 1076.86,2580.27 1081.07,2575.43 1083.25,2567.19 1085.46,2565.09 1124.42,2565.23 1126.29,2567.63 1125.74,2614.73 1122.65,2616.14 1084.48,2615.5 1083.14,2613 1082.69,2603.26 1079.98,2597.32 1075.09,2592.99 1066.5,2590.28 1021.65,2544.5" style="stroke:rgb(0,0,0);stroke-width:1px;fill:none;stroke-opacity:1;stroke-linecap:round;stroke-linejoin:round;;fill:none"/>
<polyline points="822.188,3423.23 825.158,3438.98 848.856,3438.98 851.826,3423.23 848.856,3407.48 825.156,3407.48 822.188,3423.23 804.864,3423.23 808.842,3433.22 809.448,3454.72 864.566,3454.72 865.172,3433.22 869.148,3423.23 865.172,3413.23 864.566,3391.73 809.448,3391.73 808.842,3413.23 804.864,3423.23 631.636,3423.23 635.614,3433.22 636.22,3454.72 691.338,3454.72 691.942,3433.22 695.92,3423.23 691.942,3413.23 691.338,3391.73 636.22,3391.73 635.614,3413.23 631.636,3423.23 648.958,3423.23 651.928,3438.98 675.628,3438.98 678.598,3423.23 675.628,3407.48 651.928,3407.48 648.958,3423.23" style="stroke:rgb(103,198,105);stroke-width:31.496063;fill:none;stroke-opacity:0.5;stroke-linecap:round;stroke-linejoin:round;;fill:none"/>
<polyline points="822.188,3423.23 825.158,3438.98 848.856,3438.98 851.826,3423.23 848.856,3407.48 825.156,3407.48 822.188,3423.23 804.864,3423.23 808.842,3433.22 809.448,3454.72 864.566,3454.72 865.172,3433.22 869.148,3423.23 865.172,3413.23 864.566,3391.73 809.448,3391.73 808.842,3413.23 804.864,3423.23 631.636,3423.23 635.614,3433.22 636.22,3454.72 691.338,3454.72 691.942,3433.22 695.92,3423.23 691.942,3413.23 691.338,3391.73 636.22,3391.73 635.614,3413.23 631.636,3423.23 648.958,3423.23 651.928,3438.98 675.628,3438.98 678.598,3423.23 675.628,3407.48 651.928,3407.48 648.958,3423.23" style="stroke:rgb(0,0,0);stroke-width:1px;fill:none;stroke-opacity:1;stroke-linecap:round;stroke-linejoin:round;;fill:none"/>
<polyline points="825.196,3238.98 825.196,3207.48 848.856,3207.48 851.826,3223.23 848.856,3238.98 825.196,3238.98 809.448,3254.72 809.448,3191.73 864.566,3191.73 865.17,3213.23 869.148,3223.23 865.17,3233.22 864.566,3254.72 809.448,3254.72" style="stroke:rgb(103,198,105);stroke-width:31.496063;fill:none;stroke-opacity:0.5;stroke-linecap:round;stroke-linejoin:round;;fill:none"/>
<polyline points="825.196,3238.98 825.196,3207.48 848.856,3207.48 851.826,3223.23 848.856,3238.98 825.196,3238.98 809.448,3254.72 809.448,3191.73 864.566,3191.73 865.17,3213.23 869.148,3223.23 865.17,3233.22 864.566,3254.72 809.448,3254.72" style="stroke:rgb(0,0,0);stroke-width:1px;fill:none;stroke-opacity:1;stroke-linecap:round;stroke-linejoin:round;;fill:none"/>
<polyline points="1094.23,2728.34 1098.17,2718.5 1110.6,2718.5 1110.57,2738.16 1098.15,2738.13 1094.23,2728.34" style="stroke:rgb(103,198,105);stroke-width:31.496063;fill:none;stroke-opacity:0.5;stroke-linecap:round;stroke-linejoin:round;;fill:none"/>
<polyline points="1094.23,2728.34 1098.17,2718.5 1110.6,2718.5 1110.57,2738.16 1098.15,2738.13 1094.23,2728.34" style="stroke:rgb(0,0,0);stroke-width:1px;fill:none;stroke-opacity:1;stroke-linecap:round;stroke-linejoin:round;;fill:none"/>
<polyline points="1091.94,2587.2 1095.97,2593.61 1098.13,2600.39 1110.54,2600.39 1110.54,2580.76 1095.84,2580.73 1091.94,2587.2" style="stroke:rgb(103,198,105);stroke-width:31.496063;fill:none;stroke-opacity:0.5;stroke-linecap:round;stroke-linejoin:round;;fill:none"/>
<polyline points="1091.94,2587.2 1095.97,2593.61 1098.13,2600.39 1110.54,2600.39 1110.54,2580.76 1095.84,2580.73 1091.94,2587.2" style="stroke:rgb(0,0,0);stroke-width:1px;fill:none;stroke-opacity:1;stroke-linecap:round;stroke-linejoin:round;;fill:none"/>
<g fill-rule="evenodd"><path d="M 5.68434e-14,4.12115e-13 L 1249.21,4.12115e-13 L 1249.21,3488.58 L 5.68434e-14,3488.58 L 5.68434e-14,4.12115e-13M 933.464,2255.91 L 905.905,2255.91 L 905.905,2370.08 L 933.464,2370.08 L 933.464,2255.91M 1132.28,2255.91 L 1116.54,2255.91 L 1116.54,2370.08 L 1132.28,2370.08 L 1132.28,2255.91M 238.583,2807.09 L 2.3622,2807.09 L 2.3622,2907.09 L 238.583,2907.09 L 238.583,2807.09M 834.461,2966.75 L 829.134,2962.88 L 823.119,2960.2 L 816.678,2958.83 L 810.094,2958.83 L 803.653,2960.2 L 797.638,2962.88 L 792.311,2966.75 L 787.905,2971.64 L 786.536,2974.02 L 752.362,2974.02 L 749.213,2974.33 L 746.185,2975.24 L 743.394,2976.74 L 740.948,2978.74 L 652.364,3067.33 L 650.357,3069.77 L 648.865,3072.56 L 647.946,3075.59 L 647.636,3078.74 L 647.636,3160.24 L 604.724,3160.24 L 604.724,3286.22 L 722.835,3286.22 L 722.835,3160.24 L 679.92,3160.24 L 679.92,3085.43 L 759.048,3006.3 L 786.536,3006.3 L 787.905,3008.67 L 792.311,3013.56 L 797.638,3017.43 L 803.653,3020.11 L 810.094,3021.48 L 816.678,3021.48 L 823.119,3020.11 L 829.134,3017.43 L 834.461,3013.56 L 838.867,3008.67 L 842.159,3002.97 L 844.194,2996.71 L 844.882,2990.16 L 844.194,2983.61 L 842.159,2977.35 L 838.867,2971.64 L 834.461,2966.75M 679.921,1905.51 L 679.921,1791.34 L 647.638,1791.34 L 647.638,1832.28 L 238.583,1832.28 L 238.583,1807.09 L 2.3622,1807.09 L 2.3622,1907.09 L 238.583,1907.09 L 238.583,1864.57 L 647.638,1864.57 L 647.638,1905.51 L 679.921,1905.51M 2.3622,1210.24 L 2.3622,1310.24 L 238.583,1310.24 L 238.583,1276.38 L 769.69,1276.38 L 801.18,1307.87 L 801.181,1905.51 L 833.464,1905.51 L 833.464,1301.18 L 833.154,1298.03 L 832.235,1295 L 830.743,1292.21 L 828.736,1289.77 L 787.79,1248.82 L 785.344,1246.81 L 782.553,1245.32 L 779.525,1244.4 L 776.376,1244.09 L 238.583,1244.09 L 238.583,1210.24 L 2.3622,1210.24M 2.3622,1407.09 L 2.3622,1507.09 L 238.583,1507.09 L 238.583,1473.23 L 749.998,1473.23 L 750,1905.51 L 782.283,1905.51 L 782.282,1454.72 L 781.929,1451.37 L 780.886,1448.16 L 779.199,1445.24 L 776.941,1442.73 L 774.211,1440.74 L 771.128,1439.37 L 767.827,1438.67 L 764.453,1438.67 L 761.152,1439.37 L 757.795,1440.94 L 238.583,1440.94 L 238.583,1407.09 L 2.3622,1407.09M 2.3622,1607.09 L 2.3622,1707.09 L 238.583,1707.09 L 238.583,1673.23 L 698.818,1673.23 L 698.819,1905.51 L 731.102,1905.51 L 731.102,1663.39 L 730.792,1660.24 L 729.873,1657.21 L 728.381,1654.42 L 726.374,1651.97 L 720.074,1645.67 L 717.628,1643.66 L 714.837,1642.17 L 711.809,1641.25 L 708.66,1640.94 L 238.583,1640.94 L 238.583,1607.09 L 2.3622,1607.09M 2.3622,2.3622 L 2.3622,102.362 L 238.583,102.362 L 238.583,68.5033 L 1018.51,68.5031 L 1108.27,158.26 L 1108.27,1905.51 L 1140.55,1905.51 L 1140.55,151.573 L 1140.24,148.424 L 1139.32,145.396 L 1137.83,142.606 L 1135.82,140.159 L 1036.61,40.9475 L 1034.16,38.9401 L 1031.37,37.4484 L 1028.35,36.5298 L 1025.2,36.2197 L 238.583,36.2197 L 238.583,2.3622 L 2.3622,2.3622M 2.3622,202.362 L 2.3622,302.362 L 238.583,302.362 L 238.583,268.503 L 966.542,268.503 L 1057.09,359.048 L 1057.09,1905.51 L 1089.37,1905.51 L 1089.37,352.361 L 1089.06,349.212 L 1088.14,346.184 L 1086.65,343.394 L 1084.64,340.947 L 984.642,240.947 L 982.196,238.94 L 979.405,237.448 L 976.377,236.53 L 973.228,236.22 L 238.583,236.22 L 238.583,202.362 L 2.3622,202.362M 2.3622,402.362 L 2.3622,502.362 L 238.583,502.362 L 238.583,468.503 L 812.21,468.503 L 1005.9,662.198 L 1005.91,1905.51 L 1038.19,1905.51 L 1038.19,655.511 L 1037.88,652.362 L 1036.96,649.334 L 1035.47,646.544 L 1033.46,644.097 L 830.31,440.947 L 827.864,438.94 L 825.073,437.448 L 822.045,436.53 L 818.896,436.22 L 238.583,436.219 L 238.583,402.362 L 2.3622,402.362M 987.008,1905.51 L 987.008,761.809 L 986.698,758.66 L 985.779,755.632 L 984.287,752.841 L 982.28,750.395 L 872.83,640.947 L 870.384,638.94 L 867.593,637.448 L 864.565,636.53 L 861.416,636.22 L 238.583,636.22 L 238.583,602.362 L 2.3622,602.362 L 2.3622,702.362 L 238.583,702.362 L 238.583,668.503 L 854.73,668.503 L 954.724,768.496 L 954.724,1905.51 L 987.008,1905.51M 2.3622,802.362 L 2.3622,902.362 L 238.583,902.362 L 238.583,868.503 L 842.132,868.503 L 903.542,929.912 L 903.543,1905.51 L 935.827,1905.51 L 935.826,923.225 L 935.516,920.076 L 934.597,917.048 L 933.105,914.257 L 931.098,911.811 L 860.232,840.947 L 857.786,838.94 L 854.995,837.448 L 851.967,836.53 L 848.818,836.22 L 238.583,836.22 L 238.583,802.362 L 2.3622,802.362M 2.3622,1002.36 L 2.3622,1102.36 L 238.583,1102.36 L 238.583,1068.5 L 774.416,1068.5 L 852.36,1146.45 L 852.362,1905.51 L 884.646,1905.51 L 884.644,1139.76 L 884.334,1136.61 L 883.415,1133.59 L 881.923,1130.8 L 879.916,1128.35 L 792.516,1040.95 L 790.07,1038.94 L 787.279,1037.45 L 784.251,1036.53 L 781.102,1036.22 L 238.583,1036.22 L 238.583,1002.36 L 2.3622,1002.36M 810.094,2801.01 L 816.678,2801.01 L 823.119,2799.64 L 829.134,2796.96 L 834.461,2793.09 L 838.867,2788.2 L 842.159,2782.5 L 844.194,2776.23 L 844.882,2769.69 L 844.194,2763.14 L 842.159,2756.87 L 838.867,2751.17 L 837.4,2749.54 L 837.4,2727.16 L 879.916,2684.64 L 881.923,2682.2 L 883.415,2679.4 L 884.334,2676.38 L 884.644,2673.23 L 884.646,2255.91 L 852.362,2255.91 L 852.36,2666.54 L 809.844,2709.06 L 807.837,2711.5 L 806.345,2714.29 L 805.426,2717.32 L 805.116,2720.47 L 805.116,2739.42 L 803.653,2739.73 L 797.638,2742.41 L 792.311,2746.28 L 787.905,2751.17 L 784.613,2756.87 L 782.578,2763.14 L 781.89,2769.69 L 782.578,2776.23 L 784.613,2782.5 L 787.905,2788.2 L 792.311,2793.09 L 797.638,2796.96 L 803.653,2799.64 L 810.094,2801.01M 2.3622,2507.09 L 238.583,2507.09 L 238.583,2473.23 L 251.58,2473.23 L 299.608,2521.26 L 302.054,2523.26 L 304.845,2524.75 L 307.873,2525.67 L 311.022,2525.98 L 734.644,2525.98 L 737.793,2525.67 L 740.821,2524.75 L 743.612,2523.26 L 746.058,2521.26 L 777.554,2489.76 L 779.561,2487.31 L 781.053,2484.52 L 781.972,2481.49 L 782.282,2478.35 L 782.283,2255.91 L 750,2255.91 L 749.998,2471.66 L 727.958,2493.7 L 317.708,2493.7 L 269.68,2445.67 L 267.234,2443.66 L 264.443,2442.17 L 261.415,2441.25 L 258.266,2440.94 L 238.583,2440.94 L 238.583,2407.09 L 2.3622,2407.09 L 2.3622,2507.09M 2.3622,2007.09 L 2.3622,2107.09 L 238.583,2107.09 L 238.583,2073.23 L 578.352,2073.23 L 647.636,2142.51 L 647.638,2370.08 L 679.921,2370.08 L 679.92,2135.83 L 679.61,2132.68 L 678.691,2129.65 L 677.199,2126.86 L 675.192,2124.41 L 596.452,2045.67 L 594.006,2043.66 L 591.215,2042.17 L 588.187,2041.25 L 585.038,2040.94 L 238.583,2040.94 L 238.583,2007.09 L 2.3622,2007.09M 2.3622,2207.09 L 2.3622,2307.09 L 238.583,2307.09 L 238.583,2273.23 L 251.58,2273.23 L 436.616,2458.26 L 439.062,2460.27 L 441.853,2461.76 L 444.881,2462.68 L 448.03,2462.99 L 657.872,2462.99 L 661.021,2462.68 L 664.049,2461.76 L 666.84,2460.27 L 669.286,2458.26 L 726.374,2401.18 L 728.381,2398.73 L 729.873,2395.94 L 730.792,2392.91 L 731.102,2389.76 L 731.102,2255.91 L 698.819,2255.91 L 698.818,2383.08 L 651.186,2430.71 L 454.716,2430.71 L 269.68,2245.67 L 267.234,2243.66 L 264.443,2242.17 L 261.415,2241.25 L 258.266,2240.94 L 238.583,2240.94 L 238.583,2207.09 L 2.3622,2207.09M 2.3622,2707.09 L 238.583,2707.09 L 238.583,2673.23 L 681.888,2673.23 L 685.037,2672.92 L 688.065,2672 L 690.856,2670.51 L 693.302,2668.5 L 828.736,2533.07 L 830.743,2530.62 L 832.235,2527.83 L 833.154,2524.8 L 833.464,2521.65 L 833.464,2255.91 L 801.181,2255.91 L 801.18,2514.97 L 675.202,2640.94 L 238.583,2640.94 L 238.583,2607.09 L 2.3622,2607.09 L 2.3622,2707.09M 2.3622,3107.09 L 238.583,3107.09 L 238.583,3073.23 L 423.622,3073.23 L 426.771,3072.92 L 429.799,3072 L 432.59,3070.51 L 435.036,3068.5 L 607.472,2896.06 L 954.724,2896.06 L 954.724,3161.42 L 909.06,3207.09 L 896.063,3207.09 L 896.063,3160.24 L 777.953,3160.24 L 777.953,3286.22 L 896.063,3286.22 L 896.063,3239.37 L 915.746,3239.37 L 918.895,3239.06 L 921.923,3238.14 L 924.714,3236.65 L 927.16,3234.64 L 982.28,3179.52 L 984.287,3177.08 L 985.779,3174.29 L 986.698,3171.26 L 987.008,3168.11 L 987.008,2744.49 L 1067.32,2744.49 L 1067.32,2750.98 L 1067.68,2754.63 L 1068.75,2758.14 L 1070.47,2761.37 L 1072.8,2764.21 L 1075.63,2766.53 L 1080.59,2768.88 L 1084.19,2769.6 L 1123.43,2769.69 L 1128.85,2768.88 L 1133.81,2766.53 L 1137.88,2762.85 L 1140.7,2758.14 L 1142.04,2752.82 L 1142.13,2705.71 L 1141.77,2702.06 L 1139.92,2696.89 L 1136.65,2692.49 L 1133.81,2690.16 L 1128.85,2687.81 L 1123.43,2687.01 L 1086.02,2687.01 L 1082.38,2687.37 L 1078.87,2688.43 L 1075.63,2690.16 L 1072.8,2692.49 L 1069.53,2696.89 L 1068.13,2700.28 L 1067.41,2703.88 L 1067.32,2712.2 L 987.008,2712.2 L 987.008,2255.91 L 954.724,2255.91 L 954.724,2863.78 L 600.786,2863.78 L 597.637,2864.09 L 594.609,2865.01 L 591.818,2866.5 L 589.372,2868.51 L 416.936,3040.94 L 238.583,3040.94 L 238.583,3007.09 L 2.3622,3007.09 L 2.3622,3107.09M 1130.58,2630.47 L 1135.29,2627.64 L 1138.97,2623.58 L 1141.32,2618.62 L 1142.04,2615.02 L 1142.04,2566.08 L 1141.32,2562.48 L 1139.92,2559.1 L 1136.65,2554.69 L 1132.24,2551.42 L 1128.85,2550.02 L 1125.26,2549.3 L 1086.02,2549.21 L 1082.38,2549.57 L 1078.87,2550.64 L 1075.63,2552.36 L 1071.57,2556.05 L 1068.75,2560.76 L 1067.68,2564.27 L 1067.33,2567.73 L 1038.19,2538.59 L 1038.19,2255.91 L 1005.91,2255.91 L 1005.9,2545.28 L 1006.21,2548.42 L 1007.13,2551.45 L 1008.62,2554.24 L 1010.63,2556.69 L 1055.91,2601.96 L 1058.35,2603.97 L 1061.15,2605.46 L 1064.17,2606.38 L 1067.32,2606.69 L 1067.41,2615.02 L 1068.75,2620.35 L 1071.57,2625.05 L 1075.63,2628.74 L 1080.59,2631.08 L 1086.02,2631.89 L 1123.43,2631.89 L 1127.07,2631.53 L 1130.58,2630.47M 2.3622,3307.09 L 238.583,3307.09 L 238.583,3273.23 L 396.462,3273.23 L 557.876,3434.64 L 560.322,3436.65 L 563.113,3438.14 L 566.141,3439.06 L 569.29,3439.37 L 604.724,3439.37 L 604.724,3486.22 L 722.835,3486.22 L 722.835,3439.37 L 777.953,3439.37 L 777.953,3486.22 L 896.063,3486.22 L 896.063,3439.37 L 915.746,3439.37 L 918.895,3439.06 L 921.923,3438.14 L 924.714,3436.65 L 927.16,3434.64 L 1242.12,3119.68 L 1244.13,3117.24 L 1245.62,3114.44 L 1246.54,3111.42 L 1246.85,3108.27 L 1246.85,2509.84 L 1246.54,2506.69 L 1245.62,2503.66 L 1244.13,2500.87 L 1242.12,2498.43 L 1194.88,2451.18 L 1192.43,2449.18 L 1189.64,2447.68 L 1186.61,2446.77 L 1183.46,2446.46 L 1152.75,2446.46 L 1089.37,2383.08 L 1089.37,2255.91 L 1057.09,2255.91 L 1057.09,2389.76 L 1057.4,2392.91 L 1058.32,2395.94 L 1059.81,2398.73 L 1061.81,2401.18 L 1134.65,2474.01 L 1137.09,2476.02 L 1139.88,2477.51 L 1142.91,2478.43 L 1146.06,2478.74 L 1176.78,2478.74 L 1214.57,2516.53 L 1214.57,3101.58 L 909.06,3407.09 L 896.063,3407.09 L 896.063,3360.24 L 777.953,3360.24 L 777.953,3407.09 L 722.835,3407.09 L 722.835,3360.24 L 604.724,3360.24 L 604.724,3407.09 L 575.976,3407.09 L 414.562,3245.67 L 412.116,3243.66 L 409.325,3242.17 L 406.297,3241.25 L 403.148,3240.94 L 238.583,3240.94 L 238.583,3207.09 L 2.3622,3207.09 L 2.3622,3307.09 z " style="fill-opacity:1.000000;fill:rgb(103,198,105);stroke:rgb(0,0,0);stroke-width:2"/></g>
</svg>
