$ cd /
$ ls
dir a
14848514 b.txt
8504156 c.dat
dir d
dir g
$ cd a
$ ls
dir e
29116 f
2557 g
62596 h.lst
$ cd e
$ ls
584 i
$ cd ..
$ cd ..
$ cd d
$ ls
800 j
700 d.log
600 d.ext
500 k
$ cd ..
$ cd g
$ ls
666 vlasta
dir p
$ cd p
$ ls
999999999 xd