<?xml version="1.0" encoding="UTF-8" standalone="no"?>
<!-- Created with Inkscape (http://www.inkscape.org/) -->

<svg
   width="48"
   height="48"
   viewBox="0 0 12.7 12.7"
   version="1.1"
   id="svg5"
   inkscape:version="1.2.2 (b0a8486541, 2022-12-01)"
   sodipodi:docname="gitlab_logo.svg"
   inkscape:export-filename="gitlab_logo.png"
   inkscape:export-xdpi="500"
   inkscape:export-ydpi="500"
   xmlns:inkscape="http://www.inkscape.org/namespaces/inkscape"
   xmlns:sodipodi="http://sodipodi.sourceforge.net/DTD/sodipodi-0.dtd"
   xmlns="http://www.w3.org/2000/svg"
   xmlns:svg="http://www.w3.org/2000/svg">
  <sodipodi:namedview
     id="namedview7"
     pagecolor="#ffffff"
     bordercolor="#cccccc"
     borderopacity="1"
     inkscape:showpageshadow="0"
     inkscape:pageopacity="1"
     inkscape:pagecheckerboard="0"
     inkscape:deskcolor="#d1d1d1"
     inkscape:document-units="mm"
     showgrid="false"
     inkscape:zoom="10.335465"
     inkscape:cx="23.608034"
     inkscape:cy="15.722564"
     inkscape:window-width="1499"
     inkscape:window-height="1236"
     inkscape:window-x="50"
     inkscape:window-y="82"
     inkscape:window-maximized="0"
     inkscape:current-layer="layer1" />
  <defs
     id="defs2" />
  <g
     inkscape:label="Layer 1"
     inkscape:groupmode="layer"
     id="layer1">
    <text
       xml:space="preserve"
       style="font-size:17.6389px;line-height:1.25;font-family:sans-serif;stroke-width:0.264583"
       x="1.190966"
       y="11.319553"
       id="text1516"><tspan
         sodipodi:role="line"
         style="font-style:normal;font-variant:normal;font-weight:normal;font-stretch:normal;font-size:17.6389px;font-family:Courier;-inkscape-font-specification:Courier;stroke-width:0.264583"
         x="1.190966"
         y="11.319553"
         id="tspan1570">D</tspan></text>
    <text
       xml:space="preserve"
       style="font-size:4.23333px;line-height:0.85;font-family:sans-serif;stroke-width:0.264583"
       x="4.0140085"
       y="5.72614"
       id="text1576"><tspan
         sodipodi:role="line"
         id="tspan1574"
         style="font-style:normal;font-variant:normal;font-weight:normal;font-stretch:normal;font-size:4.23333px;font-family:Courier;-inkscape-font-specification:Courier;stroke-width:0.264583"
         x="4.0140085"
         y="5.72614">ST</tspan><tspan
         sodipodi:role="line"
         style="font-style:normal;font-variant:normal;font-weight:normal;font-stretch:normal;font-size:4.23333px;font-family:Courier;-inkscape-font-specification:Courier;stroke-width:0.264583"
         x="4.0140085"
         y="9.3468399"
         id="tspan1578">LS</tspan></text>
  </g>
</svg>
