-- System definition:
Coordinates=V,n
Parameters=C,Iext,p3,p4,p5,p6,p7,p8,p9,p10,p11,p12,p13,p14,p15,p16,p17,p18,p19,p20,p21,p22,p23,p24,p25,p26,p27,p28,p29,p30,p31,p32,p33,p34,p35,p36,p37,p38,p39,p40,p41,p42,p43,p44
Time=t

-- Equations:
V'=p3 + C*p22 + Iext*p25 + V*p4 + n*p7 + p5*(V^2) + p6*(V^3) + p12*(n^2) + p16*(n^3) + p19*(n^4) + p21*(n^5) + C*V*p23 + C*n*p24 + V*n*p8 + V*p13*(n^2) + V*p17*(n^3) + n*p10*(V^3) + n*p9*(V^2) + n*p11*(V^4) + V*p20*(n^4) + p14*(V^2)*(n^2) + p18*(V^2)*(n^3) + p15*(V^3)*(n^2)
n'=p26 + V*p27 + n*p29 + C*p41 + Iext*p44 + p28*(V^2) + p32*(n^2) + p35*(n^3) + p38*(n^4) + p40*(n^5) + C*V*p42 + V*n*p30 + C*n*p43 + n*p31*(V^2) + V*p33*(n^2) + V*p36*(n^3) + V*p39*(n^4) + p34*(V^2)*(n^2) + p37*(V^2)*(n^3)

-- Values:
V=-40.86569607432645
n=0.01633152345760322
C => 0.7
Iext => 36.0
p3 => 0.1389474543
p4 => 4.5688900986
p5 => -0.0087932366
p6 => -0.0023788042
p7 => -1752.7341956319
p8 => -130.6886672886
p9 => -0.1691080862
p10 => 0.0408687796
p11 => -0.000116242
p12 => 1219.376000405
p13 => 387.9284690319
p14 => 10.466773321
p15 => -0.131871231
p16 => 21344.4915042812
p17 => 860.2908536883
p18 => -28.5747958674
p19 => -21008.2127433172
p20 => -2737.5916834087
p21 => -11904.5974802098
p22 => 0.3573717315
p23 => 4.1423732601
p24 => -1226.9109886482
p25 => 4.7135717522
p26 => 1.45777e-5
p27 => 0.0006381581
p28 => 1.59498e-5
p29 => 0.1385532501
p30 => 0.0072144841
p31 => -9.56326e-5
p32 => -0.7783553991
p33 => -0.0667371125
p34 => -0.0001667228
p35 => 0.2308855634
p36 => 0.2175059517
p37 => 0.0009180165
p38 => -0.8665897294
p39 => -0.2200700203
p40 => 1.3235810637
p41 => 3.65448e-5
p42 => 0.0005015164
p43 => 0.0969871073
p44 => 0.0004385832

