<?xml version="1.0" encoding="UTF-8"?>
<svg xmlns="http://www.w3.org/2000/svg" xmlns:xlink="http://www.w3.org/1999/xlink" width="396pt" height="252pt" viewBox="0 0 396 252" version="1.1">
<defs>
<g>
<symbol overflow="visible" id="glyph0-0-9h0umUqD">
<path style="stroke:none;" d="M 0.234375 -8.75 C 0.234375 -8.75 0.234375 0 0.234375 0 C 0.234375 0 5.640625 0 5.640625 0 C 5.640625 0 5.640625 -8.75 5.640625 -8.75 C 5.640625 -8.75 0.234375 -8.75 0.234375 -8.75 Z M 0.859375 -0.625 C 0.859375 -0.625 0.859375 -8.125 0.859375 -8.125 C 0.859375 -8.125 5.015625 -8.125 5.015625 -8.125 C 5.015625 -8.125 5.015625 -0.625 5.015625 -0.625 C 5.015625 -0.625 0.859375 -0.625 0.859375 -0.625 Z M 0.859375 -0.625 "/>
</symbol>
<symbol overflow="visible" id="glyph0-1-9h0umUqD">
<path style="stroke:none;" d="M 3.40625 -2.875 C 3.40625 -2.875 0.546875 -2.875 0.546875 -2.875 C 0.546875 -2.875 0.546875 -3.75 0.546875 -3.75 C 0.546875 -3.75 3.40625 -3.75 3.40625 -3.75 C 3.40625 -3.75 3.40625 -2.875 3.40625 -2.875 Z M 3.40625 -2.875 "/>
</symbol>
<symbol overflow="visible" id="glyph1-0-9h0umUqD">
<path style="stroke:none;" d="M 0.234375 -8.75 C 0.234375 -8.75 0.234375 0 0.234375 0 C 0.234375 0 5.640625 0 5.640625 0 C 5.640625 0 5.640625 -8.75 5.640625 -8.75 C 5.640625 -8.75 0.234375 -8.75 0.234375 -8.75 Z M 0.859375 -0.625 C 0.859375 -0.625 0.859375 -8.125 0.859375 -8.125 C 0.859375 -8.125 5.015625 -8.125 5.015625 -8.125 C 5.015625 -8.125 5.015625 -0.625 5.015625 -0.625 C 5.015625 -0.625 0.859375 -0.625 0.859375 -0.625 Z M 0.859375 -0.625 "/>
</symbol>
<symbol overflow="visible" id="glyph1-1-9h0umUqD">
<path style="stroke:none;" d="M 6.125 -6.015625 C 6.125 -4.96875 5.515625 -4.078125 4.328125 -3.4375 C 4.328125 -3.4375 3.125 -2.796875 3.125 -2.796875 C 2.09375 -2.1875 1.703125 -1.734375 1.59375 -1.046875 C 1.59375 -1.046875 6.078125 -1.046875 6.078125 -1.046875 C 6.078125 -1.046875 6.078125 0 6.078125 0 C 6.078125 0 0.40625 0 0.40625 0 C 0.5 -1.875 1.015625 -2.671875 2.796875 -3.6875 C 2.796875 -3.6875 3.90625 -4.3125 3.90625 -4.3125 C 4.65625 -4.734375 5.046875 -5.3125 5.046875 -5.984375 C 5.046875 -6.90625 4.328125 -7.578125 3.375 -7.578125 C 2.328125 -7.578125 1.734375 -6.984375 1.65625 -5.5625 C 1.65625 -5.5625 0.59375 -5.5625 0.59375 -5.5625 C 0.65625 -7.625 1.671875 -8.515625 3.40625 -8.515625 C 5.015625 -8.515625 6.125 -7.453125 6.125 -6.015625 Z M 6.125 -6.015625 "/>
</symbol>
<symbol overflow="visible" id="glyph2-0-9h0umUqD">
<path style="stroke:none;" d="M 0.234375 -8.75 C 0.234375 -8.75 0.234375 0 0.234375 0 C 0.234375 0 5.640625 0 5.640625 0 C 5.640625 0 5.640625 -8.75 5.640625 -8.75 C 5.640625 -8.75 0.234375 -8.75 0.234375 -8.75 Z M 0.859375 -0.625 C 0.859375 -0.625 0.859375 -8.125 0.859375 -8.125 C 0.859375 -8.125 5.015625 -8.125 5.015625 -8.125 C 5.015625 -8.125 5.015625 -0.625 5.015625 -0.625 C 5.015625 -0.625 0.859375 -0.625 0.859375 -0.625 Z M 0.859375 -0.625 "/>
</symbol>
<symbol overflow="visible" id="glyph2-1-9h0umUqD">
<path style="stroke:none;" d="M 6.078125 -4.09375 C 6.078125 -1.296875 5.09375 0.1875 3.296875 0.1875 C 1.46875 0.1875 0.515625 -1.296875 0.515625 -4.15625 C 0.515625 -7.015625 1.46875 -8.515625 3.296875 -8.515625 C 5.140625 -8.515625 6.078125 -7.046875 6.078125 -4.09375 Z M 5 -4.1875 C 5 -6.46875 4.4375 -7.578125 3.296875 -7.578125 C 2.15625 -7.578125 1.59375 -6.484375 1.59375 -4.15625 C 1.59375 -1.828125 2.15625 -0.703125 3.28125 -0.703125 C 4.453125 -0.703125 5 -1.78125 5 -4.1875 Z M 5 -4.1875 "/>
</symbol>
<symbol overflow="visible" id="glyph3-0-9h0umUqD">
<path style="stroke:none;" d="M 0.234375 -8.75 C 0.234375 -8.75 0.234375 0 0.234375 0 C 0.234375 0 5.640625 0 5.640625 0 C 5.640625 0 5.640625 -8.75 5.640625 -8.75 C 5.640625 -8.75 0.234375 -8.75 0.234375 -8.75 Z M 0.859375 -0.625 C 0.859375 -0.625 0.859375 -8.125 0.859375 -8.125 C 0.859375 -8.125 5.015625 -8.125 5.015625 -8.125 C 5.015625 -8.125 5.015625 -0.625 5.015625 -0.625 C 5.015625 -0.625 0.859375 -0.625 0.859375 -0.625 Z M 0.859375 -0.625 "/>
</symbol>
<symbol overflow="visible" id="glyph3-1-9h0umUqD">
<path style="stroke:none;" d="M 6.125 -6.015625 C 6.125 -4.96875 5.515625 -4.078125 4.328125 -3.4375 C 4.328125 -3.4375 3.125 -2.796875 3.125 -2.796875 C 2.09375 -2.1875 1.703125 -1.734375 1.59375 -1.046875 C 1.59375 -1.046875 6.078125 -1.046875 6.078125 -1.046875 C 6.078125 -1.046875 6.078125 0 6.078125 0 C 6.078125 0 0.40625 0 0.40625 0 C 0.5 -1.875 1.015625 -2.671875 2.796875 -3.6875 C 2.796875 -3.6875 3.90625 -4.3125 3.90625 -4.3125 C 4.65625 -4.734375 5.046875 -5.3125 5.046875 -5.984375 C 5.046875 -6.90625 4.328125 -7.578125 3.375 -7.578125 C 2.328125 -7.578125 1.734375 -6.984375 1.65625 -5.5625 C 1.65625 -5.5625 0.59375 -5.5625 0.59375 -5.5625 C 0.65625 -7.625 1.671875 -8.515625 3.40625 -8.515625 C 5.015625 -8.515625 6.125 -7.453125 6.125 -6.015625 Z M 6.125 -6.015625 "/>
</symbol>
<symbol overflow="visible" id="glyph3-2-9h0umUqD">
<path style="stroke:none;" d="M 8.125 -3.1875 C 7.859375 -0.90625 6.65625 0.21875 4.53125 0.21875 C 1.953125 0.21875 0.578125 -1.71875 0.578125 -4.265625 C 0.578125 -6.828125 1.921875 -8.96875 4.578125 -8.96875 C 6.484375 -8.96875 7.59375 -7.953125 7.9375 -6.03125 C 7.9375 -6.03125 6.796875 -6.03125 6.796875 -6.03125 C 6.53125 -7.375 5.8125 -7.984375 4.4375 -7.984375 C 2.75 -7.984375 1.6875 -6.53125 1.6875 -4.28125 C 1.6875 -2.09375 2.796875 -0.765625 4.53125 -0.765625 C 6.015625 -0.765625 6.703125 -1.53125 6.96875 -3.1875 C 6.96875 -3.1875 8.125 -3.1875 8.125 -3.1875 Z M 8.125 -3.1875 "/>
</symbol>
<symbol overflow="visible" id="glyph3-3-9h0umUqD">
<path style="stroke:none;" d="M 8 -4.375 C 8 -1.65625 6.640625 0 4.4375 0 C 4.4375 0 1.0625 0 1.0625 0 C 1.0625 0 1.0625 -8.75 1.0625 -8.75 C 1.0625 -8.75 4.4375 -8.75 4.4375 -8.75 C 6.65625 -8.75 8 -7.09375 8 -4.375 Z M 6.890625 -4.375 C 6.890625 -6.59375 5.96875 -7.765625 4.25 -7.765625 C 4.25 -7.765625 2.1875 -7.765625 2.1875 -7.765625 C 2.1875 -7.765625 2.1875 -0.984375 2.1875 -0.984375 C 2.1875 -0.984375 4.25 -0.984375 4.25 -0.984375 C 5.96875 -0.984375 6.890625 -2.15625 6.890625 -4.375 Z M 6.890625 -4.375 "/>
</symbol>
<symbol overflow="visible" id="glyph4-0-9h0umUqD">
<path style="stroke:none;" d="M 0.234375 -8.75 C 0.234375 -8.75 0.234375 0 0.234375 0 C 0.234375 0 5.640625 0 5.640625 0 C 5.640625 0 5.640625 -8.75 5.640625 -8.75 C 5.640625 -8.75 0.234375 -8.75 0.234375 -8.75 Z M 0.859375 -0.625 C 0.859375 -0.625 0.859375 -8.125 0.859375 -8.125 C 0.859375 -8.125 5.015625 -8.125 5.015625 -8.125 C 5.015625 -8.125 5.015625 -0.625 5.015625 -0.625 C 5.015625 -0.625 0.859375 -0.625 0.859375 -0.625 Z M 0.859375 -0.625 "/>
</symbol>
<symbol overflow="visible" id="glyph4-1-9h0umUqD">
<path style="stroke:none;" d="M 4.15625 0 C 4.15625 0 3.109375 0 3.109375 0 C 3.109375 0 3.109375 -6.0625 3.109375 -6.0625 C 3.109375 -6.0625 1.21875 -6.0625 1.21875 -6.0625 C 1.21875 -6.0625 1.21875 -6.8125 1.21875 -6.8125 C 2.859375 -7.015625 3.09375 -7.203125 3.46875 -8.515625 C 3.46875 -8.515625 4.15625 -8.515625 4.15625 -8.515625 C 4.15625 -8.515625 4.15625 0 4.15625 0 Z M 4.15625 0 "/>
</symbol>
<symbol overflow="visible" id="glyph4-2-9h0umUqD">
<path style="stroke:none;" d="M 6.234375 -2.046875 C 6.234375 -2.046875 4.984375 -2.046875 4.984375 -2.046875 C 4.984375 -2.046875 4.984375 0 4.984375 0 C 4.984375 0 3.921875 0 3.921875 0 C 3.921875 0 3.921875 -2.046875 3.921875 -2.046875 C 3.921875 -2.046875 0.34375 -2.046875 0.34375 -2.046875 C 0.34375 -2.046875 0.34375 -3.15625 0.34375 -3.15625 C 0.34375 -3.15625 4.203125 -8.515625 4.203125 -8.515625 C 4.203125 -8.515625 4.984375 -8.515625 4.984375 -8.515625 C 4.984375 -8.515625 4.984375 -2.984375 4.984375 -2.984375 C 4.984375 -2.984375 6.234375 -2.984375 6.234375 -2.984375 C 6.234375 -2.984375 6.234375 -2.046875 6.234375 -2.046875 Z M 3.921875 -2.984375 C 3.921875 -2.984375 3.921875 -6.703125 3.921875 -6.703125 C 3.921875 -6.703125 1.265625 -2.984375 1.265625 -2.984375 C 1.265625 -2.984375 3.921875 -2.984375 3.921875 -2.984375 Z M 3.921875 -2.984375 "/>
</symbol>
<symbol overflow="visible" id="glyph5-0-9h0umUqD">
<path style="stroke:none;" d="M 0.234375 -8.75 C 0.234375 -8.75 0.234375 0 0.234375 0 C 0.234375 0 5.640625 0 5.640625 0 C 5.640625 0 5.640625 -8.75 5.640625 -8.75 C 5.640625 -8.75 0.234375 -8.75 0.234375 -8.75 Z M 0.859375 -0.625 C 0.859375 -0.625 0.859375 -8.125 0.859375 -8.125 C 0.859375 -8.125 5.015625 -8.125 5.015625 -8.125 C 5.015625 -8.125 5.015625 -0.625 5.015625 -0.625 C 5.015625 -0.625 0.859375 -0.625 0.859375 -0.625 Z M 0.859375 -0.625 "/>
</symbol>
<symbol overflow="visible" id="glyph5-1-9h0umUqD">
<path style="stroke:none;" d="M 6.125 -6.015625 C 6.125 -4.96875 5.515625 -4.078125 4.328125 -3.4375 C 4.328125 -3.4375 3.125 -2.796875 3.125 -2.796875 C 2.09375 -2.1875 1.703125 -1.734375 1.59375 -1.046875 C 1.59375 -1.046875 6.078125 -1.046875 6.078125 -1.046875 C 6.078125 -1.046875 6.078125 0 6.078125 0 C 6.078125 0 0.40625 0 0.40625 0 C 0.5 -1.875 1.015625 -2.671875 2.796875 -3.6875 C 2.796875 -3.6875 3.90625 -4.3125 3.90625 -4.3125 C 4.65625 -4.734375 5.046875 -5.3125 5.046875 -5.984375 C 5.046875 -6.90625 4.328125 -7.578125 3.375 -7.578125 C 2.328125 -7.578125 1.734375 -6.984375 1.65625 -5.5625 C 1.65625 -5.5625 0.59375 -5.5625 0.59375 -5.5625 C 0.65625 -7.625 1.671875 -8.515625 3.40625 -8.515625 C 5.015625 -8.515625 6.125 -7.453125 6.125 -6.015625 Z M 6.125 -6.015625 "/>
</symbol>
<symbol overflow="visible" id="glyph6-0-9h0umUqD">
<path style="stroke:none;" d="M 0.234375 -8.75 C 0.234375 -8.75 0.234375 0 0.234375 0 C 0.234375 0 5.640625 0 5.640625 0 C 5.640625 0 5.640625 -8.75 5.640625 -8.75 C 5.640625 -8.75 0.234375 -8.75 0.234375 -8.75 Z M 0.859375 -0.625 C 0.859375 -0.625 0.859375 -8.125 0.859375 -8.125 C 0.859375 -8.125 5.015625 -8.125 5.015625 -8.125 C 5.015625 -8.125 5.015625 -0.625 5.015625 -0.625 C 5.015625 -0.625 0.859375 -0.625 0.859375 -0.625 Z M 0.859375 -0.625 "/>
</symbol>
<symbol overflow="visible" id="glyph6-1-9h0umUqD">
<path style="stroke:none;" d="M 6.078125 -2.46875 C 6.078125 -0.859375 4.9375 0.1875 3.1875 0.1875 C 1.453125 0.1875 0.515625 -0.671875 0.390625 -2.5625 C 0.390625 -2.5625 1.4375 -2.5625 1.4375 -2.5625 C 1.515625 -1.328125 2.078125 -0.75 3.234375 -0.75 C 4.328125 -0.75 4.984375 -1.390625 4.984375 -2.453125 C 4.984375 -3.40625 4.390625 -3.953125 3.234375 -3.953125 C 3.234375 -3.953125 2.65625 -3.953125 2.65625 -3.953125 C 2.65625 -3.953125 2.65625 -4.84375 2.65625 -4.84375 C 4.34375 -4.84375 4.734375 -5.21875 4.734375 -6.125 C 4.734375 -7.03125 4.171875 -7.578125 3.234375 -7.578125 C 2.15625 -7.578125 1.640625 -7.015625 1.625 -5.765625 C 1.625 -5.765625 0.5625 -5.765625 0.5625 -5.765625 C 0.59375 -7.578125 1.515625 -8.515625 3.234375 -8.515625 C 4.84375 -8.515625 5.8125 -7.625 5.8125 -6.171875 C 5.8125 -5.3125 5.421875 -4.765625 4.625 -4.453125 C 5.65625 -4.109375 6.078125 -3.5 6.078125 -2.46875 Z M 6.078125 -2.46875 "/>
</symbol>
<symbol overflow="visible" id="glyph7-0-9h0umUqD">
<path style="stroke:none;" d="M 0.234375 -8.75 C 0.234375 -8.75 0.234375 0 0.234375 0 C 0.234375 0 5.640625 0 5.640625 0 C 5.640625 0 5.640625 -8.75 5.640625 -8.75 C 5.640625 -8.75 0.234375 -8.75 0.234375 -8.75 Z M 0.859375 -0.625 C 0.859375 -0.625 0.859375 -8.125 0.859375 -8.125 C 0.859375 -8.125 5.015625 -8.125 5.015625 -8.125 C 5.015625 -8.125 5.015625 -0.625 5.015625 -0.625 C 5.015625 -0.625 0.859375 -0.625 0.859375 -0.625 Z M 0.859375 -0.625 "/>
</symbol>
<symbol overflow="visible" id="glyph7-1-9h0umUqD">
<path style="stroke:none;" d="M 7.84375 0 C 7.84375 0 6.59375 0 6.59375 0 C 6.59375 0 5.6875 -2.625 5.6875 -2.625 C 5.6875 -2.625 2.3125 -2.625 2.3125 -2.625 C 2.3125 -2.625 1.390625 0 1.390625 0 C 1.390625 0 0.203125 0 0.203125 0 C 0.203125 0 3.328125 -8.75 3.328125 -8.75 C 3.328125 -8.75 4.765625 -8.75 4.765625 -8.75 C 4.765625 -8.75 7.84375 0 7.84375 0 Z M 5.375 -3.5625 C 5.375 -3.5625 4.03125 -7.546875 4.03125 -7.546875 C 4.03125 -7.546875 2.59375 -3.5625 2.59375 -3.5625 C 2.59375 -3.5625 5.375 -3.5625 5.375 -3.5625 Z M 5.375 -3.5625 "/>
</symbol>
<symbol overflow="visible" id="glyph8-0-9h0umUqD">
<path style="stroke:none;" d="M 0.234375 -8.75 C 0.234375 -8.75 0.234375 0 0.234375 0 C 0.234375 0 5.640625 0 5.640625 0 C 5.640625 0 5.640625 -8.75 5.640625 -8.75 C 5.640625 -8.75 0.234375 -8.75 0.234375 -8.75 Z M 0.859375 -0.625 C 0.859375 -0.625 0.859375 -8.125 0.859375 -8.125 C 0.859375 -8.125 5.015625 -8.125 5.015625 -8.125 C 5.015625 -8.125 5.015625 -0.625 5.015625 -0.625 C 5.015625 -0.625 0.859375 -0.625 0.859375 -0.625 Z M 0.859375 -0.625 "/>
</symbol>
<symbol overflow="visible" id="glyph8-1-9h0umUqD">
<path style="stroke:none;" d="M 7.46875 -2.5 C 7.46875 -1.0625 6.46875 0 4.890625 0 C 4.890625 0 0.953125 0 0.953125 0 C 0.953125 0 0.953125 -8.75 0.953125 -8.75 C 0.953125 -8.75 4.5 -8.75 4.5 -8.75 C 6.15625 -8.75 7.09375 -7.796875 7.09375 -6.53125 C 7.09375 -5.640625 6.671875 -4.984375 5.875 -4.625 C 7 -4.1875 7.46875 -3.546875 7.46875 -2.5 Z M 5.96875 -6.375 C 5.96875 -7.265625 5.453125 -7.765625 4.21875 -7.765625 C 4.21875 -7.765625 2.0625 -7.765625 2.0625 -7.765625 C 2.0625 -7.765625 2.0625 -4.984375 2.0625 -4.984375 C 2.0625 -4.984375 4.21875 -4.984375 4.21875 -4.984375 C 5.453125 -4.984375 5.96875 -5.484375 5.96875 -6.375 Z M 6.359375 -2.484375 C 6.359375 -3.34375 5.84375 -4 4.78125 -4 C 4.78125 -4 2.0625 -4 2.0625 -4 C 2.0625 -4 2.0625 -0.984375 2.0625 -0.984375 C 2.0625 -0.984375 4.78125 -0.984375 4.78125 -0.984375 C 5.84375 -0.984375 6.359375 -1.640625 6.359375 -2.484375 Z M 6.359375 -2.484375 "/>
</symbol>
</g>
<clipPath id="clip1-9h0umUqD">
  <path d="M 302 12 L 311 12 L 311 19 L 302 19 Z M 302 12 "/>
</clipPath>
</defs>
<g id="surface1-9h0umUqD">
<rect x="0" y="0" width="396" height="252" style="fill:rgb(100%,100%,100%);fill-opacity:1;stroke:none;"/>
<path style=" stroke:none;fill-rule:nonzero;fill:rgb(100%,100%,100%);fill-opacity:1;" d="M 26.25 219.75 L 384 219.75 L 384 12 L 26.25 12 Z M 26.25 219.75 "/>
<path style="fill:none;stroke-width:1;stroke-linecap:butt;stroke-linejoin:miter;stroke:rgb(0%,0%,0%);stroke-opacity:0.12;stroke-miterlimit:2;" d="M 56.682292 293 L 56.682292 16 " transform="matrix(0.75,0,0,0.75,0,0)"/>
<path style="fill:none;stroke-width:1;stroke-linecap:butt;stroke-linejoin:miter;stroke:rgb(0%,0%,0%);stroke-opacity:0.12;stroke-miterlimit:2;" d="M 230.135417 293 L 230.135417 16 " transform="matrix(0.75,0,0,0.75,0,0)"/>
<path style="fill:none;stroke-width:1;stroke-linecap:butt;stroke-linejoin:miter;stroke:rgb(0%,0%,0%);stroke-opacity:0.12;stroke-miterlimit:2;" d="M 403.588542 293 L 403.588542 16 " transform="matrix(0.75,0,0,0.75,0,0)"/>
<path style="fill:none;stroke-width:1;stroke-linecap:butt;stroke-linejoin:miter;stroke:rgb(0%,0%,0%);stroke-opacity:0.12;stroke-miterlimit:2;" d="M 35 280.411458 L 512 280.411458 " transform="matrix(0.75,0,0,0.75,0,0)"/>
<path style="fill:none;stroke-width:1;stroke-linecap:butt;stroke-linejoin:miter;stroke:rgb(0%,0%,0%);stroke-opacity:0.12;stroke-miterlimit:2;" d="M 35 196.46875 L 512 196.46875 " transform="matrix(0.75,0,0,0.75,0,0)"/>
<path style="fill:none;stroke-width:1;stroke-linecap:butt;stroke-linejoin:miter;stroke:rgb(0%,0%,0%);stroke-opacity:0.12;stroke-miterlimit:2;" d="M 35 112.53125 L 512 112.53125 " transform="matrix(0.75,0,0,0.75,0,0)"/>
<path style="fill:none;stroke-width:1;stroke-linecap:butt;stroke-linejoin:miter;stroke:rgb(0%,0%,0%);stroke-opacity:0.12;stroke-miterlimit:2;" d="M 35 28.588542 L 512 28.588542 " transform="matrix(0.75,0,0,0.75,0,0)"/>
<g style="fill:rgb(0%,0%,0%);fill-opacity:1;">
  <use xlink:href="#glyph0-1-9h0umUqD" x="37.177377" y="237.864006"/>
</g>
<g style="fill:rgb(0%,0%,0%);fill-opacity:1;">
  <use xlink:href="#glyph1-1-9h0umUqD" x="41.173368" y="237.864006"/>
</g>
<g style="fill:rgb(0%,0%,0%);fill-opacity:1;">
  <use xlink:href="#glyph2-1-9h0umUqD" x="169.266289" y="237.864006"/>
</g>
<g style="fill:rgb(0%,0%,0%);fill-opacity:1;">
  <use xlink:href="#glyph3-1-9h0umUqD" x="299.357231" y="237.864006"/>
</g>
<g style="fill:rgb(0%,0%,0%);fill-opacity:1;">
  <use xlink:href="#glyph4-1-9h0umUqD" x="11.32801" y="214.680817"/>
</g>
<g style="fill:rgb(0%,0%,0%);fill-opacity:1;">
  <use xlink:href="#glyph5-1-9h0umUqD" x="11.32801" y="151.726261"/>
</g>
<g style="fill:rgb(0%,0%,0%);fill-opacity:1;">
  <use xlink:href="#glyph6-1-9h0umUqD" x="11.32801" y="88.771711"/>
</g>
<g style="fill:rgb(0%,0%,0%);fill-opacity:1;">
  <use xlink:href="#glyph4-2-9h0umUqD" x="11.32801" y="25.817179"/>
</g>
<path style="fill:none;stroke-width:1.5;stroke-linecap:butt;stroke-linejoin:miter;stroke:rgb(0%,44.705883%,69.803923%);stroke-opacity:1;stroke-miterlimit:2;" d="M 403.588542 28.588542 L 490.317708 280.411458 L 56.682292 196.46875 L 403.588542 28.588542 " transform="matrix(0.75,0,0,0.75,0,0)"/>
<path style=" stroke:none;fill-rule:nonzero;fill:rgb(0%,44.705883%,69.803923%);fill-opacity:1;" d="M 305.867188 21.441406 C 305.867188 17.214844 299.519531 17.214844 299.519531 21.441406 C 299.519531 25.671875 305.867188 25.671875 305.867188 21.441406 Z M 305.867188 21.441406 "/>
<path style=" stroke:none;fill-rule:nonzero;fill:rgb(0%,44.705883%,69.803923%);fill-opacity:1;" d="M 45.683594 147.351562 C 45.683594 143.121094 39.339844 143.121094 39.339844 147.351562 C 39.339844 151.582031 45.683594 151.582031 45.683594 147.351562 Z M 45.683594 147.351562 "/>
<path style=" stroke:none;fill-rule:nonzero;fill:rgb(0%,44.705883%,69.803923%);fill-opacity:1;" d="M 370.910156 210.308594 C 370.910156 206.078125 364.566406 206.078125 364.566406 210.308594 C 364.566406 214.535156 370.910156 214.535156 370.910156 210.308594 Z M 370.910156 210.308594 "/>
<path style=" stroke:none;fill-rule:nonzero;fill:rgb(0%,44.705883%,69.803923%);fill-opacity:1;" d="M 240.820312 84.398438 C 240.820312 80.167969 234.476562 80.167969 234.476562 84.398438 C 234.476562 88.628906 240.820312 88.628906 240.820312 84.398438 Z M 240.820312 84.398438 "/>
<g clip-path="url(#clip1-9h0umUqD)" clip-rule="nonzero">
<g style="fill:rgb(0%,0%,0%);fill-opacity:1;">
  <use xlink:href="#glyph7-1-9h0umUqD" x="302.693184" y="18.827181"/>
</g>
</g>
<g style="fill:rgb(0%,0%,0%);fill-opacity:1;">
  <use xlink:href="#glyph8-1-9h0umUqD" x="42.511359" y="144.736267"/>
</g>
<g style="fill:rgb(0%,0%,0%);fill-opacity:1;">
  <use xlink:href="#glyph3-2-9h0umUqD" x="367.738632" y="207.690811"/>
</g>
<g style="fill:rgb(0%,0%,0%);fill-opacity:1;">
  <use xlink:href="#glyph3-3-9h0umUqD" x="237.647736" y="81.781717"/>
</g>
<path style="fill:none;stroke-width:1;stroke-linecap:butt;stroke-linejoin:miter;stroke:rgb(0%,0%,0%);stroke-opacity:1;stroke-miterlimit:2;" d="M 56.682292 293.5 L 56.682292 299.5 " transform="matrix(0.75,0,0,0.75,0,0)"/>
<path style="fill:none;stroke-width:1;stroke-linecap:butt;stroke-linejoin:miter;stroke:rgb(0%,0%,0%);stroke-opacity:1;stroke-miterlimit:2;" d="M 230.135417 293.5 L 230.135417 299.5 " transform="matrix(0.75,0,0,0.75,0,0)"/>
<path style="fill:none;stroke-width:1;stroke-linecap:butt;stroke-linejoin:miter;stroke:rgb(0%,0%,0%);stroke-opacity:1;stroke-miterlimit:2;" d="M 403.588542 293.5 L 403.588542 299.5 " transform="matrix(0.75,0,0,0.75,0,0)"/>
<path style="fill:none;stroke-width:1;stroke-linecap:butt;stroke-linejoin:miter;stroke:rgb(0%,0%,0%);stroke-opacity:1;stroke-miterlimit:2;" d="M 34.5 280.411458 L 28.5 280.411458 " transform="matrix(0.75,0,0,0.75,0,0)"/>
<path style="fill:none;stroke-width:1;stroke-linecap:butt;stroke-linejoin:miter;stroke:rgb(0%,0%,0%);stroke-opacity:1;stroke-miterlimit:2;" d="M 34.5 196.46875 L 28.5 196.46875 " transform="matrix(0.75,0,0,0.75,0,0)"/>
<path style="fill:none;stroke-width:1;stroke-linecap:butt;stroke-linejoin:miter;stroke:rgb(0%,0%,0%);stroke-opacity:1;stroke-miterlimit:2;" d="M 34.5 112.53125 L 28.5 112.53125 " transform="matrix(0.75,0,0,0.75,0,0)"/>
<path style="fill:none;stroke-width:1;stroke-linecap:butt;stroke-linejoin:miter;stroke:rgb(0%,0%,0%);stroke-opacity:1;stroke-miterlimit:2;" d="M 34.5 28.588542 L 28.5 28.588542 " transform="matrix(0.75,0,0,0.75,0,0)"/>
<path style="fill:none;stroke-width:1;stroke-linecap:butt;stroke-linejoin:miter;stroke:rgb(0%,0%,0%);stroke-opacity:1;stroke-miterlimit:2;" d="M 34.5 293 L 512.5 293 " transform="matrix(0.75,0,0,0.75,0,0)"/>
<path style="fill:none;stroke-width:1;stroke-linecap:butt;stroke-linejoin:miter;stroke:rgb(0%,0%,0%);stroke-opacity:1;stroke-miterlimit:2;" d="M 35 293.5 L 35 15.5 " transform="matrix(0.75,0,0,0.75,0,0)"/>
<path style="fill:none;stroke-width:1;stroke-linecap:butt;stroke-linejoin:miter;stroke:rgb(0%,0%,0%);stroke-opacity:1;stroke-miterlimit:2;" d="M 34.5 16 L 512.5 16 " transform="matrix(0.75,0,0,0.75,0,0)"/>
<path style="fill:none;stroke-width:1;stroke-linecap:butt;stroke-linejoin:miter;stroke:rgb(0%,0%,0%);stroke-opacity:1;stroke-miterlimit:2;" d="M 512 293.5 L 512 15.5 " transform="matrix(0.75,0,0,0.75,0,0)"/>
</g>
</svg>
