<?xml version="1.0" encoding="UTF-8" standalone="no"?>
<!-- Created with Inkscape (http://www.inkscape.org/) -->

<svg
   xmlns:dc="http://purl.org/dc/elements/1.1/"
   xmlns:cc="http://creativecommons.org/ns#"
   xmlns:rdf="http://www.w3.org/1999/02/22-rdf-syntax-ns#"
   xmlns:svg="http://www.w3.org/2000/svg"
   xmlns="http://www.w3.org/2000/svg"
   xmlns:xlink="http://www.w3.org/1999/xlink"
   xmlns:sodipodi="http://sodipodi.sourceforge.net/DTD/sodipodi-0.dtd"
   xmlns:inkscape="http://www.inkscape.org/namespaces/inkscape"
   width="16"
   height="16"
   id="svg3463"
   version="1.1"
   inkscape:version="0.48.4 r9939"
   sodipodi:docname="dime16x16.svg"
   inkscape:export-filename="/home/naujokat/git/itmc/cinco-inhouse-examples/DIME/info.scce.dime/branding/dime128.png"
   inkscape:export-xdpi="720"
   inkscape:export-ydpi="720">
  <defs
     id="defs3465">
    <radialGradient
       inkscape:collect="always"
       xlink:href="#linearGradient3796-92-7-18-1-9-1"
       id="radialGradient3644"
       gradientUnits="userSpaceOnUse"
       gradientTransform="matrix(-0.97041501,0.24144297,-0.22907489,-0.92070484,29.334238,121.12711)"
       cx="8.8079071"
       cy="63.888023"
       fx="8.8079071"
       fy="63.888023"
       r="24.499157" />
    <linearGradient
       id="linearGradient3796-92-7-18-1-9-1">
      <stop
         id="stop3798-5-58-7-2-89-3"
         offset="0"
         style="stop-color:#f5d749;stop-opacity:1;" />
      <stop
         id="stop3800-0-2-9-30-752-4"
         offset="1"
         style="stop-color:#e18a2c;stop-opacity:1;" />
    </linearGradient>
    <radialGradient
       inkscape:collect="always"
       xlink:href="#linearGradient3796-92-7-18-1-9-1"
       id="radialGradient3646"
       gradientUnits="userSpaceOnUse"
       gradientTransform="matrix(-0.97041501,0.24144297,-0.22907489,-0.92070484,29.334238,121.12711)"
       cx="8.8079071"
       cy="63.888023"
       fx="8.8079071"
       fy="63.888023"
       r="24.499157" />
    <linearGradient
       id="linearGradient3359">
      <stop
         id="stop3361"
         offset="0"
         style="stop-color:#f5d749;stop-opacity:1;" />
      <stop
         id="stop3363"
         offset="1"
         style="stop-color:#e18a2c;stop-opacity:1;" />
    </linearGradient>
    <radialGradient
       inkscape:collect="always"
       xlink:href="#linearGradient3796-92-7-18-1-9-1"
       id="radialGradient3654"
       gradientUnits="userSpaceOnUse"
       gradientTransform="matrix(-0.97041501,0.24144297,-0.22907489,-0.92070484,29.334238,121.12711)"
       cx="8.8079071"
       cy="63.888023"
       fx="8.8079071"
       fy="63.888023"
       r="24.499157" />
    <linearGradient
       id="linearGradient3366">
      <stop
         id="stop3368"
         offset="0"
         style="stop-color:#f5d749;stop-opacity:1;" />
      <stop
         id="stop3370"
         offset="1"
         style="stop-color:#e18a2c;stop-opacity:1;" />
    </linearGradient>
    <radialGradient
       inkscape:collect="always"
       xlink:href="#linearGradient3796-92-7-18-1-9-1"
       id="radialGradient3656"
       gradientUnits="userSpaceOnUse"
       gradientTransform="matrix(-0.97041501,0.24144297,-0.22907489,-0.92070484,29.334238,121.12711)"
       cx="8.8079071"
       cy="63.888023"
       fx="8.8079071"
       fy="63.888023"
       r="24.499157" />
    <linearGradient
       id="linearGradient3373">
      <stop
         id="stop3375"
         offset="0"
         style="stop-color:#f5d749;stop-opacity:1;" />
      <stop
         id="stop3377"
         offset="1"
         style="stop-color:#e18a2c;stop-opacity:1;" />
    </linearGradient>
    <radialGradient
       inkscape:collect="always"
       xlink:href="#linearGradient3796-92-7-18-1-9-1"
       id="radialGradient3658"
       gradientUnits="userSpaceOnUse"
       gradientTransform="matrix(-0.97041501,0.24144297,-0.22907489,-0.92070484,29.334238,121.12711)"
       cx="8.8079071"
       cy="63.888023"
       fx="8.8079071"
       fy="63.888023"
       r="24.499157" />
    <linearGradient
       id="linearGradient3380">
      <stop
         id="stop3382"
         offset="0"
         style="stop-color:#f5d749;stop-opacity:1;" />
      <stop
         id="stop3384"
         offset="1"
         style="stop-color:#e18a2c;stop-opacity:1;" />
    </linearGradient>
    <radialGradient
       inkscape:collect="always"
       xlink:href="#linearGradient3796-92-7-18-1-9-1"
       id="radialGradient3660"
       gradientUnits="userSpaceOnUse"
       gradientTransform="matrix(-0.97041501,0.24144297,-0.22907489,-0.92070484,29.334238,121.12711)"
       cx="8.8079071"
       cy="63.888023"
       fx="8.8079071"
       fy="63.888023"
       r="24.499157" />
    <linearGradient
       id="linearGradient3387">
      <stop
         id="stop3389"
         offset="0"
         style="stop-color:#f5d749;stop-opacity:1;" />
      <stop
         id="stop3391"
         offset="1"
         style="stop-color:#e18a2c;stop-opacity:1;" />
    </linearGradient>
    <radialGradient
       inkscape:collect="always"
       xlink:href="#linearGradient3796-92-7-18-1-9-1"
       id="radialGradient3662"
       gradientUnits="userSpaceOnUse"
       gradientTransform="matrix(-0.97041501,0.24144297,-0.22907489,-0.92070484,29.334238,121.12711)"
       cx="8.8079071"
       cy="63.888023"
       fx="8.8079071"
       fy="63.888023"
       r="24.499157" />
    <linearGradient
       id="linearGradient3394">
      <stop
         id="stop3396"
         offset="0"
         style="stop-color:#f5d749;stop-opacity:1;" />
      <stop
         id="stop3398"
         offset="1"
         style="stop-color:#e18a2c;stop-opacity:1;" />
    </linearGradient>
    <radialGradient
       inkscape:collect="always"
       xlink:href="#linearGradient3796-92-7-18-1-9-1"
       id="radialGradient3664"
       gradientUnits="userSpaceOnUse"
       gradientTransform="matrix(-0.97041501,0.24144297,-0.22907489,-0.92070484,29.334238,121.12711)"
       cx="8.8079071"
       cy="63.888023"
       fx="8.8079071"
       fy="63.888023"
       r="24.499157" />
    <linearGradient
       id="linearGradient3401">
      <stop
         id="stop3403"
         offset="0"
         style="stop-color:#f5d749;stop-opacity:1;" />
      <stop
         id="stop3405"
         offset="1"
         style="stop-color:#e18a2c;stop-opacity:1;" />
    </linearGradient>
    <radialGradient
       inkscape:collect="always"
       xlink:href="#linearGradient3796-92-7-18-1-9-1"
       id="radialGradient3666"
       gradientUnits="userSpaceOnUse"
       gradientTransform="matrix(-0.97041501,0.24144297,-0.22907489,-0.92070484,29.334238,121.12711)"
       cx="8.8079071"
       cy="63.888023"
       fx="8.8079071"
       fy="63.888023"
       r="24.499157" />
    <linearGradient
       id="linearGradient3408">
      <stop
         id="stop3410"
         offset="0"
         style="stop-color:#f5d749;stop-opacity:1;" />
      <stop
         id="stop3412"
         offset="1"
         style="stop-color:#e18a2c;stop-opacity:1;" />
    </linearGradient>
    <radialGradient
       inkscape:collect="always"
       xlink:href="#linearGradient3796-92-7-18-1-9-1"
       id="radialGradient3668"
       gradientUnits="userSpaceOnUse"
       gradientTransform="matrix(-0.97041501,0.24144297,-0.22907489,-0.92070484,29.334238,121.12711)"
       cx="8.8079071"
       cy="63.888023"
       fx="8.8079071"
       fy="63.888023"
       r="24.499157" />
    <linearGradient
       id="linearGradient3415">
      <stop
         id="stop3417"
         offset="0"
         style="stop-color:#f5d749;stop-opacity:1;" />
      <stop
         id="stop3419"
         offset="1"
         style="stop-color:#e18a2c;stop-opacity:1;" />
    </linearGradient>
    <radialGradient
       inkscape:collect="always"
       xlink:href="#linearGradient3796-92-7-18-1-9-1"
       id="radialGradient3670"
       gradientUnits="userSpaceOnUse"
       gradientTransform="matrix(-0.97041501,0.24144297,-0.22907489,-0.92070484,29.334238,121.12711)"
       cx="8.8079071"
       cy="63.888023"
       fx="8.8079071"
       fy="63.888023"
       r="24.499157" />
    <linearGradient
       id="linearGradient3422">
      <stop
         id="stop3424"
         offset="0"
         style="stop-color:#f5d749;stop-opacity:1;" />
      <stop
         id="stop3426"
         offset="1"
         style="stop-color:#e18a2c;stop-opacity:1;" />
    </linearGradient>
    <radialGradient
       inkscape:collect="always"
       xlink:href="#linearGradient3796-92-7-18-1-9-1"
       id="radialGradient3672"
       gradientUnits="userSpaceOnUse"
       gradientTransform="matrix(-0.97041501,0.24144297,-0.22907489,-0.92070484,29.334238,121.12711)"
       cx="8.8079071"
       cy="63.888023"
       fx="8.8079071"
       fy="63.888023"
       r="24.499157" />
    <linearGradient
       id="linearGradient3429">
      <stop
         id="stop3431"
         offset="0"
         style="stop-color:#f5d749;stop-opacity:1;" />
      <stop
         id="stop3433"
         offset="1"
         style="stop-color:#e18a2c;stop-opacity:1;" />
    </linearGradient>
  </defs>
  <sodipodi:namedview
     id="base"
     pagecolor="#ffffff"
     bordercolor="#666666"
     borderopacity="1.0"
     inkscape:pageopacity="0.0"
     inkscape:pageshadow="2"
     inkscape:zoom="22.627417"
     inkscape:cx="9.9807586"
     inkscape:cy="8.3834035"
     inkscape:document-units="px"
     inkscape:current-layer="layer1"
     showgrid="false"
     inkscape:window-width="2560"
     inkscape:window-height="1375"
     inkscape:window-x="0"
     inkscape:window-y="0"
     inkscape:window-maximized="1" />
  <metadata
     id="metadata3468">
    <rdf:RDF>
      <cc:Work
         rdf:about="">
        <dc:format>image/svg+xml</dc:format>
        <dc:type
           rdf:resource="http://purl.org/dc/dcmitype/StillImage" />
        <dc:title></dc:title>
      </cc:Work>
    </rdf:RDF>
  </metadata>
  <g
     inkscape:label="Layer 1"
     inkscape:groupmode="layer"
     id="layer1"
     transform="translate(0,-1036.3622)">
    <path
       sodipodi:type="arc"
       style="color:#000000;fill:#875b03;fill-opacity:1;fill-rule:nonzero;stroke:none;stroke-width:2;marker:none;visibility:visible;display:inline;overflow:visible;enable-background:accumulate"
       id="path2985-3"
       sodipodi:cx="392.19171"
       sodipodi:cy="290.95969"
       sodipodi:rx="88.640884"
       sodipodi:ry="88.640884"
       d="m 480.8326,290.95969 c 0,48.955 -39.68588,88.64088 -88.64089,88.64088 -48.95501,0 -88.64088,-39.68588 -88.64088,-88.64088 0,-48.95501 39.68587,-88.64089 88.64088,-88.64089 48.95501,0 88.64089,39.68588 88.64089,88.64089 z"
       transform="matrix(0.09025181,0,0,0.09025181,-27.39601,1018.1026)" />
    <path
       sodipodi:type="arc"
       style="color:#000000;fill:#f4ba45;fill-opacity:1;fill-rule:nonzero;stroke:none;stroke-width:2;marker:none;visibility:visible;display:inline;overflow:visible;enable-background:accumulate"
       id="path2985-0-6"
       sodipodi:cx="392.19171"
       sodipodi:cy="290.95969"
       sodipodi:rx="88.640884"
       sodipodi:ry="88.640884"
       d="m 480.8326,290.95969 c 0,48.955 -39.68588,88.64088 -88.64089,88.64088 -48.95501,0 -88.64088,-39.68588 -88.64088,-88.64088 0,-48.95501 39.68587,-88.64089 88.64088,-88.64089 48.95501,0 88.64089,39.68588 88.64089,88.64089 z"
       transform="matrix(0.08899887,0,0,0.08899887,-26.90462,1018.4671)" />
    <path
       transform="matrix(0.0878176,0,0,0.0878176,-26.441333,1018.8108)"
       d="m 480.8326,290.95969 c 0,48.955 -39.68588,88.64088 -88.64089,88.64088 -48.95501,0 -88.64088,-39.68588 -88.64088,-88.64088 0,-48.95501 39.68587,-88.64089 88.64088,-88.64089 48.95501,0 88.64089,39.68588 88.64089,88.64089 z"
       sodipodi:ry="88.640884"
       sodipodi:rx="88.640884"
       sodipodi:cy="290.95969"
       sodipodi:cx="392.19171"
       id="path3784-8"
       style="color:#000000;fill:#ea9224;fill-opacity:1;fill-rule:nonzero;stroke:none;stroke-width:2;marker:none;visibility:visible;display:inline;overflow:visible;enable-background:accumulate"
       sodipodi:type="arc" />
    <path
       sodipodi:type="arc"
       style="color:#000000;fill:#875b03;fill-opacity:1;fill-rule:nonzero;stroke:none;stroke-width:2.16462827;marker:none;visibility:visible;display:inline;overflow:visible;enable-background:accumulate"
       id="path3786-5"
       sodipodi:cx="392.19171"
       sodipodi:cy="290.95969"
       sodipodi:rx="88.640884"
       sodipodi:ry="88.640884"
       d="m 480.8326,290.95969 c 0,48.955 -39.68588,88.64088 -88.64089,88.64088 -48.95501,0 -88.64088,-39.68588 -88.64088,-88.64088 0,-48.95501 39.68587,-88.64089 88.64088,-88.64089 48.95501,0 88.64089,39.68588 88.64089,88.64089 z"
       transform="matrix(0.08140092,0,0,0.08140092,-23.924766,1020.6778)" />
    <path
       transform="matrix(0.07992433,0,0,0.07992433,-23.345658,1021.1075)"
       d="m 480.8326,290.95969 c 0,48.955 -39.68588,88.64088 -88.64089,88.64088 -48.95501,0 -88.64088,-39.68588 -88.64088,-88.64088 0,-48.95501 39.68587,-88.64089 88.64088,-88.64089 48.95501,0 88.64089,39.68588 88.64089,88.64089 z"
       sodipodi:ry="88.640884"
       sodipodi:rx="88.640884"
       sodipodi:cy="290.95969"
       sodipodi:cx="392.19171"
       id="path3805-7"
       style="color:#000000;fill:#eaa624;fill-opacity:1;fill-rule:nonzero;stroke:none;stroke-width:1.79889321;marker:none;visibility:visible;display:inline;overflow:visible;enable-background:accumulate"
       sodipodi:type="arc" />
    <path
       sodipodi:type="arc"
       style="color:#000000;fill:#875b03;fill-opacity:1;fill-rule:nonzero;stroke:none;stroke-width:2.64429879;marker:none;visibility:visible;display:inline;overflow:visible;enable-background:accumulate"
       id="path3824-3"
       sodipodi:cx="392.19171"
       sodipodi:cy="290.95969"
       sodipodi:rx="88.640884"
       sodipodi:ry="88.640884"
       d="m 480.8326,290.95969 c 0,48.955 -39.68588,88.64088 -88.64089,88.64088 -48.95501,0 -88.64088,-39.68588 -88.64088,-88.64088 0,-48.95501 39.68587,-88.64089 88.64088,-88.64089 48.95501,0 88.64089,39.68588 88.64089,88.64089 z"
       transform="matrix(0.05245964,0,0,0.05245964,-12.574234,1029.0986)" />
    <path
       transform="matrix(0.05068772,0,0,0.05068772,-11.879304,1029.6141)"
       d="m 480.8326,290.95969 c 0,48.955 -39.68588,88.64088 -88.64089,88.64088 -48.95501,0 -88.64088,-39.68588 -88.64088,-88.64088 0,-48.95501 39.68587,-88.64089 88.64088,-88.64089 48.95501,0 88.64089,39.68588 88.64089,88.64089 z"
       sodipodi:ry="88.640884"
       sodipodi:rx="88.640884"
       sodipodi:cy="290.95969"
       sodipodi:cx="392.19171"
       id="path3860-4"
       style="color:#000000;fill:#f5bc48;fill-opacity:1;fill-rule:nonzero;stroke:none;stroke-width:2.64429879;marker:none;visibility:visible;display:inline;overflow:visible;enable-background:accumulate"
       sodipodi:type="arc" />
    <path
       transform="matrix(-0.0140252,0.03406353,-0.03406353,-0.0140252,16.181906,1046.6251)"
       d="m 26.98145,70.907249 c 0,13.530511 -10.968646,24.499157 -24.4991566,24.499157 -13.5305104,0 -24.4991574,-10.968646 -24.4991574,-24.499157 0,-13.53051 10.968647,-24.499157 24.4991574,-24.499157 13.5305106,0 24.4991566,10.968647 24.4991566,24.499157 z"
       sodipodi:ry="24.499157"
       sodipodi:rx="24.499157"
       sodipodi:cy="70.907249"
       sodipodi:cx="2.4822934"
       id="path6349-3"
       style="color:#000000;fill:url(#radialGradient3644);fill-opacity:1;fill-rule:nonzero;stroke:none;stroke-width:0.5;marker:none;visibility:visible;display:inline;overflow:visible;enable-background:accumulate"
       sodipodi:type="arc" />
    <path
       transform="matrix(-0.02685369,0.02521737,-0.02521737,-0.02685369,14.432017,1049.9105)"
       d="m 26.98145,70.907249 c 0,13.530511 -10.968646,24.499157 -24.4991566,24.499157 -13.5305104,0 -24.4991574,-10.968646 -24.4991574,-24.499157 0,-13.53051 10.968647,-24.499157 24.4991574,-24.499157 13.5305106,0 24.4991566,10.968647 24.4991566,24.499157 z"
       sodipodi:ry="24.499157"
       sodipodi:rx="24.499157"
       sodipodi:cy="70.907249"
       sodipodi:cx="2.4822934"
       id="path6261-2"
       style="color:#000000;fill:url(#radialGradient3646);fill-opacity:1;fill-rule:nonzero;stroke:none;stroke-width:0.5;marker:none;visibility:visible;display:inline;overflow:visible;enable-background:accumulate"
       sodipodi:type="arc" />
    <path
       transform="matrix(-0.01841059,-0.03190742,0.03190742,-0.01841059,1.1507844,1049.3861)"
       d="m 26.98145,70.907249 c 0,13.530511 -10.968646,24.499157 -24.4991566,24.499157 -13.5305104,0 -24.4991574,-10.968646 -24.4991574,-24.499157 0,-13.53051 10.968647,-24.499157 24.4991574,-24.499157 13.5305106,0 24.4991566,10.968647 24.4991566,24.499157 z"
       sodipodi:ry="24.499157"
       sodipodi:rx="24.499157"
       sodipodi:cy="70.907249"
       sodipodi:cx="2.4822934"
       id="path3243-4"
       style="color:#000000;fill:url(#radialGradient3654);fill-opacity:1;fill-rule:nonzero;stroke:none;stroke-width:0.5;marker:none;visibility:visible;display:inline;overflow:visible;enable-background:accumulate"
       sodipodi:type="arc" />
    <path
       transform="matrix(-0.00249983,-0.03675309,0.03675309,-0.00249983,-0.3515482,1045.8993)"
       d="m 26.98145,70.907249 c 0,13.530511 -10.968646,24.499157 -24.4991566,24.499157 -13.5305104,0 -24.4991574,-10.968646 -24.4991574,-24.499157 0,-13.53051 10.968647,-24.499157 24.4991574,-24.499157 13.5305106,0 24.4991566,10.968647 24.4991566,24.499157 z"
       sodipodi:ry="24.499157"
       sodipodi:rx="24.499157"
       sodipodi:cy="70.907249"
       sodipodi:cx="2.4822934"
       id="path9989-7"
       style="color:#000000;fill:url(#radialGradient3656);fill-opacity:1;fill-rule:nonzero;stroke:none;stroke-width:0.5;marker:none;visibility:visible;display:inline;overflow:visible;enable-background:accumulate"
       sodipodi:type="arc" />
    <path
       transform="matrix(0.0140252,-0.03406353,0.03406353,0.0140252,-0.18190568,1042.0993)"
       d="m 26.98145,70.907249 c 0,13.530511 -10.968646,24.499157 -24.4991566,24.499157 -13.5305104,0 -24.4991574,-10.968646 -24.4991574,-24.499157 0,-13.53051 10.968647,-24.499157 24.4991574,-24.499157 13.5305106,0 24.4991566,10.968647 24.4991566,24.499157 z"
       sodipodi:ry="24.499157"
       sodipodi:rx="24.499157"
       sodipodi:cy="70.907249"
       sodipodi:cx="2.4822934"
       id="path8907-4"
       style="color:#000000;fill:url(#radialGradient3658);fill-opacity:1;fill-rule:nonzero;stroke:none;stroke-width:0.5;marker:none;visibility:visible;display:inline;overflow:visible;enable-background:accumulate"
       sodipodi:type="arc" />
    <path
       transform="matrix(0.02685369,-0.02521737,0.02521737,0.02685369,1.5679832,1038.8139)"
       d="m 26.98145,70.907249 c 0,13.530511 -10.968646,24.499157 -24.4991566,24.499157 -13.5305104,0 -24.4991574,-10.968646 -24.4991574,-24.499157 0,-13.53051 10.968647,-24.499157 24.4991574,-24.499157 13.5305106,0 24.4991566,10.968647 24.4991566,24.499157 z"
       sodipodi:ry="24.499157"
       sodipodi:rx="24.499157"
       sodipodi:cy="70.907249"
       sodipodi:cx="2.4822934"
       id="path0642-0"
       style="color:#000000;fill:url(#radialGradient3660);fill-opacity:1;fill-rule:nonzero;stroke:none;stroke-width:0.5;marker:none;visibility:visible;display:inline;overflow:visible;enable-background:accumulate"
       sodipodi:type="arc" />
    <path
       transform="matrix(0.03520826,-0.01083566,0.01083566,0.03520826,4.6281925,1036.566)"
       d="m 26.98145,70.907249 c 0,13.530511 -10.968646,24.499157 -24.4991566,24.499157 -13.5305104,0 -24.4991574,-10.968646 -24.4991574,-24.499157 0,-13.53051 10.968647,-24.499157 24.4991574,-24.499157 13.5305106,0 24.4991566,10.968647 24.4991566,24.499157 z"
       sodipodi:ry="24.499157"
       sodipodi:rx="24.499157"
       sodipodi:cy="70.907249"
       sodipodi:cx="2.4822934"
       id="path1389-5"
       style="color:#000000;fill:url(#radialGradient3662);fill-opacity:1;fill-rule:nonzero;stroke:none;stroke-width:0.5;marker:none;visibility:visible;display:inline;overflow:visible;enable-background:accumulate"
       sodipodi:type="arc" />
    <path
       transform="matrix(0.03634542,0.00600399,-0.00600399,0.03634542,8.379376,1035.8782)"
       d="m 26.98145,70.907249 c 0,13.530511 -10.968646,24.499157 -24.4991566,24.499157 -13.5305104,0 -24.4991574,-10.968646 -24.4991574,-24.499157 0,-13.53051 10.968647,-24.499157 24.4991574,-24.499157 13.5305106,0 24.4991566,10.968647 24.4991566,24.499157 z"
       sodipodi:ry="24.499157"
       sodipodi:rx="24.499157"
       sodipodi:cy="70.907249"
       sodipodi:cx="2.4822934"
       id="path8467-1"
       style="color:#000000;fill:url(#radialGradient3664);fill-opacity:1;fill-rule:nonzero;stroke:none;stroke-width:0.5;marker:none;visibility:visible;display:inline;overflow:visible;enable-background:accumulate"
       sodipodi:type="arc" />
    <path
       transform="matrix(0.03070849,0.02034762,-0.02034762,0.03070849,11.962095,1036.8446)"
       d="m 26.98145,70.907249 c 0,13.530511 -10.968646,24.499157 -24.4991566,24.499157 -13.5305104,0 -24.4991574,-10.968646 -24.4991574,-24.499157 0,-13.53051 10.968647,-24.499157 24.4991574,-24.499157 13.5305106,0 24.4991566,10.968647 24.4991566,24.499157 z"
       sodipodi:ry="24.499157"
       sodipodi:rx="24.499157"
       sodipodi:cy="70.907249"
       sodipodi:cx="2.4822934"
       id="path3402-0"
       style="color:#000000;fill:url(#radialGradient3666);fill-opacity:1;fill-rule:nonzero;stroke:none;stroke-width:0.5;marker:none;visibility:visible;display:inline;overflow:visible;enable-background:accumulate"
       sodipodi:type="arc" />
    <path
       transform="matrix(0.01841059,0.03190742,-0.03190742,0.01841059,14.849216,1039.3384)"
       d="m 26.98145,70.907249 c 0,13.530511 -10.968646,24.499157 -24.4991566,24.499157 -13.5305104,0 -24.4991574,-10.968646 -24.4991574,-24.499157 0,-13.53051 10.968647,-24.499157 24.4991574,-24.499157 13.5305106,0 24.4991566,10.968647 24.4991566,24.499157 z"
       sodipodi:ry="24.499157"
       sodipodi:rx="24.499157"
       sodipodi:cy="70.907249"
       sodipodi:cx="2.4822934"
       id="path5686-5"
       style="color:#000000;fill:url(#radialGradient3668);fill-opacity:1;fill-rule:nonzero;stroke:none;stroke-width:0.5;marker:none;visibility:visible;display:inline;overflow:visible;enable-background:accumulate"
       sodipodi:type="arc" />
    <path
       transform="matrix(0.00249983,0.03675309,-0.03675309,0.00249983,16.351548,1042.8251)"
       d="m 26.98145,70.907249 c 0,13.530511 -10.968646,24.499157 -24.4991566,24.499157 -13.5305104,0 -24.4991574,-10.968646 -24.4991574,-24.499157 0,-13.53051 10.968647,-24.499157 24.4991574,-24.499157 13.5305106,0 24.4991566,10.968647 24.4991566,24.499157 z"
       sodipodi:ry="24.499157"
       sodipodi:rx="24.499157"
       sodipodi:cy="70.907249"
       sodipodi:cx="2.4822934"
       id="path1249-0"
       style="color:#000000;fill:url(#radialGradient3670);fill-opacity:1;fill-rule:nonzero;stroke:none;stroke-width:0.5;marker:none;visibility:visible;display:inline;overflow:visible;enable-background:accumulate"
       sodipodi:type="arc" />
    <path
       transform="matrix(-0.0140252,0.03406353,-0.03406353,-0.0140252,16.181906,1046.6251)"
       d="m 26.98145,70.907249 c 0,13.530511 -10.968646,24.499157 -24.4991566,24.499157 -13.5305104,0 -24.4991574,-10.968646 -24.4991574,-24.499157 0,-13.53051 10.968647,-24.499157 24.4991574,-24.499157 13.5305106,0 24.4991566,10.968647 24.4991566,24.499157 z"
       sodipodi:ry="24.499157"
       sodipodi:rx="24.499157"
       sodipodi:cy="70.907249"
       sodipodi:cx="2.4822934"
       id="path4744-0"
       style="color:#000000;fill:url(#radialGradient3672);fill-opacity:1;fill-rule:nonzero;stroke:none;stroke-width:0.5;marker:none;visibility:visible;display:inline;overflow:visible;enable-background:accumulate"
       sodipodi:type="arc" />
    <text
       xml:space="preserve"
       style="font-size:8.38709641px;font-style:normal;font-variant:normal;font-weight:normal;font-stretch:normal;text-align:center;line-height:125%;letter-spacing:0px;word-spacing:0px;writing-mode:lr-tb;text-anchor:middle;fill:#da7415;fill-opacity:1;stroke:#da7415;stroke-width:0.11402279;stroke-miterlimit:4;stroke-opacity:1;stroke-dasharray:none;font-family:Arial Black;-inkscape-font-specification:'Arial Black,'"
       x="8.2366095"
       y="1048.8436"
       id="text28209-8"
       sodipodi:linespacing="125%"
       transform="scale(1.0013741,0.99862778)"><tspan
         sodipodi:role="line"
         id="tspan28211-6"
         x="8.2366095"
         y="1048.8436"
         style="fill:#da7415;fill-opacity:1;stroke-width:0.11402279">D</tspan></text>
    <text
       xml:space="preserve"
       style="font-size:2.48776865000000003px;font-style:normal;font-variant:normal;font-weight:normal;font-stretch:normal;text-align:center;line-height:125%;letter-spacing:0px;word-spacing:0px;writing-mode:lr-tb;text-anchor:middle;fill:#da7415;fill-opacity:1;stroke:#da7415;stroke-width:0.09329133000000001;stroke-miterlimit:4;stroke-opacity:1;stroke-dasharray:none;font-family:Arial Black;-inkscape-font-specification:'Arial Black,'"
       x="529.31677"
       y="907.2016"
       id="text28209-8-4"
       sodipodi:linespacing="125%"
       transform="matrix(0.86602538,0.50000004,-0.50000004,0.86602538,0,0)"><tspan
         sodipodi:role="line"
         id="tspan28211-6-8"
         x="529.31677"
         y="907.2016"
         style="stroke-width:0.09329133000000001;fill:#da7415;fill-opacity:1">I</tspan></text>
    <text
       xml:space="preserve"
       style="font-size:2.48776888999999990px;font-style:normal;font-variant:normal;font-weight:normal;font-stretch:normal;text-align:center;line-height:125%;letter-spacing:0px;word-spacing:0px;writing-mode:lr-tb;text-anchor:middle;fill:#da7415;fill-opacity:1;stroke:#da7415;stroke-width:0.09329133000000001;stroke-miterlimit:4;stroke-opacity:1;stroke-dasharray:none;font-family:Arial Black;-inkscape-font-specification:'Arial Black,'"
       x="7.7335405"
       y="1051.1018"
       id="text28209-8-4-7"
       sodipodi:linespacing="125%"><tspan
         sodipodi:role="line"
         id="tspan28211-6-8-2"
         x="7.7335405"
         y="1051.1018"
         style="stroke-width:0.09329133000000001;fill:#da7415;fill-opacity:1">M</tspan></text>
    <text
       xml:space="preserve"
       style="font-size:2.48776865000000003px;font-style:normal;font-variant:normal;font-weight:normal;font-stretch:normal;text-align:center;line-height:125%;letter-spacing:0px;word-spacing:0px;writing-mode:lr-tb;text-anchor:middle;fill:#da7415;fill-opacity:1;stroke:#da7415;stroke-width:0.09329133000000001;stroke-miterlimit:4;stroke-opacity:1;stroke-dasharray:none;font-family:Arial Black;-inkscape-font-specification:'Arial Black,'"
       x="-515.87726"
       y="915.14868"
       id="text28209-8-4-3"
       sodipodi:linespacing="125%"
       transform="matrix(0.86602538,-0.50000004,0.50000004,0.86602538,0,0)"><tspan
         sodipodi:role="line"
         id="tspan28211-6-8-6"
         x="-515.87726"
         y="915.14868"
         style="stroke-width:0.09329133000000001;fill:#da7415;fill-opacity:1">E</tspan></text>
  </g>
</svg>
