{
	"plate": {
		"component": {
			"pictureEditor": [
				"Свойства изображения",
				"Разместить",
				"Просматривать",
				"Площадь",
				"Широкий",
				"Свободно",
				"Описание здесь ..."
			],
			"leftmenu": [
				"Читают",
				"Следующий",
				"Вернуться к себе домой",
				"Дом",
				"Чат",
				"Галерея",
				"Проводить исследования"
			],
			"rightmenu": [
				"В разработке",
				"Уведомления",
				"Там нет никакого уведомления на сегодня",
				"Настройки профиля",
				"Настройки интерфейса",
				"Выйти",
				"Новые Мяукает",
				"Пишите ваше сообщение здесь"
			]
		},
		"login": [
			"Имя пользователя или адрес электронной почты",
			"пароль",
			"Эл. адрес",
			"Повторите пароль",
			"Условия и положения",
			"политика конфиденциальности",
			"Минимально 8 символов",
			"Ваш адрес электронной почты",
			"При регистрации вы будете [b:согласен] с условиями и политикой конфиденциальности"
		],
		"chatbar": {
			"home": [
				"Список чатов",
				"Поиск чата ..."
			],
			"default": [
				"Пишите ваше сообщение здесь..."
			]
		},
		"explore": [
			"Neko Пользователи",
			"Поиск не найдены",
			"Убедитесь, что вы пишете правильное ключевое слово в поле поиска",
			"Поищи здесь...",
			"Чат",
			"Произведения",
			"темы",
			"Аниме номер",
			"сообщество",
			"Песня Обложка",
			"Новости",
			"развитие"
		],
		"settings": {
			"profile": [
				"имя пользователя",
				"имя",
				"О вас",
				"день рождения",
				"Прямой эфир",
				"Страна",
				"Провинция",
				"Без заголовка",
				"Без заголовка",
				"новый пароль",
				"Введите повторно новый пароль",
				"Старый пароль",
				"Сохранить изменения"
			]
		},
		"home": [
			"@погрузка."
		],
		"meows": {
			"full": [
				"Там нет комментариев к этой мяукает"
			]
		}
	},
	"js": {
		"model": {
			"login_page": [
				"Стойкие хранения в браузере было отклонено",
				"Похоже, ваш диск почти заполнен, и причиной браузер не может хранить некоторые данные",
				"Проверка ...",
				"Пожалуйста, заполните пустое поле",
				"Добро пожаловать",
				"E-mail не является действительным",
				"Вы хотите выйти из этого приложения?",
				"Вы вышли из системы",
				"E-mail не является действительным"
			],
			"explore": [
				"Незнакомец",
				"толкатель",
				"друг"
			],
			"profile": [
				"с последующим"
			]
		},
		"startup_init": {
			"notification": [
				"Loading ...",
				"У вас есть {x} уведомления",
				"В настоящее время редирект функция не закончена. После завершения вы можете также просмотреть комбинированный список по taphold."
			],
			"_variable": [
				"Что-то не работает в браузере"
			]
		},
		"component": {
			"profile": [
				"последователь",
				"следить",
				"владелец",
				"друг",
				"незнакомец"
			],
			"chat_inside": [
				"Некоторые функции все еще разрабатываются \\ (> _ <;)",
				"Unsend сообщение"
			],
			"chatbar": {
				"room": [
					"В сети",
					"Не в сети"
				]
			},
			"chat_component": [
				"Не удалось расшифровать сообщение",
				"отослано",
				"получили",
				"народов",
				"* Сообщение было удалено *"
			],
			"chat_panel": [
				"Написать название здесь",
				"Новые возможности",
				"Сохранить",
				"Параметры",
				"Текст здесь ..",
				"Множественный выбор",
				"поля должны быть заполнены",
				"Название не может быть пустым",
				"Картина",
				"Вопрос",
				"Голосование",
				"наклейка",
				"Место расположения",
				"Голосовой чат",
				"Выше результат"
			],
			"explore": [
				"Это ты",
				"Круги"
			],
			"home_front": [
				"Здесь ничего нет"
			],
			"left_sidebar": [
				"Отдельный чат доступен после того, как друг",
				"Связь:",
				"Отписаться"
			],
			"meows": [
				"Поддерживается только один файл",
				"Загрузка ...",
				"Не можете перепечатывать свои мяукает",
				"(Больше)",
				"Загрузка ..",
				"погрузка"
			],
			"meows_page": [
				"отчет",
				"удалять"
			],
			"profile_settings": [
				"Пароли не совпадают",
				"Настройки профиля были сохранены",
				"Рисунок профиля был обновлен",
				"Не удалось обновить фотографию"
			],
			"right_topmenu": [
				"локальная база данных Клиринг"
			]
		},
		"events": {
			"browser_db_ready": [
				"Войти сессия истекло"
			],
			"neko_socket": [
				"Сообщение удалено!"
			]
		},
		"namespaces": {
			"e2e_encryption": [
				"E2EE успешно обменены"
			],
			"filesystem": [
				"Приложение не может получить доступ к памяти (Разрешение Отклонено)",
				"Загрузка ...",
				"Невозможно создать новый файл",
				"Не удалось прочитать данные",
				"Папка ошибки удалить:",
				"Ошибка удалить файл:",
				"Ошибка шаг файла:",
				"Ошибка шаг файла:",
				"Не удалось содержимого каталогов список ошибок кода #",
				"Получение каталог возврат содержания ошибка",
				"Не удалось создать каталог",
				"Не удалось найти файл",
				"Не имеет разрешения на хранение доступа",
				"Ошибка записи файла:",
				"Ошибка каталога файлов доступа",
				"Неверная ссылка",
				"Ошибка подключения",
				"Скачать Прерванный",
				"Файл не изменен",
				"Невозможно открыть файловый менеджер",
				"Устройство не поддерживается"
			]
		},
		"router": {
			"_main": [
				"Запрашиваемая страница не найдена",
				"Есть некоторые ошибки на сервере",
				"Что-то пошло не так"
			]
		},
		"extendable": {
			"ChatRoom": [
				"Слишком длинное сообщение"
			]
		}
	},
	"views": {
		"static": {
			"header": [
				"Посещение",
				"Чат здесь сообщение"
			]
		}
	}
}