{
	"plate": {
		"component": {
			"pictureEditor": [
				"Propriétés de l'image",
				"Soumettre",
				"Feuilleter",
				"Carré",
				"Large",
				"Gratuit",
				"Description ici ..."
			],
			"leftmenu": [
				"Suiveurs",
				"Suivant",
				"Retour à votre domicile",
				"Accueil",
				"Bavarder",
				"Galerie",
				"Explorer"
			],
			"rightmenu": [
				"En développement",
				"Notifications",
				"Il n'y a pas de notification pour aujourd'hui",
				"Paramètres de profil",
				"Paramètres d'interface",
				"Se déconnecter",
				"nouveaux matous",
				"tapez votre message ici"
			]
		},
		"login": [
			"Nom d'utilisateur ou email",
			"Mot de passe",
			"Email",
			"Retaper le mot de passe",
			"Termes et conditions",
			"Politique de confidentialité",
			"Minimal 8 caractères",
			"votre e-mail",
			"En vous inscrivant êtes la [b:D'accord] avec les termes et la politique de confidentialité"
		],
		"chatbar": {
			"home": [
				"Liste de chat",
				"Rechercher dans le salon de discussion ..."
			],
			"default": [
				"Tapez votre message ici..."
			]
		},
		"explore": [
			"Utilisateurs de Neko",
			"Recherche Introuvable",
			"Assurez-vous que vous écrivez le mot-clé correct sur le champ de recherche",
			"Cherche ici...",
			"Tchat",
			"Oeuvres",
			"Les sujets",
			"Chambre Anime",
			"Communauté",
			"Reprise musicale",
			"Nouvelles",
			"Développement"
		],
		"settings": {
			"profile": [
				"Nom d'utilisateur",
				"Nom",
				"Au propos de vous",
				"Anniversaire",
				"Vivre",
				"Pays",
				"Province",
				"Pas de titre",
				"nouveau mot de passe",
				"nouveau mot de passe",
				"Re-taper le nouveau mot de passe",
				"ancien mot de passe",
				"Sauvegarder les modifications"
			]
		},
		"home": [
			"@chargement"
		],
		"meows": {
			"full": [
				"Il n'y a pas de commentaire pour cette miaule"
			]
		}
	},
	"js": {
		"model": {
			"login_page": [
				"Le stockage persistant du navigateur a été rejeté",
				"On dirait que votre disque est presque plein et que le navigateur ne peut pas stocker certaines données",
				"Vérification ...",
				"S'il vous plaît remplir le champ vide",
				"Nous saluons le retour",
				"Email n'a pas été valide",
				"Voulez-vous déconnecter de cette application?",
				"Vous êtes déconnecté",
				"Email n'a pas été valide"
			],
			"explore": [
				"Étranger",
				"Disciple",
				"ami"
			],
			"profile": [
				"suivi"
			]
		},
		"startup_init": {
			"notification": [
				"Chargement...",
				"Vous avez une notification {x}",
				"Actuellement fonction redirect n'a pas fini. Lorsque vous avez terminé pouvez également afficher la liste combinée par taphold."
			],
			"_variable": [
				"Quelque chose ne fonctionnait pas dans le navigateur"
			]
		},
		"component": {
			"profile": [
				"disciple",
				"Suivre",
				"propriétaire",
				"ami",
				"étranger"
			],
			"chat_inside": [
				"Certaines fonctionnalités sont encore en cours de développement \\ (> _ <;)",
				"un message Unsend"
			],
			"chatbar": {
				"room": [
					"en ligne",
					"Hors ligne"
				]
			},
			"chat_component": [
				"Échec au message Décrypter",
				"sended‎",
				"reçu",
				"peuples",
				"* Message a été supprimé *"
			],
			"chat_panel": [
				"Ecrire le titre ici",
				"nouvelles options",
				"sauvegarder",
				"options",
				"Texte ici..",
				"sélection multiple",
				"les champs doivent être remplis",
				"titre ne peut pas être vide",
				"Image",
				"Question",
				"Sondage",
				"Autocollant",
				"Emplacement",
				"Chat vocal",
				"Au-dessus sont le résultat"
			],
			"explore": [
				"C'est toi",
				"suivi"
			],
			"home_front": [
				"Il n'y a rien ici"
			],
			"left_sidebar": [
				"chat privé est disponible après avoir été un ami",
				"Relation:",
				"unfollow"
			],
			"meows": [
				"Un seul fichier pris en charge",
				"Téléchargement...",
				"Ne peut pas reposter votre miaule",
				"(plus)",
				"Chargement..",
				"chargement"
			],
			"meows_page": [
				"rapport",
				"Supprimer"
			],
			"profile_settings": [
				"Non concordance des mots de passe",
				"Paramètres du profil a été sauvé",
				"photo de profil a été mis à jour",
				"Impossible de mettre à jour votre photo de profil"
			],
			"right_topmenu": [
				"base de données locale de compensation"
			]
		},
		"events": {
			"browser_db_ready": [
				"Connexion session a expiré"
			],
			"neko_socket": [
				"Un message supprimé!"
			]
		},
		"namespaces": {
			"e2e_encryption": [
				"E2EE avec succès échangé"
			],
			"filesystem": [
				"Application ne peut pas accéder au stockage (autorisation Rejeté)",
				"Téléchargement...",
				"Impossible de créer le fichier",
				"Échec de la lecture des données",
				"Dossier Supprimer erreur:",
				"erreur de suppression du fichier:",
				"erreur de déplacement du fichier:",
				"erreur de déplacement du fichier:",
				"Échec du contenu du répertoire de la liste code d'erreur #",
				"contenu Récupération de l'erreur de retour",
				"Impossible de créer le répertoire",
				"Impossible de trouver le fichier",
				"Ne pas l'autorisation de stockage d'accès",
				"Impossible de fichier d'écriture:",
				"Échec du répertoire des fichiers d'accès",
				"URL invalide",
				"Erreur de connexion",
				"Télécharger Aborted",
				"Fichier non modifié",
				"Impossible d'ouvrir le gestionnaire de fichiers",
				"Dispositif non pris en charge"
			]
		},
		"router": {
			"_main": [
				"La page demandée n'a pas été trouvée",
				"Il y a une erreur sur le serveur",
				"Quelque chose n'allait pas"
			]
		},
		"extendable": {
			"ChatRoom": [
				"Message trop long"
			]
		}
	},
	"views": {
		"static": {
			"header": [
				"Visite",
				"un message dans le chat ici"
			]
		}
	}
}