mode: atomic
gitlab.com/sbongini-go/ratatoskr/handler/natshandler/natshandler.go:18.63,22.2 3 1
gitlab.com/sbongini-go/ratatoskr/handler/natshandler/natshandler.go:24.57,66.2 1 2
gitlab.com/sbongini-go/ratatoskr/handler/natshandler/natshandler.go:103.31,125.2 2 3
gitlab.com/sbongini-go/ratatoskr/handler/natshandler/natshandler.go:128.67,135.27 4 2
gitlab.com/sbongini-go/ratatoskr/handler/natshandler/natshandler.go:139.2,139.11 1 2
gitlab.com/sbongini-go/ratatoskr/handler/natshandler/natshandler.go:135.27,137.3 1 0
gitlab.com/sbongini-go/ratatoskr/handler/natshandler/natshandler.go:143.84,168.2 4 1
gitlab.com/sbongini-go/ratatoskr/handler/natshandler/natshandler.go:171.56,175.16 3 1
gitlab.com/sbongini-go/ratatoskr/handler/natshandler/natshandler.go:178.2,181.12 3 1
gitlab.com/sbongini-go/ratatoskr/handler/natshandler/natshandler.go:175.16,177.3 1 0
gitlab.com/sbongini-go/ratatoskr/handler/natshandler/natshandler.go:185.112,199.13 4 1
gitlab.com/sbongini-go/ratatoskr/handler/natshandler/natshandler.go:215.2,216.16 2 1
gitlab.com/sbongini-go/ratatoskr/handler/natshandler/natshandler.go:222.2,222.27 1 1
gitlab.com/sbongini-go/ratatoskr/handler/natshandler/natshandler.go:199.13,202.17 2 0
gitlab.com/sbongini-go/ratatoskr/handler/natshandler/natshandler.go:208.3,211.9 1 0
gitlab.com/sbongini-go/ratatoskr/handler/natshandler/natshandler.go:202.17,206.4 3 0
gitlab.com/sbongini-go/ratatoskr/handler/natshandler/natshandler.go:216.16,220.3 3 0
gitlab.com/sbongini-go/ratatoskr/handler/natshandler/natshandler.go:226.55,227.25 1 1
gitlab.com/sbongini-go/ratatoskr/handler/natshandler/natshandler.go:230.2,230.12 1 0
gitlab.com/sbongini-go/ratatoskr/handler/natshandler/natshandler.go:227.25,229.3 1 1
gitlab.com/sbongini-go/ratatoskr/handler/natshandler/natshandler.go:234.37,236.2 1 2
gitlab.com/sbongini-go/ratatoskr/handler/natshandler/natshandler_opts.go:9.35,10.30 1 0
gitlab.com/sbongini-go/ratatoskr/handler/natshandler/natshandler_opts.go:10.30,12.3 1 0
gitlab.com/sbongini-go/ratatoskr/handler/natshandler/natshandler_opts.go:16.41,17.30 1 0
gitlab.com/sbongini-go/ratatoskr/handler/natshandler/natshandler_opts.go:17.30,19.3 1 0
gitlab.com/sbongini-go/ratatoskr/handler/natshandler/natshandler_opts.go:23.48,24.30 1 0
gitlab.com/sbongini-go/ratatoskr/handler/natshandler/natshandler_opts.go:24.30,26.3 1 0
gitlab.com/sbongini-go/ratatoskr/handler/natshandler/natshandler_opts.go:32.58,33.30 1 0
gitlab.com/sbongini-go/ratatoskr/handler/natshandler/natshandler_opts.go:33.30,35.3 1 0
gitlab.com/sbongini-go/ratatoskr/handler/natshandler/natshandler_opts.go:41.46,42.30 1 0
gitlab.com/sbongini-go/ratatoskr/handler/natshandler/natshandler_opts.go:42.30,44.3 1 0
gitlab.com/sbongini-go/ratatoskr/handler/natshandler/natshandler_opts.go:48.37,49.30 1 0
gitlab.com/sbongini-go/ratatoskr/handler/natshandler/natshandler_opts.go:49.30,51.3 1 0
gitlab.com/sbongini-go/ratatoskr/handler/natshandler/natshandler_opts.go:55.39,56.30 1 0
gitlab.com/sbongini-go/ratatoskr/handler/natshandler/natshandler_opts.go:56.30,58.3 1 0
gitlab.com/sbongini-go/ratatoskr/handler/natshandler/natshandler_opts.go:62.53,63.30 1 0
gitlab.com/sbongini-go/ratatoskr/handler/natshandler/natshandler_opts.go:63.30,65.3 1 0
gitlab.com/sbongini-go/ratatoskr/handler/natshandler/natshandler_opts.go:71.48,72.30 1 0
gitlab.com/sbongini-go/ratatoskr/handler/natshandler/natshandler_opts.go:72.30,74.3 1 0
gitlab.com/sbongini-go/ratatoskr/handler/natshandler/natshandler_opts.go:78.60,79.30 1 0
gitlab.com/sbongini-go/ratatoskr/handler/natshandler/natshandler_opts.go:79.30,81.3 1 0
gitlab.com/sbongini-go/ratatoskr/handler/natshandler/natshandler_opts.go:85.64,86.30 1 0
gitlab.com/sbongini-go/ratatoskr/handler/natshandler/natshandler_opts.go:86.30,88.3 1 0
gitlab.com/sbongini-go/ratatoskr/handler/natshandler/natshandler_opts.go:92.70,93.30 1 0
gitlab.com/sbongini-go/ratatoskr/handler/natshandler/natshandler_opts.go:93.30,95.3 1 0
gitlab.com/sbongini-go/ratatoskr/handler/natshandler/natshandler_opts.go:100.56,101.30 1 0
gitlab.com/sbongini-go/ratatoskr/handler/natshandler/natshandler_opts.go:101.30,103.3 1 0
gitlab.com/sbongini-go/ratatoskr/handler/natshandler/natshandler_opts.go:107.58,108.30 1 0
gitlab.com/sbongini-go/ratatoskr/handler/natshandler/natshandler_opts.go:108.30,110.3 1 0
gitlab.com/sbongini-go/ratatoskr/handler/natshandler/natshandler_opts.go:114.44,115.30 1 0
gitlab.com/sbongini-go/ratatoskr/handler/natshandler/natshandler_opts.go:115.30,117.3 1 0
