{
	"name": "Go",
	"dockerComposeFile": [
        "docker-compose.yml"
    ],
	"service": "vscode",
    "runServices": [
        "vscode",
		//"jaeger",
		//"zipkin",
		"zookeeper", "kafka",
		"kafka-minion", "prometheus", "grafana", 
		//"nats-0", "nats-1", "nats-2",
    ],	
	"workspaceFolder": "/workspace",		
	// Set *default* container specific settings.json values on container create.
	"settings": {
		"go.toolsManagement.checkForUpdates": "local",
		"go.useLanguageServer": true,
		"go.gopath": "/go",
		"go.goroot": "/usr/local/go"
	},

	// Add the IDs of extensions you want installed when the container is created.
	"extensions": [
		"golang.go",
		"mhutchie.git-graph",
		"mohsen1.prettify-json",
		"humao.rest-client",
		"ms-azuretools.vscode-docker",
		"gruntfuggly.todo-tree",
		"shd101wyy.markdown-preview-enhanced"
	],

	// Use 'forwardPorts' to make a list of ports inside the container available locally.
	//"forwardPorts": [2112],

	// Use 'postCreateCommand' to run commands after the container is created.
	// "postCreateCommand": "go version",

	// Comment out connect as root instead. More info: https://aka.ms/vscode-remote/containers/non-root.
	"remoteUser": "vscode",

	"shutdownAction": "stopCompose"
}
