"pdb_chain","best_combination","crob","cave","conffrac","confave","rmsd_max","rmsd_min","rmsd_mean","rmsd_median"
"1g9lA","corrfrac",-0.805038,-0.649591,8,4,61.4118602702618,9.53171216110843,30.6407022486307,30.2124220582363
"2pngA","corrfrac",-0.794041,-0.615104,6,3,15.7151466469401,2.99221173130242,7.48759917103683,7.11948161933788
"2da3A","corrfrac",-0.771479,-0.594012,2,3,20.1292757957782,3.90861422693517,11.4639370094046,11.2325659662064
"1x4mA","corrfrac",-0.752628,-0.561342,3,3,11.9172607452473,3.43388556204069,7.04737502622385,6.90273912206721
"2rrlA","corrfrac",-0.744954,-0.600341,2,4,84.0423811067294,18.4730724098715,50.1139372967352,50.2785568758173
"1wj7A","corrfrac",-0.744488,-0.532125,5,4,35.7678845285017,8.69785792816033,22.3555198496686,22.6545627434587
"2csqA","corrfrac",-0.74331,-0.609182,3,3,21.5762271500586,3.5587061010151,12.4579939889691,12.2837238708102
"2mf9A","corrfrac",-0.73833,-0.632261,5,3,39.2070268826204,4.74965413155808,19.8164718120204,19.4576274860637
"2myxA","corrfrac",-0.737058,-0.645576,6,2,29.9232413023723,4.32911180266807,17.1949576365311,17.0384954470419
"2dk7A","corrfrac",-0.734942,-0.56421,7,2,8.06664465646644,1.89377535879762,4.77212486056994,4.58362085513908
"2l8yA","corrfrac",-0.726499,-0.616955,6,4,5.82599826720913,1.06365082885047,2.85403715495186,2.72686423095876
"5frgA","corrfrac",-0.71875,-0.471097,4,2,11.2148135002841,2.16763451805099,5.81216519914166,5.61858182814982
"1uffA","corrfrac",-0.716817,-0.60942,4,3,51.3973379350181,5.76868578704694,28.7322610431205,29.3190172481755
"2bbuA","corrfrac",-0.715392,-0.587776,5,5,15.1641112080718,4.79609036558652,8.71401598915624,8.52306948654708
"2rs6A","corrfrac",-0.712587,-0.547215,3,2,12.8090984657411,1.17935131116708,5.39571908645264,5.00446446624875
"2mxwA","corrfrac",-0.706305,-0.572376,6,4,18.3849133770174,3.85104263408823,9.26491061703976,9.23120284531714
"2yusA","corrfrac",-0.700657,-0.583516,2,2,28.5780586200965,6.53655943254476,17.6669950701566,17.6028877095409
"1x4bA","corrfrac",-0.69908,-0.609683,4,2,17.0086636412761,3.13469380619873,9.77881886010036,9.6671850593823
"1ue9A","corrfrac",-0.697887,-0.637144,6,3,14.1334699017085,3.00212114595664,7.81625283516319,7.66448780909113
"1yx5A","corrfrac",-0.696337,-0.550917,4,3,60.9991054600686,11.0835314773284,33.8660929430615,34.0305396849653
"1x4aA","corrfrac",-0.689227,-0.553638,2,2,21.1328000424229,3.25261821002458,12.1700905164077,12.7787714481299
"1whqA","corrfrac",-0.688858,-0.525524,4,3,11.7026349804157,2.32876813579691,5.88176067354314,5.53686962451666
"2cptA","corrfrac",-0.687546,-0.609319,3,5,41.1088388709319,4.35148697544137,21.3918223192388,20.5916095022423
"2dh7A","corrfrac",-0.68623,-0.598609,2,2,13.7723615044597,2.59745036892866,7.96462865697656,7.87326866477683
"1whhA","corrfrac",-0.685727,-0.574231,7,2,24.1945292398355,5.43558399643984,12.287820415936,11.3361421818422
"1wieA","corrfrac",-0.681831,-0.566674,7,2,14.0504737746336,4.3144502945045,8.64029674023643,8.51243690171728
"2gqbA","corrfrac",-0.672476,-0.645456,3,2,6.73585844452029,2.02331044996142,3.71360261680988,3.52222374160744
"1ufgA","corrfrac",-0.671261,-0.539676,4,3,32.5578960692633,3.0683014122298,18.8484296960057,20.644416256164
"2da5A","corrfrac",-0.669054,-0.555403,3,4,15.3587622166198,3.5891578232226,9.39003064986712,9.29443811153888
"1u6fA","corrfrac",-0.666846,-0.559472,4,2,40.3002697234667,8.91847898805797,23.1416088450406,22.6924198556214
"2kpmA","corrfrac",-0.665487,-0.5832,3,3,20.3556271981134,2.71220880991332,10.6486167085943,10.9279691457943
"2me8A","corrfrac",-0.665393,-0.580372,7,6,34.5988479803989,5.96183934396152,20.9623769441448,20.8083483147709
"2cp5A","corrfrac",-0.664342,-0.573697,5,5,56.9627813120858,14.3586052867311,35.8563298613124,36.7419191063686
"2me9A","corrfrac",-0.65456,-0.578276,7,3,33.3918226313196,7.26492627317834,20.4880482024118,20.2993259226893
"1wgxA","corrfrac",-0.653544,-0.595743,6,3,17.3901951819338,3.57711759297519,10.0137097180817,9.06309329996366
"2kt5A","corrfrac",-0.646977,-0.538537,2,2,45.7925737763725,3.32009988554561,26.9366423885544,26.3856367219734
"1ap0A","corrfrac",-0.641542,-0.606936,5,4,16.376378253406,0.00331868929400399,9.92630527846263,9.89783329133269
"2lz1A","corrfrac",-0.637577,-0.47928,4,2,28.9668637780022,7.18479683467498,18.9318002216836,19.5618384369147
"2l3sA","corrfrac",-0.634664,-0.551645,6,2,10.5778230416572,3.09561627807845,5.65649362921848,5.49393675153313
"2kb4A","corrfrac",-0.627849,-0.587849,7,5,68.8087402018656,6.67859661779454,33.9070185381496,33.1843195259237
"2cozA","corrfrac",-0.626316,-0.475557,5,2,31.5658205286595,4.66236721078432,16.4730790290393,16.3138056234166
"1n4cA","corrfrac",-0.625872,-0.522458,7,3,77.0940698414236,9.86588912046768,41.5855583096144,42.5959389417362
"2dl1A","corrfrac",-0.625814,-0.600719,5,5,21.2420593936766,3.57441408268303,11.9360023213379,11.4486316481345
"1wf7A","corrfrac",-0.624755,-0.583359,4,2,14.9209452552672,2.82238030437506,7.64117989813007,7.51100005328864
"2ecbA","corrfrac",-0.62046,-0.583173,2,2,30.4548568053391,6.40921837335126,17.4319706900868,16.9422435457526
"2m26A","corrfrac",-0.617631,-0.523388,6,3,6.36959284350762,2.07136871396822,4.0620284981606,3.9372671538702
"1yx6A","corrfrac",-0.615654,-0.528465,4,4,111.903498948233,11.7068019105653,49.4725888112598,51.7376681178886
"1i16A","corrfrac",-0.609179,-0.483536,4,3,34.284029980332,7.10180949747749,20.110305797311,19.6302488732654
"2k5fA","corrfrac",-0.599975,-0.49081,4,2,41.1031741865458,2.55552154960121,23.2390366778202,24.3856378043792
"1jfnA","corrfrac",-0.59741,-0.580116,7,3,15.13469732883,5.84723597921605,11.1587646042072,11.1569334748857
"2ykaA","corrfrac",-0.59578,-0.54539,3,3,40.9586017137643,6.03496409375426,21.3145441463943,20.0414773163499
"2rsoA","corrfrac",-0.593405,-0.57709,5,3,52.7456731534734,5.22372784908482,29.0733248086719,29.3109987399171
"2cp6A","corrfrac",-0.590595,-0.497528,6,2,66.8882225922645,16.3735684614806,36.9494341404209,37.0866140327733
"2a4hA","corrfrac",-0.589795,-0.501128,3,2,37.6691409205264,8.00688185399345,22.0567241752159,22.1609455382375
"2krgA","corrfrac",-0.588563,-0.531746,6,2,55.8625208549807,15.1164718454921,34.1047006312667,33.6414864961897
"2m70A","corrfrac",-0.587786,-0.459457,4,3,55.8410758022698,0.555364942497129,30.4475594448672,31.1293400345571
"2m06A","corrfrac",-0.586498,-0.415516,4,3,3.69518261626778,1.14920717676802,2.17235287012017,2.13141305678426
"1uvgA","corrfrac",-0.583195,-0.579577,6,2,18.317461448962,2.90712507878217,8.46282175338549,7.97781563231176
"5jtlA","corrfrac",-0.583076,-0.503828,3,2,17.2595152451271,3.81691522043652,9.6247851494901,9.33672998143279
"2k27A","corrfrac",-0.581658,-0.459782,3,3,71.3681287188048,14.6439691269974,40.1402991492412,38.7397434957083
"2dgqA","corrfrac",-0.579031,-0.549871,3,2,11.9423744223078,1.9832128768276,6.307722948123,6.32469943065035
"1jvrA","corrfrac",-0.578618,-0.400833,3,2,49.7705585404731,9.32791095638348,28.5579960033001,28.4347819442565
"2jvmA","corrfrac",-0.577491,-0.560076,3,2,27.1686497683911,5.30246264366851,15.5978376822997,15.4538553811265
"1wicA","corrfrac",-0.571714,-0.510353,7,2,16.7751309005403,3.76452953917429,9.22583556305668,9.00100525417065
"2k0lA","corrfrac",-0.570252,-0.422898,7,4,17.1515476010045,7.69732552316217,12.1324992157996,12.1400174392416
"2djvA","corrfrac",-0.566465,-0.536679,4,3,15.2286803545735,3.30481583010099,8.14769873302216,8.04361439133113
"2mlhA","corrfrac",-0.564383,-0.396954,5,5,22.6267569510491,8.52163523631706,15.2165448199306,15.0924608951329
"2khmA","corrfrac",-0.56249,-0.442311,3,2,28.2304979652199,5.09341942468066,16.0108284564764,15.4695593996983
"2b8aA","corrfrac",-0.55981,-0.498281,4,3,16.3687439944104,0.000929320377284569,7.01237421255224,6.40438559255935
"1wfyA","corrfrac",-0.55965,-0.474961,3,2,19.0411486848978,3.83648904373417,10.6506103313703,10.0822820707293
"2rneA","corrfrac",-0.55861,-0.542201,2,4,29.0523737834307,3.68227820312607,17.4154632858683,17.8854834291559
"2l7aA","corrfrac",-0.55681,-0.486151,4,5,13.2301963920616,2.77286008681807,7.10016645971425,6.91087030324869
"1rf8A","corrfrac",-0.555365,-0.430775,3,3,18.8176407549448,3.77894108674496,11.4380749271729,12.1071481291672
"2jrsA","corrfrac",-0.551189,-0.476037,5,3,22.6057593347769,4.60420254184112,14.0648223809078,14.1875039864346
"1qklA","corrfrac",-0.549822,-0.499072,3,3,23.7787257093858,4.85626516677979,12.7768847443645,12.2565694481692
"2kqzA","corrfrac",-0.545238,-0.437212,6,4,32.1786277810439,6.88829910556604,18.3768566974023,18.5103464518561
"1z87A","corrfrac",-0.542645,-0.502829,6,2,30.1150092482605,11.2361289238739,21.1302751987149,21.6310155443309
"1mv3A","corrfrac",-0.538592,-0.440604,4,2,293.715981391257,36.7311603186832,173.728681086751,175.701631066344
"2rsmA","corrfrac",-0.530229,-0.490843,2,2,62.6180831692516,7.31557833191845,34.7885567411332,33.4556998296894
"1zmzA","corrfrac",-0.52834,-0.502971,3,3,24.4340030047623,0.59296313166183,14.9434203883774,16.0521237260442
"1xu6A","corrfrac",-0.525986,-0.498508,2,2,22.8876377103995,4.57503981676663,13.1674367001829,12.9211950731782
"3zbeA","corrfrac",-0.525058,-0.487847,4,6,59.9444628384133,12.7568984960858,30.6222623133618,30.0991823968318
"1lwmA","corrfrac",-0.520421,-0.504279,4,3,21.9216791629332,3.70862424713688,11.9465574919526,11.7887366665354
"2miiA","corrfrac",-0.519483,-0.518297,6,2,70.2589917175914,5.47662547967908,41.16347279056,42.1680759696537
"1yx4A","corrfrac",-0.517595,-0.451727,4,3,68.0730129221821,12.4362185973068,41.3589593714923,43.4449107977357
"2k3aA","corrfrac",-0.50216,-0.454179,3,3,58.6015886241232,8.79912783874519,32.8968301630402,33.441723013786
"1d4bA","corrfrac",-0.500004,-0.488387,6,2,47.0708172913475,0.000202444082544779,27.4840888223627,28.6176648047504
"2cowA","corrfrac",-0.498972,-0.455501,2,2,20.8489684039763,4.09211923579947,11.2130540813748,11.265782225456
"2mphA","corrfrac",-0.494358,-0.354861,6,2,11.9537565933042,2.09358077247878,5.85880319689153,5.23921462037267
"1ddbA","corrfrac",-0.489114,-0.468199,7,5,30.0455804715402,5.93375771026274,19.4691103692776,19.6070628626492
"5mrgA","corrfrac",-0.487392,-0.443931,2,2,28.6887093427778,5.23841088381957,16.287598870168,15.7668929645835
"2cpeA","corrfrac",-0.471985,-0.45001,3,2,17.0182034244647,4.14354989098901,10.3167624126281,10.3655877489912
"2k8pA","corrfrac",-0.468734,-0.411611,7,4,108.245453546301,19.706769160923,67.7055531355892,69.1162267320051
"1wz0A","corrfrac",-0.464477,-0.422256,3,2,25.859431382625,2.81149289832069,13.3559052927735,13.4104042075565
"2do0A","corrfrac",-0.464173,-0.428987,3,2,27.5104596090925,3.83181993657267,14.3572821410257,14.2394117148075
"2kl7A","corrfrac",-0.46158,-0.284083,3,2,6.24694027865406,2.03854571540665,3.64432933820074,3.5165495540811
"2l33A","corrfrac",-0.459814,-0.44257,3,3,13.4181444906302,2.72065579521629,6.5533506996063,6.32196060967432
"2lbcA","corrfrac",-0.457943,-0.417422,4,2,14.366701076083,4.3350128887965,9.90942737194634,9.85116361670918
"2ru8A","corrfrac",-0.457748,-0.453933,5,4,30.1842748492309,4.76036699695015,16.048112909135,16.039407326373
"1i87A","corrfrac",-0.456185,-0.326668,2,2,6.82385917205213,2.7172633330755,4.05325320594656,3.9241150639663
"2ejmA","corrfrac",-0.455733,-0.418773,6,2,17.58195923627,3.40240854974736,9.03812269528337,9.0402286949293
"2mkzA","corrfrac",-0.45135,-0.394798,6,2,14.6906567904968,3.60361394154761,9.6719850173837,9.44524049724443
"2p01A","corrfrac",-0.449306,-0.37496,3,3,108.839678602622,13.2526147669428,66.7283512744695,64.5409210097989
"2o3dA","corrfrac",-0.449145,-0.444067,3,5,25.8028977646523,5.82746203808397,15.8585905348132,15.686052045263
"2dlpA","corrfrac",-0.449069,-0.426905,3,2,23.7190277310408,3.5779779682352,13.5873834240683,13.8693804468269
"4behA","corrfrac",-0.439818,-0.305219,3,2,99.6356982807605,12.0846812992839,60.4256791400136,61.8734850752318
"2bafA","corrfrac",-0.433762,-0.409458,7,8,134.490499541095,15.8557557446796,63.7269689019673,63.6696981627816
"1wghA","corrfrac",-0.431392,-0.371979,4,2,15.163602129828,3.40300664093914,8.26516567569095,7.55699693844959
"1fhoA","corrfrac",-0.42894,-0.406205,2,5,8.9160986927669,3.173597780745,5.00953546719636,4.91645940870774
"2hlwA","corrfrac",-0.427907,-0.28904,5,2,34.5910313411031,4.6219334291538,17.732697340316,16.801059935051
"2kuqA","corrfrac",-0.424943,-0.409541,5,4,16.3682020890338,2.85557514324047,9.6896191354514,9.94734639394751
"2mvoA","corrfrac",-0.419315,-0.409101,4,3,50.2799633756273,7.57596467039509,24.546847411203,22.7628215307257
"1zyiA","corrfrac",-0.418231,-0.38638,3,2,9.63416283606023,2.42441295240582,6.14714031899225,5.89949022198616
"2l22A","corrfrac",-0.417222,-0.385078,7,2,31.0148103514533,6.09750324788134,17.0184280935788,16.4474539127479
"2yt2A","corrfrac",-0.416812,-0.402744,2,3,16.3531206651879,2.79989691220128,9.64176562871375,9.84040501592279
"2k7nA","corrfrac",-0.414021,-0.413923,5,3,6.18622278095176,1.65691248271279,3.16824493333505,2.71927360058228
"2crqA","corrfrac",-0.405029,-0.353142,2,2,9.02378788753846,2.23479157904842,4.98009805729886,4.7194138910961
"2hmxA","corrfrac",-0.403791,-0.25015,2,2,22.2187045714773,0.450933242812818,12.2162403066396,12.8008103518179
"1q9gA","corrfrac",-0.403413,-0.286246,4,5,4.5235793491856,2.27356061385327,3.00959766626118,2.95354176844952
"1tteA","corrfrac",-0.399126,-0.374814,6,3,37.0593554463961,4.45536276653151,19.0419311129774,18.4024990803074
"2gowA","corrfrac",-0.398653,-0.315794,5,2,22.4155424001925,4.10643968621867,12.5330229745415,12.6050453069991
"2dneA","corrfrac",-0.398144,-0.380688,2,2,9.47781000596969,1.66071438777948,4.50090936755316,4.09119269183169
"1ro4A","corrfrac",-0.394178,-0.366369,3,5,18.8352054344682,2.84400717177426,10.0907195903255,9.94674557676859
"5h7uA","corrfrac",-0.390181,-0.333822,5,3,155.729789397448,20.0759911605411,85.2256079834269,83.2120625050045
"2jvlA","corrfrac",-0.389583,-0.361744,4,2,40.407155717838,2.34070783087781,23.0989505764991,23.7294996138365
"2fftA","corrfrac",-0.383473,-0.266659,4,7,112.127352752669,15.6055544514796,55.8423060772188,51.6306115128161
"1kn7A","corrfrac",-0.381966,-0.347987,3,2,61.6032664673987,11.8545417642353,32.6390975418554,32.1405014981665
"1x49A","corrfrac",-0.381098,-0.373518,3,2,16.8384111290381,3.89834595773458,9.40533651173777,9.13632705263114
"2afjA","corrfrac",-0.373418,-0.309859,4,4,17.5336103987469,4.94069804730974,10.797430428725,10.3215712318503
"2kfwA","corrfrac",-0.370875,-0.366012,2,3,51.0431359521692,9.47323786909681,27.9373693991386,27.066775710361
"1wivA","corrfrac",-0.36967,-0.322321,2,2,39.4731660717256,6.01430709522023,21.3385440285209,21.1500647446349
"1hn6A","corrfrac",-0.368857,-0.243523,2,2,45.5904165987267,7.33646071964603,27.5685844217888,27.2051519256901
"2enpA","corrfrac",-0.363739,-0.319535,3,2,6.8157952840253,1.65090707699457,3.29586755113574,3.19815521629154
"2kltA","corrfrac",-0.358783,-0.316293,3,3,12.9836800092783,3.43460626172447,6.91672727057193,6.66714840515306
"2d7lA","corrfrac",-0.349331,-0.34815,2,2,28.5739005044295,3.5660643053133,15.6634054056181,14.9957534218728
"2ml8A","corrfrac",-0.330976,-0.321142,4,2,15.2793494413122,2.4469257784059,7.67227836135414,7.1476631194589
"2nboA","corrfrac",-0.330713,-0.294805,2,4,10.6391646788172,2.95121782416502,6.06365052896776,5.97603250591579
"1ej5A","corrfrac",-0.326401,-0.254241,2,2,31.3381645992326,3.41297608640247,20.4871093917155,24.5537787637991
"1d7qA","corrfrac",-0.322961,-0.269007,3,2,31.7113069258278,8.59775576263051,17.9561202165106,17.627052539982
"2wgnB","corrfrac",-0.317556,-0.317479,2,2,25.2072575828567,4.48043157502543,12.8919755973188,12.8128384272599
"2ltjA","corrfrac",-0.306058,-0.282612,6,4,36.7598019012592,7.58516019060357,20.0172922931758,18.815596883356
"1qrjA","corrfrac",-0.299674,-0.264618,3,3,37.8340566655365,5.53045969722381,21.2063011787049,20.9080799036427
"1aciA","corrfrac",-0.299251,-0.278959,2,2,23.6523225197643,2.71812046855524,13.4911251746255,20.7099312905073
"1kkdA","corrfrac",-0.296707,-0.221496,2,3,101.359481465186,16.3636049592035,51.689232160212,51.623429646713
"2m5iA","corrfrac",-0.295537,-0.268718,4,2,19.7934188132955,3.86741247022021,11.0385644049562,10.6489906298681
"1wvkA","corrfrac",-0.276433,-0.215963,3,4,20.15884336931,5.36443380484014,11.5354426788198,10.2542011821361
"1u3nA","corrfrac",-0.275075,-0.237799,4,2,8.92123893052728,3.47339401382979,5.82983381534812,5.69891361100333
"2knaA","corrfrac",-0.260792,-0.24582,3,2,38.0114188522799,7.06818803486112,21.5583015915584,21.0954897970833
"4behB","corrfrac",-0.238977,-0.167471,2,4,105.064959284885,12.8103344719989,61.4667024900777,64.9841556751037
"2l9qA","corrfrac",-0.224674,-0.213949,2,4,77.8779435289784,17.7915535851279,41.8041233732841,42.0766572536146
"2yrqA","corrfrac",-0.198975,-0.150806,5,3,33.1918171913264,7.27736089376051,20.134232584747,19.6432889076803
"2h8wA","corrfrac",-0.170583,-0.083078,4,7,27.368947896585,2.05789845250351,15.3701260499456,15.7706789982656
"2kvuA","corrave",-0.643468,-0.661408,3,2,26.3068073190191,4.84432710703974,16.2168990856357,15.942832598599
"2kw9A","corrave",-0.642199,-0.678534,3,2,35.0959322453947,5.0940363825425,19.1239303328597,19.1263750373452
"1uemA","corrave",-0.612754,-0.623318,5,5,10.6171910436857,1.97071770734707,6.07187946150857,5.95213982416924
"2dmxA","corrave",-0.600865,-0.62625,3,2,17.8259126728357,3.17225471693722,9.77033116530595,9.82486370601581
"2coyA","corrave",-0.55583,-0.558299,4,2,31.3140547675024,7.11699859240437,18.2074935872363,17.9679261311052
"2cquA","corrave",-0.550341,-0.557511,3,2,17.8504111231994,3.403814846407,8.90208421013652,8.44178696785254
"1vejA","corrave",-0.522081,-0.59928,5,5,28.0622845913601,3.70255672438618,15.9295742855874,15.9329634253951
"2ru4B","corrave",-0.492168,-0.554972,5,3,1.73824082185464,0.853210017131382,1.23071590144366,1.20681508437991
"2lfbA","corrave",-0.469774,-0.49477,2,2,12.9704926078388,3.38244772021683,7.05140708183107,6.81251202705161
"2enmA","corrave",-0.469233,-0.489821,2,2,11.1297173859406,2.9275769999966,6.70228429666519,6.64958611152836
"2eehA","corrave",-0.465991,-0.555493,3,3,7.44711410212037,1.8847016050293,3.93616038367096,3.71901940241352
"1psyA","corrave",-0.465672,-0.491396,4,3,16.5905281208285,2.91873901539689,8.40282487962167,8.45449552589472
"2mbfA","corrave",-0.464511,-0.481505,4,2,15.4634495107747,1.78211529946692,8.82356366020931,9.08091457218615
"2krsA","corrave",-0.462626,-0.535332,4,3,12.2320688914372,2.06870713967196,6.66642166027765,6.35304405707784
"1v60A","corrave",-0.461352,-0.556601,2,2,24.2286531344051,2.21288360231585,12.4125056181607,11.9971848839991
"2rvlA","corrave",-0.451812,-0.489846,3,2,29.105146938734,4.51463560284836,16.8023976426434,16.5796203723701
"2eo6A","corrave",-0.448686,-0.459141,5,2,7.73113208476331,2.09961698128137,4.26446393458445,4.03017029294957
"1wfwA","corrave",-0.447293,-0.451633,2,2,5.67851419351453,1.39098864316191,3.41449136644551,3.40707447851154
"2budA","corrave",-0.44536,-0.487678,6,2,12.8915289620068,2.07724572032504,6.6890851051773,6.18599743040813
"2dj3A","corrave",-0.443806,-0.483888,2,3,14.5192033232839,1.54558108643217,8.06613995311322,8.02651690728195
"2kpyA","corrave",-0.440078,-0.476884,5,4,32.1422359794595,5.39634011090782,18.941774043092,20.7315873526963
"2dnhA","corrave",-0.43977,-0.473926,3,2,11.2987760896395,2.34948019175063,6.47651771088986,6.3801713154566
"1ug1A","corrave",-0.439582,-0.492568,3,5,15.8615666193338,1.47577921569531,9.49613356374916,10.5998454468182
"1ixdA","corrave",-0.435602,-0.511536,3,2,10.0889517452165,3.21181335373505,6.82996439686324,6.76304106525719
"2ljmA","corrave",-0.417705,-0.480791,4,3,21.0194689047222,2.66115285397046,8.65529205303031,7.86534721746464
"1vegA","corrave",-0.415667,-0.441891,2,2,32.3729368735566,3.6252379448288,19.2684370572341,19.5834833432564
"1irpA","corrave",-0.413736,-0.48522,7,4,3.80028292376418,2.38742448260269,2.99145698295623,2.92056265630821
"1pn5A","corrave",-0.407758,-0.501077,3,8,6.26690093619534,2.25147460161567,3.87536134610223,3.72599146976307
"2jspA","corrave",-0.40447,-0.433658,3,2,11.3560597120616,2.59288787652492,6.10233396361626,6.0078993220356
"2kzwA","corrave",-0.403949,-0.425435,4,2,120.753203064307,15.9412008291679,62.4354316816075,61.1061943548668
"5gvqA","corrave",-0.39827,-0.467765,2,2,13.1030763152708,2.60127470034725,7.94590042895961,8.29064835068495
"2ehfA","corrave",-0.397547,-0.413737,2,4,15.0023033637898,2.70220980599517,8.14789335516749,7.88812212181481
"1eq3A","corrave",-0.396673,-0.477157,4,2,3.3781328546008,1.64669579195734,2.32186248393007,2.30326552772263
"2cs1A","corrave",-0.392837,-0.404923,2,3,13.4863403937981,2.98633121397564,6.65052170680598,6.49717584521109
"1v9jA","corrave",-0.388395,-0.501613,4,4,32.227304760465,5.65600104439164,17.2065922831715,16.7144526119213
"1q9fA","corrave",-0.382529,-0.392882,6,2,3.68254644472647,1.84765712859959,2.51795420471207,2.45528085642098
"2gfuA","corrave",-0.372906,-0.48722,2,2,15.512314559008,3.49254609901306,9.29324396000799,9.25099660598972
"1hhnA","corrave",-0.36351,-0.4223,2,2,30.737661668248,2.41247728558537,13.1282952707688,12.2682366073791
"2bidA","corrave",-0.362042,-0.441165,3,3,99.3968397175307,24.6796903933924,54.3477384393041,53.6508254337323
"2m16A","corrave",-0.358565,-0.431166,2,2,1.46467963762053,0.356900877778606,0.810653330173831,0.818360998230437
"2mk5A","corrave",-0.356305,-0.465476,4,5,36.9390720184981,5.71031679379491,18.1407656124576,18.3323297812948
"1qu6A","corrave",-0.356067,-0.384938,5,4,7.26933013020453,2.69986252184653,4.86222312530614,4.82974880320707
"2m9uA","corrave",-0.346584,-0.382005,3,2,13.5831969301301,1.26375852390462,6.96117881291001,6.68740170795766
"1whjA","corrave",-0.340286,-0.391262,2,2,12.9185710677061,3.79071823216739,8.45568020616551,8.51413463597276
"2do8A","corrave",-0.339798,-0.415651,4,6,5.68484080738583,2.17821338437545,3.67300311810309,3.65864233238671
"2px9A","corrave",-0.339401,-0.441765,3,3,4.36398110742826,1.34163599835191,2.48331498750558,2.34091430798458
"2hjqA","corrave",-0.329545,-0.393324,2,3,38.7790840008625,7.4632073135754,23.5473386267674,23.2182641637131
"2l9yA","corrave",-0.326759,-0.43538,3,2,26.106406727154,3.33246233340946,14.7336540635858,14.6662763117424
"2f3jA","corrave",-0.322699,-0.391916,5,3,81.7146626748038,11.6636380650032,44.6621686479931,47.2460641747014
"2jozA","corrave",-0.321788,-0.346833,4,2,30.9471975204601,4.31605028460736,17.1540996377964,16.7635558442964
"2jqaA","corrave",-0.320318,-0.346755,4,3,38.7332383922258,4.80919309672743,19.5101689342145,19.0055527605414
"2aivA","corrave",-0.320025,-0.380113,4,3,6.2459722936159,2.95965939338165,4.25703844988544,4.17556128767308
"2eecA","corrave",-0.314787,-0.393091,4,3,19.7690532127363,3.19724376049122,11.7172561515588,11.6844491754044
"2mqeA","corrave",-0.291884,-0.491692,3,2,6.7453575054783,1.70773948961297,4.10266970106536,4.07990916666281
"1hzkA","corrave",-0.287527,-0.314101,2,3,2.27166143444116,0.857857087059483,1.54505809078731,1.54112671297806
"1zzaA","corrave",-0.285301,-0.351245,4,3,46.2096681893158,10.0998600402844,25.9870261340404,25.4447710459621
"2jz6A","corrave",-0.282949,-0.369105,5,2,11.3677514550089,3.33148635756615,6.79170150327068,6.66670263682967
"2ekoA","corrave",-0.281553,-0.383029,3,2,13.4300465182649,2.26016605788057,6.42904943367907,5.78434427331704
"1hueA","corrave",-0.272626,-0.386775,3,3,10.9761917773576,1.50228091395865,4.8576283380685,4.64236176216566
"2lgoA","corrave",-0.272461,-0.360965,4,3,19.9645765635422,3.01043294100827,10.5402163195024,10.4207734792455
"2k5qA","corrave",-0.271584,-0.31912,3,3,12.8679088444305,2.88073670637019,6.88455462873078,6.74832697374678
"2iemA","corrave",-0.266844,-0.374483,5,3,9.44100350342371,2.08758155614445,5.76874612692205,5.94426127339349
"2jz3B","corrave",-0.266636,-0.282682,2,2,20.2201316920555,4.44594439072552,9.41011364190039,8.91542886588901
"1eo1A","corrave",-0.262605,-0.349797,4,3,10.5097054223473,2.07488222751666,5.22508130234748,5.12785599068451
"1wjzA","corrave",-0.262551,-0.383642,3,3,12.0239355396518,2.74474540733086,6.42575295620759,6.25255340172891
"1droA","corrave",-0.256947,-0.331863,3,3,15.4908603635589,2.09023269941529,6.71353259071168,4.92451222432648
"2kpwA","corrave",-0.256777,-0.362631,5,3,8.47763842870576,2.00830385371648,4.5519816690626,4.13413766559761
"1x5kA","corrave",-0.23595,-0.351236,2,2,10.8436630576602,1.96703858179194,5.58924744633836,5.35228874342782
"1foxA","corrave",-0.234902,-0.263702,5,4,8.2789440338602,2.00158899048783,4.77706095444912,4.74017923644792
"1yx0A","corrave",-0.232311,-0.308442,4,5,7.19954700009817,1.98779032033459,3.9103838097743,3.67156281687986
"1enwA","corrave",-0.228645,-0.241748,2,3,23.1991427308719,5.01604562746813,13.3900674174507,13.4281114347496
"2couA","corrave",-0.226869,-0.322723,3,2,11.1766495279097,2.3277745071126,6.5337678347904,6.61478793856441
"1qgbA","corrave",-0.225762,-0.295594,4,2,36.3072426382016,4.75565100865581,19.7903246338573,20.2239219456388
"1mm5A","corrave",-0.224493,-0.27064,5,2,14.477340008969,3.80831365490261,8.37214329194019,7.95522838141646
"2n45A","corrave",-0.222287,-0.341306,2,3,4.18826622130692,0.944280884689078,2.36049860877501,2.31039645274327
"2hvaA","corrave",-0.220069,-0.298107,3,2,16.0375628552733,3.0215167775212,8.84125092832074,8.43481694532487
"1vveA","corrave",-0.217491,-0.469384,5,3,106.178408464883,0.875095074737887,55.0910598862387,58.0101997262323
"1x5gA","corrave",-0.196676,-0.337545,4,2,12.1109286692953,1.88573302311933,5.3042572113311,4.91478601562795
"1ys5A","corrave",-0.177994,-0.275223,3,2,16.1120900518754,0.227242359043357,9.95154699340588,9.9240411798694
"1inzA","corrave",-0.171778,-0.286259,3,2,20.8859709719033,3.79258205829734,12.7701838980174,12.2342570644114
"1vzsA","corrave",-0.168295,-0.209448,10,4,17.4480616907196,3.34793733042019,8.75403644321817,8.41209657357533
"1xpnA","corrave",-0.157127,-0.368307,7,2,21.3554591783377,4.13857256295254,12.607545673303,13.0897157998357
"2n1iA","corrave",-0.151613,-0.339296,5,4,21.4398991987698,6.9064925831522,13.610111781685,13.8188312347078
"2kcqA","corrave",-0.144298,-0.295424,4,2,10.4640460076241,2.44563127501538,6.1773536195536,6.04658085812916
"2g2bA","corrave",-0.142561,-0.295969,5,2,22.6961542394301,3.24320163110467,13.3429293221523,13.3312585878798
"2cuhA","corrave",-0.134497,-0.326887,9,2,15.1207610939684,3.22325271169951,7.71665340760154,7.15053382261491
"2di9A","corrave",-0.13009,-0.270275,8,3,26.7919812180396,2.96192411544402,16.0802660128571,16.4584185168193
"2yszA","corrave",-0.119977,-0.277399,6,2,10.9705679817976,3.11205724170936,5.84256581029043,5.78380755598476
"1x5zA","corrave",-0.11812,-0.301212,7,2,16.8643875726336,2.82965069283795,8.06250823868816,7.74317669221882
"2cqrA","minindiv",-0.581845,-0.61346,2,2,16.9203023913197,2.99585047041669,9.84467382020112,9.74460139504249
"1x4zA","minindiv",-0.497772,-0.579827,3,2,12.6477963510325,2.34045901233706,6.49820616892631,6.09341810566187
"2hdeA","minindiv",-0.48316,-0.520613,4,2,18.1763138351849,3.09692710929241,10.637374843143,10.6362632600741
"2copA","minindiv",-0.477792,-0.481128,4,2,14.470669874428,2.36444661951032,7.52892808535336,7.16269731097027
"2m0vA","minindiv",-0.465198,-0.509546,4,2,13.136519469831,2.61177618711146,7.92861221297567,8.19183884490478
"1k9cA","minindiv",-0.433849,-0.375049,2,2,27.8758477801028,3.92753783335469,15.9934944898968,15.763859179831
"2dgpA","minindiv",-0.433478,-0.456314,2,2,12.0689843091586,2.41564611459199,7.16280022065723,7.26154000100512
"1wj5A","minindiv",-0.43039,-0.492882,5,3,12.093505797879,3.28524858394815,7.55763358716732,7.6378402171797
"1wjqA","minindiv",-0.430069,-0.43412,2,2,21.4521069899535,3.59230586140283,10.7607859281969,10.1415628486079
"1wggA","minindiv",-0.428514,-0.475219,4,2,18.731725504475,2.70276332936928,9.53346816580081,9.2881800499515
"2lpdA","minindiv",-0.40249,-0.407789,3,2,17.4044708566506,3.09352787198319,8.20679560432791,7.6604804412751
"1x5aA","minindiv",-0.357104,-0.433927,2,2,9.97861832297007,2.15500040332195,5.21516160103577,5.12085436127118
"2oqpA","minindiv",-0.324374,-0.358677,2,2,8.88354556755051,1.92360494710772,5.49457697199313,5.52606029862884
"2cqwA","minindiv",-0.321168,-0.343076,2,2,50.8883180811761,11.0853440675172,29.0201632039727,29.3501436224451
"1x5oA","minindiv",-0.317582,-0.354082,3,2,28.60121869091,2.5928740691743,14.1375703583617,14.938547221121
"2eh0A","minindiv",-0.312755,-0.373988,2,2,9.05498684576201,1.85445377195218,4.72845395380904,4.29051861333908
"2adzA","minindiv",-0.304237,-0.321907,5,2,21.2149583435098,6.26728450506403,13.9843840420617,13.8201041654375
"1wjsA","minindiv",-0.301599,-0.506966,3,2,14.8804137621332,2.38661606549828,7.626926516694,7.54538011879287
"2m4eA","minindiv",-0.294494,-0.377061,2,2,2.5226727935378,0.692165568645685,1.46607672006787,1.39949097988465
"2ldyA","minindiv",-0.288798,-0.327924,2,2,32.981383032102,3.59987626049967,15.3991192263759,14.701130174351
"2dhsA","minindiv",-0.288228,-0.32091,2,2,25.6960337922491,6.27866959834117,17.6197783345745,15.6354007661348
"1vdlA","minindiv",-0.283478,-0.478546,2,2,19.7156378989497,3.92105111067173,11.1794716997054,11.2559563871337
"2jygA","minindiv",-0.28246,-0.365519,2,2,10.1255052966212,1.34347005832622,5.51446962970419,5.46537493267954
"1wj3A","minindiv",-0.279465,-0.374142,2,2,15.005028687561,2.66475500549605,7.07311572453988,6.70912030299113
"2n1rA","minindiv",-0.278512,-0.282039,3,2,27.9412231783344,3.39448110909458,17.0914511730526,19.9182776316745
"2lekA","minindiv",-0.271116,-0.278621,2,2,12.9121017526673,2.21353043491644,7.1217237440085,7.41155167640948
"1sm7A","minindiv",-0.266601,-0.364338,2,2,5.50331386321589,1.7125520711296,3.3377388583768,3.24578710008567
"2lxfA","minindiv",-0.254445,-0.397605,2,2,50.0438987322362,6.25792417923531,26.7150146793145,26.7801635669782
"2an7A","minindiv",-0.253777,-0.346921,4,2,34.6720747482668,6.83799588673377,19.1019824528972,18.5165508688439
"1j6yA","minindiv",-0.252201,-0.376884,3,2,3.10138899258596,1.59556441163203,2.2853122267711,2.25541521634676
"2edqA","minindiv",-0.243681,-0.437141,2,2,8.70760739641455,2.04246618613267,5.02745226614922,4.98091862952925
"2do7A","minindiv",-0.231206,-0.343675,5,2,25.6146340639042,2.59246626337406,13.7180391417382,13.4527720994886
"2kvtA","minindiv",-0.221979,-0.352093,6,2,13.3130381581366,2.43064851950094,6.66703427906764,6.24617329236625
"2cqxA","minindiv",-0.212217,-0.315339,4,2,19.1892303533924,3.55681396914586,10.0584959574887,9.81556724251181
"1du2A","minindiv",-0.20201,-0.181056,5,8,13.8110832686155,3.32053200200145,7.62846836946211,7.37698727962963
"2yraA","minindiv",-0.193161,-0.399165,7,2,7.3379459033902,1.88278249020045,3.99735031624347,3.89128673706636
"2n44A","minindiv",-0.18309,-0.341364,3,2,5.32142446510687,0.525300879033639,2.43205033050929,2.68534340965359
"2fc8A","minindiv",-0.182766,-0.330207,4,2,9.72371933500152,2.43852344828651,5.83908541908815,5.69751076720194
"2dlgA","minindiv",-0.179662,-0.294995,5,2,9.85005006357338,2.39066460322188,4.9577829039492,4.82360397331274
"2dsmA","minindiv",-0.163399,-0.208337,7,6,21.5543945193833,5.52352864395176,12.7391959477273,12.6434987323931
"2n78A","minindiv",-0.154899,-0.251824,7,4,5.66230780885517,1.40225900583467,3.3948179776998,3.4252756215133
"2e9iA","minindiv",-0.151032,-0.351514,7,2,20.6255912473288,2.53362858590614,11.8126453843535,11.6876534052243
"1wk1A","minindiv",-0.133161,-0.269756,7,2,17.4456817025494,1.71275477520864,8.18061563495969,7.98637214390454
"1l6nA","minindiv",-0.132998,-0.167744,2,2,118.768425178811,21.0437755183325,64.5519721781287,63.8570116532037
"2lsbA","minindiv",-0.121985,-0.232085,6,2,46.3540210349182,3.39083107100791,26.3638239870975,27.9703333088647
"2m88A","minindiv",-0.117531,-0.185516,5,2,54.0973436351896,13.9464169342058,33.941395666488,33.8192909390704
"1mm4A","minindiv",-0.10334,-0.188848,8,2,15.1587523411782,4.07761097948296,9.75255490939625,9.77756668622548
"1wlmA","minindiv",-0.095056,-0.172122,10,4,48.8884869629157,4.63375655395539,25.3829217007555,25.1331519678913
"2k4kA","confmoda",-0.381314,-0.458824,7,3,42.867773451896,8.84645374147178,21.3543302891264,20.6836159922151
NA,NA,NA,NA,NA,NA,NA,NA,NA,NA
NA,NA,NA,NA,NA,NA,NA,NA,NA,NA
NA,NA,NA,NA,NA,NA,NA,NA,NA,NA
NA,NA,NA,NA,NA,NA,NA,NA,NA,NA
NA,NA,NA,NA,NA,NA,NA,NA,NA,NA
NA,NA,NA,NA,NA,NA,NA,NA,NA,NA
NA,NA,NA,NA,NA,NA,NA,NA,NA,NA
NA,NA,NA,NA,NA,NA,NA,NA,NA,NA
NA,NA,NA,NA,NA,NA,NA,NA,NA,NA
NA,NA,NA,NA,NA,NA,NA,NA,NA,NA
NA,NA,NA,NA,NA,NA,NA,NA,NA,NA
NA,NA,NA,NA,NA,NA,NA,NA,NA,NA
NA,NA,NA,NA,NA,NA,NA,NA,NA,NA
NA,NA,NA,NA,NA,NA,NA,NA,NA,NA
NA,NA,NA,NA,NA,NA,NA,NA,NA,NA
NA,NA,NA,NA,NA,NA,NA,NA,NA,NA
NA,NA,NA,NA,NA,NA,NA,NA,NA,NA
NA,NA,NA,NA,NA,NA,NA,NA,NA,NA
NA,NA,NA,NA,NA,NA,NA,NA,NA,NA
NA,NA,NA,NA,NA,NA,NA,NA,NA,NA
NA,NA,NA,NA,NA,NA,NA,NA,NA,NA
NA,NA,NA,NA,NA,NA,NA,NA,NA,NA
NA,NA,NA,NA,NA,NA,NA,NA,NA,NA
NA,NA,NA,NA,NA,NA,NA,NA,NA,NA
NA,NA,NA,NA,NA,NA,NA,NA,NA,NA
NA,NA,NA,NA,NA,NA,NA,NA,NA,NA
NA,NA,NA,NA,NA,NA,NA,NA,NA,NA
NA,NA,NA,NA,NA,NA,NA,NA,NA,NA
NA,NA,NA,NA,NA,NA,NA,NA,NA,NA
NA,NA,NA,NA,NA,NA,NA,NA,NA,NA
NA,NA,NA,NA,NA,NA,NA,NA,NA,NA
NA,NA,NA,NA,NA,NA,NA,NA,NA,NA
NA,NA,NA,NA,NA,NA,NA,NA,NA,NA
NA,NA,NA,NA,NA,NA,NA,NA,NA,NA
NA,NA,NA,NA,NA,NA,NA,NA,NA,NA
NA,NA,NA,NA,NA,NA,NA,NA,NA,NA
NA,NA,NA,NA,NA,NA,NA,NA,NA,NA
NA,NA,NA,NA,NA,NA,NA,NA,NA,NA
NA,NA,NA,NA,NA,NA,NA,NA,NA,NA
NA,NA,NA,NA,NA,NA,NA,NA,NA,NA
NA,NA,NA,NA,NA,NA,NA,NA,NA,NA
NA,NA,NA,NA,NA,NA,NA,NA,NA,NA
NA,NA,NA,NA,NA,NA,NA,NA,NA,NA
NA,NA,NA,NA,NA,NA,NA,NA,NA,NA
NA,NA,NA,NA,NA,NA,NA,NA,NA,NA
NA,NA,NA,NA,NA,NA,NA,NA,NA,NA
NA,NA,NA,NA,NA,NA,NA,NA,NA,NA
NA,NA,NA,NA,NA,NA,NA,NA,NA,NA
NA,NA,NA,NA,NA,NA,NA,NA,NA,NA
NA,NA,NA,NA,NA,NA,NA,NA,NA,NA
NA,NA,NA,NA,NA,NA,NA,NA,NA,NA
NA,NA,NA,NA,NA,NA,NA,NA,NA,NA
NA,NA,NA,NA,NA,NA,NA,NA,NA,NA
NA,NA,NA,NA,NA,NA,NA,NA,NA,NA
NA,NA,NA,NA,NA,NA,NA,NA,NA,NA
NA,NA,NA,NA,NA,NA,NA,NA,NA,NA
NA,NA,NA,NA,NA,NA,NA,NA,NA,NA
NA,NA,NA,NA,NA,NA,NA,NA,NA,NA
NA,NA,NA,NA,NA,NA,NA,NA,NA,NA
NA,NA,NA,NA,NA,NA,NA,NA,NA,NA
NA,NA,NA,NA,NA,NA,NA,NA,NA,NA
NA,NA,NA,NA,NA,NA,NA,NA,NA,NA
NA,NA,NA,NA,NA,NA,NA,NA,NA,NA
NA,NA,NA,NA,NA,NA,NA,NA,NA,NA
NA,NA,NA,NA,NA,NA,NA,NA,NA,NA
NA,NA,NA,NA,NA,NA,NA,NA,NA,NA
NA,NA,NA,NA,NA,NA,NA,NA,NA,NA
NA,NA,NA,NA,NA,NA,NA,NA,NA,NA
NA,NA,NA,NA,NA,NA,NA,NA,NA,NA
NA,NA,NA,NA,NA,NA,NA,NA,NA,NA
NA,NA,NA,NA,NA,NA,NA,NA,NA,NA
NA,NA,NA,NA,NA,NA,NA,NA,NA,NA
NA,NA,NA,NA,NA,NA,NA,NA,NA,NA
NA,NA,NA,NA,NA,NA,NA,NA,NA,NA
NA,NA,NA,NA,NA,NA,NA,NA,NA,NA
NA,NA,NA,NA,NA,NA,NA,NA,NA,NA
NA,NA,NA,NA,NA,NA,NA,NA,NA,NA
NA,NA,NA,NA,NA,NA,NA,NA,NA,NA
NA,NA,NA,NA,NA,NA,NA,NA,NA,NA
NA,NA,NA,NA,NA,NA,NA,NA,NA,NA
NA,NA,NA,NA,NA,NA,NA,NA,NA,NA
NA,NA,NA,NA,NA,NA,NA,NA,NA,NA
NA,NA,NA,NA,NA,NA,NA,NA,NA,NA
NA,NA,NA,NA,NA,NA,NA,NA,NA,NA
NA,NA,NA,NA,NA,NA,NA,NA,NA,NA
NA,NA,NA,NA,NA,NA,NA,NA,NA,NA
NA,NA,NA,NA,NA,NA,NA,NA,NA,NA
NA,NA,NA,NA,NA,NA,NA,NA,NA,NA
