cluster;count;mean;std;min;25%;median;75%;max
Clus0;538;2.149907063197026;2.375340922449735;0.08;0.67;1.27;2.8625000000000003;15.11
Clus1;465;2.2882365591397855;2.2107068780857677;0.09;0.87;1.41;3.1;13.03
Clus2;139;0.9358992805755396;1.3433528316722294;0.16;0.42;0.67;1.0;12.68
Clus3;89;0.7789887640449438;0.4267957914501869;0.14;0.54;0.68;0.93;2.51
Clus4;81;1.0166666666666666;0.5043733736033258;0.18;0.69;0.96;1.23;2.79
Clus5;81;0.658395061728395;0.8663449901599873;0.09;0.29;0.41;0.62;6.13
Clus6;75;1.2394666666666667;0.6925743073282253;0.15;0.78;1.18;1.62;3.22
Clus7;70;1.2061428571428572;0.5913881798751699;0.17;0.83;1.1150000000000002;1.5574999999999999;2.84
Clus10;51;2.737647058823529;4.190962938626536;0.25;0.78;1.3;2.38;22.03
Clus9;50;0.3072;0.22546134109095203;0.07;0.15;0.22499999999999998;0.39749999999999996;1.1
Clus12;46;0.6171739130434784;0.2571611085463591;0.19;0.445;0.55;0.74;1.37
Clus8;45;1.4035555555555554;0.7979637595882171;0.14;0.67;1.39;1.78;3.59
Clus14;44;1.3670454545454547;4.340915442807746;0.07;0.18;0.345;0.6825;21.01
Clus11;44;1.6527272727272724;1.738802533202508;0.2;0.5825;1.045;1.7625;7.28
Clus16;42;0.8402380952380952;1.1569419069574465;0.02;0.18;0.355;0.95;6.07
Clus13;42;1.3835714285714285;1.5682393754385706;0.08;0.3875;0.75;1.6175;6.55
Clus17;36;0.6977777777777777;0.6011185341207607;0.13;0.2575;0.5449999999999999;0.8425;2.31
Clus18;35;0.834;0.4769461678835711;0.18;0.505;0.74;0.995;1.86
Clus19;35;0.7388571428571428;0.5552888566194303;0.12;0.485;0.62;0.86;3.34
Clus20;34;1.989411764705882;1.2366007689127398;0.11;0.8775;2.02;3.075;5.02
Clus15;34;0.5779411764705883;0.24478536562224548;0.23;0.385;0.505;0.76;1.28
Clus21;29;1.7613793103448279;1.7634457424881285;0.44;0.9;1.36;1.94;9.89
Clus24;29;0.4717241379310345;0.3073396093379119;0.08;0.24;0.47;0.58;1.39
Clus25;28;1.4464285714285714;0.9937180995512065;0.26;0.71;1.155;2.175;4.02
Clus26;28;0.572857142857143;0.4173714673991764;0.09;0.3225;0.46;0.7425;2.15
Clus28;27;1.655185185185185;1.0149019292157868;0.15;0.96;1.58;2.16;4.68
Clus23;26;1.9646153846153847;1.5108917387271155;0.25;0.7525;1.22;3.0599999999999996;5.22
Clus29;25;1.1692;1.6818415502062019;0.05;0.39;0.62;1.2;7.95
Clus31;24;2.05375;1.32668207423141;0.6;1.1;1.74;2.2825;5.23
Clus35;22;1.833181818181818;1.4732322299838556;0.12;0.62;1.675;2.3325;5.37
Clus32;22;4.465;6.274354263872214;0.25;0.94;3.285;4.98;29.35
Clus34;22;0.625;0.3958083952044041;0.13;0.34249999999999997;0.63;0.695;1.92
Clus43;21;6.526666666666666;6.196261238305993;0.33;1.38;2.47;12.37;16.95
Clus38;21;0.7342857142857143;0.30035930863836113;0.41;0.49;0.71;0.81;1.43
Clus40;21;0.4552380952380953;0.28800380288494537;0.12;0.29;0.43;0.58;1.17
Clus33;21;0.650952380952381;0.20680678813580472;0.09;0.63;0.75;0.78;0.89
Clus52;20;0.5335000000000001;0.34040649075387563;0.16;0.21;0.44;0.8200000000000001;1.27
Clus42;20;1.1199999999999999;1.221306461820378;0.2;0.46749999999999997;0.7050000000000001;1.225;4.93
Clus41;20;2.4530000000000003;1.849034171782948;0.52;1.095;1.685;4.1975;5.87
Clus50;19;2.081578947368421;4.720884172315717;0.16;0.655;0.88;1.345;21.38
Clus45;19;0.6247368421052633;0.42236593429884983;0.19;0.38;0.5;0.69;2.08
Clus39;19;2.1057894736842107;1.6196752616547474;0.24;0.875;1.73;3.265;5.73
Clus36;19;1.2157894736842105;0.8490211081623726;0.09;0.855;0.95;1.295;3.91
Clus49;19;0.46473684210526317;0.20870948498524694;0.11;0.33499999999999996;0.53;0.65;0.7
Clus56;18;0.7816666666666667;0.5475533817650594;0.15;0.415;0.645;1.0775000000000001;2.19
Clus54;18;0.7594444444444445;0.4599037267825699;0.31;0.445;0.5449999999999999;0.9650000000000001;1.88
Clus51;18;1.0694444444444444;3.1563315866631183;0.1;0.1875;0.295;0.385;13.68
Clus30;18;112.05388888888889;323.19902522674226;0.1;0.4325;0.73;1.765;1000.44
Clus37;17;2.335294117647059;2.5252329537268903;0.23;0.61;0.92;3.49;7.96
Clus48;17;1.8064705882352943;1.3466390625204225;0.35;0.84;1.68;2.44;5.68
Clus57;17;2.6611764705882353;1.1686043083147368;0.59;2.37;2.89;3.26;4.46
Clus62;17;2.5388235294117645;4.474332188093745;0.27;0.47;0.88;1.48;16.9
Clus63;17;0.5135294117647058;0.38366556361743276;0.07;0.17;0.45;0.88;1.28
Clus59;17;2.1911764705882355;2.5714074024572158;0.14;1.14;1.48;2.28;11.34
Clus61;17;2.0747058823529407;3.7853568485135236;0.33;0.61;0.84;1.28;15.85
Clus64;17;1.5841176470588234;2.0919968296568037;0.34;0.39;0.71;1.72;7.58
Clus44;16;1.3556249999999999;0.5096269060139322;0.25;1.165;1.31;1.4375;2.53
Clus69;16;3.5425;5.003785900029429;0.16;1.08;1.46;2.9749999999999996;16.77
Clus60;16;1.21125;0.762477322067133;0.46;0.66;1.035;1.4425;3.36
Clus73;15;1.342;0.9482781388239574;0.13;0.69;1.3;1.52;4.04
Clus76;15;0.4286666666666667;0.4298150211206588;0.06;0.14;0.26;0.525;1.42
Clus77;15;1.9360000000000002;3.0857756607652846;0.24;0.51;1.05;1.975;12.63
Clus70;15;1.9026666666666665;1.7283248151509791;0.25;0.6799999999999999;1.04;2.755;6.31
Clus88;14;0.7107142857142857;0.19368746775368603;0.51;0.555;0.675;0.8025;1.13
Clus79;14;4.091428571428572;4.109806016651576;0.17;1.31;2.54;5.0775;11.51
Clus89;14;1.145;0.7585385746491533;0.34;0.725;0.99;1.2775;3.34
Clus83;14;0.9092857142857144;0.8245041800119286;0.1;0.315;0.63;1.0075;2.6
Clus82;14;1.5985714285714285;0.6904163419812174;0.72;1.1575;1.455;1.9275;3.23
Clus98;13;1.4015384615384616;1.318501966588384;0.25;0.56;0.63;2.53;3.8
Clus102;13;0.41923076923076924;0.14419093467006044;0.17;0.34;0.46;0.5;0.66
Clus100;13;1.0115384615384615;0.39106363833878655;0.35;0.8;0.92;1.44;1.6
Clus72;13;0.8146153846153846;0.5206984953664866;0.16;0.29;0.98;1.23;1.64
Clus67;13;1.0869230769230769;2.650928719698641;0.08;0.22;0.25;0.65;9.87
Clus97;13;4.070000000000001;3.7347422936529364;0.86;1.42;2.09;6.31;13.26
Clus92;13;0.54;0.2667708129962247;0.23;0.33;0.46;0.78;1.11
Clus65;13;0.6915384615384614;0.5445616915441591;0.12;0.41;0.58;0.82;2.17
Clus94;13;2.756153846153846;2.065940215581994;0.82;1.54;2.22;2.97;8.32
Clus93;13;0.6315384615384615;0.6128600459300931;0.08;0.26;0.42;0.72;2.39
Clus90;13;0.4284615384615384;0.2842195792530297;0.13;0.25;0.4;0.53;1.24
Clus86;12;1.0216666666666665;0.5384461369758747;0.53;0.7325;0.87;1.085;2.47
Clus74;12;1.678333333333333;3.61348442600348;0.09;0.44500000000000006;0.69;0.8425;13.11
Clus84;12;0.5750000000000001;0.1528219403572192;0.3;0.4525;0.655;0.6825;0.78
Clus91;12;2.4775;3.3062863677326173;0.17;0.6375;0.88;3.3075;12.02
Clus81;12;1.1916666666666667;2.31480937103737;0.14;0.31999999999999995;0.645;0.7875;8.5
Clus99;12;0.6849999999999999;0.3206952674197961;0.17;0.495;0.705;0.81;1.21
Clus103;12;0.5033333333333333;0.21504051767614454;0.22;0.3975;0.48;0.5475;0.94
Clus109;12;1.1883333333333332;1.252719466044198;0.11;0.1575;0.43;2.3175;3.55
Clus108;12;0.6374999999999998;0.35260394985669896;0.26;0.425;0.56;0.6925;1.6
Clus112;12;1.2391666666666665;0.8060730660918946;0.54;0.5924999999999999;0.66;2.07;2.45
Clus106;12;0.6791666666666666;0.4426256027868522;0.11;0.39;0.6000000000000001;0.8725;1.68
Clus104;12;2.485;1.783890029223673;0.55;1.2525;1.49;3.7275;5.63
Clus110;11;3.5845454545454545;5.351501403599486;0.18;0.44499999999999995;0.99;3.5100000000000002;14.03
Clus47;11;5.409090909090909;6.515970310775602;0.26;0.335;1.18;13.54;13.73
Clus122;11;1.4745454545454544;0.8360785087103201;0.4;0.765;1.45;2.01;2.88
Clus133;11;2.0509090909090912;1.348046397906649;0.53;0.99;1.74;2.885;4.91
Clus119;11;0.9045454545454544;0.3930232470570573;0.24;0.735;0.92;1.19;1.47
Clus118;11;1.0890909090909089;0.9944591951956051;0.32;0.5800000000000001;0.78;1.255;3.88
Clus115;11;0.9036363636363636;0.31477842134659506;0.48;0.685;0.76;1.15;1.5
Clus114;11;1.7327272727272727;1.448662078671841;0.66;0.76;1.05;1.915;4.58
Clus127;11;0.7918181818181818;0.3899184063831351;0.43;0.575;0.79;0.84;1.85
Clus125;11;0.9181818181818181;0.5118948755715022;0.48;0.56;0.61;1.1400000000000001;2.0
Clus113;11;2.152727272727273;2.1971758732932187;0.29;0.845;1.33;2.06;6.66
Clus85;11;2.3154545454545454;5.256311184921159;0.41;0.52;0.66;0.7849999999999999;18.11
Clus107;11;1.779090909090909;1.0571324850316022;0.15;1.335;1.64;1.865;3.74
Clus101;11;1.2163636363636365;0.8985796873652635;0.15;0.63;0.88;1.725;2.97
Clus87;11;0.4181818181818182;0.19358812886218937;0.24;0.295;0.32;0.54;0.76
Clus144;10;1.094;0.6381953723847684;0.2;0.7525;1.05;1.08;2.46
Clus121;10;3.253;7.940133010360861;0.28;0.4475;0.605;0.7975000000000001;25.78
Clus111;10;3.3480000000000003;3.323364426467719;0.16;1.2825;2.66;3.8000000000000003;11.09
Clus142;10;1.1179999999999999;0.8465852979273066;0.24;0.6950000000000001;0.8400000000000001;1.2674999999999998;2.79
Clus145;10;0.507;0.2950348378675907;0.18;0.34;0.395;0.565;1.13
Clus140;10;3.3619999999999997;4.206185392437613;0.6;1.1125;1.895;3.095;14.44
Clus161;10;0.46099999999999997;0.20343986280416573;0.23;0.2925;0.475;0.5375000000000001;0.9
Clus156;10;1.831;1.681510233886986;0.17;0.6775;1.13;2.5525;5.0
Clus137;10;2.37;2.5012752303130847;0.13;0.9775;1.2;2.16;7.63
Clus157;10;3.4900000000000007;5.657298138000349;0.13;0.575;1.82;3.12;19.08
Clus128;10;1.2319999999999998;1.2626145712590027;0.28;0.52;0.6699999999999999;1.4825;4.27
Clus136;10;0.6170000000000001;0.3947446431977682;0.31;0.355;0.435;0.7;1.41
Clus154;10;5.147;4.754822230582806;0.28;1.755;3.09;9.375000000000002;12.6
Clus158;10;1.544;2.2232918536860304;0.24;0.405;0.72;1.1075;7.43
Clus153;10;6.478999999999999;7.382332437801905;0.32;0.4600000000000001;2.4450000000000003;13.459999999999999;17.25
Clus55;10;3.7589999999999995;4.587002046846914;0.11;0.4225;0.845;7.2775;11.32
Clus152;10;0.548;0.3135034998918584;0.12;0.36;0.485;0.77;1.13
Clus160;10;1.475;2.0370307912362167;0.23;0.4375;0.76;0.97;6.82
Clus151;10;0.262;0.13870832707519762;0.12;0.14250000000000002;0.24;0.32;0.55
Clus176;9;0.9177777777777778;0.8265255255855347;0.18;0.38;0.76;0.92;2.94
Clus141;9;2.6677777777777774;1.7834992134689727;0.52;1.09;3.13;4.27;4.61
Clus167;9;1.348888888888889;0.6315941031319965;0.37;0.9;1.48;1.83;2.26
Clus126;9;2.062222222222222;1.8236760799123415;0.25;0.86;1.32;2.44;5.36
Clus68;9;1.377777777777778;1.7643396624359053;0.32;0.46;0.64;1.37;5.92
Clus146;9;1.2044444444444444;0.6093256746418764;0.38;0.77;1.27;1.62;2.26
Clus135;9;0.71;0.7165716991341481;0.2;0.27;0.37;0.97;2.44
Clus117;9;0.8211111111111111;0.27615414375147646;0.47;0.7;0.81;0.83;1.47
Clus139;9;1.7388888888888892;1.317378499563095;0.18;0.63;1.64;1.94;4.44
Clus53;9;2.7255555555555557;4.2232840039213295;0.49;0.64;0.7;1.94;13.43
Clus162;9;0.8711111111111111;0.4704371489488379;0.17;0.62;1.03;1.08;1.53
Clus148;9;0.44555555555555554;0.5256451063006083;0.1;0.23;0.32;0.4;1.81
Clus163;9;1.54;0.6222539674441618;0.36;1.4;1.74;1.89;2.19
Clus130;9;1.268888888888889;2.1094219850734253;0.31;0.37;0.53;0.83;6.85
Clus164;9;2.464444444444444;1.9348198308312268;0.58;1.16;1.83;3.17;6.55
Clus138;9;0.4566666666666667;0.2024845673131659;0.25;0.34;0.37;0.49;0.8
Clus66;9;9.192222222222222;7.30387016892034;0.37;1.66;11.59;16.14;16.6
Clus169;9;2.948888888888889;1.8524068427619;0.32;2.1;2.55;3.62;5.76
Clus124;9;2.743333333333333;6.269842502009121;0.25;0.37;0.91;1.0;19.44
Clus175;9;0.6277777777777778;0.16029486718059452;0.49;0.52;0.57;0.61;0.94
Clus204;9;0.6022222222222222;0.18932629094883904;0.36;0.43;0.66;0.7;0.92
Clus203;9;0.6577777777777778;0.28942951550324725;0.3;0.45;0.66;0.83;1.22
Clus189;9;0.9333333333333331;0.559352304008842;0.2;0.66;0.77;1.41;1.67
Clus170;9;1.161111111111111;0.6653090342924189;0.51;0.69;0.94;1.47;2.4
Clus188;9;0.9844444444444443;0.4522474740424514;0.04;0.77;1.18;1.27;1.47
Clus187;9;0.9177777777777778;0.7618690467819548;0.14;0.56;0.75;1.01;2.8
Clus186;9;2.0677777777777777;1.8733844892184959;0.4;0.82;1.34;2.65;6.42
Clus185;9;0.9255555555555556;0.3247349346432838;0.43;0.65;0.97;1.17;1.37
Clus96;9;1.28;0.8117265549432272;0.42;0.69;0.84;2.14;2.48
Clus183;9;1.0655555555555558;0.34471405219076545;0.38;0.91;1.18;1.22;1.59
Clus182;9;0.8611111111111112;0.8772035744974545;0.19;0.41;0.52;0.92;3.08
Clus173;9;0.6988888888888889;0.4687335182287598;0.26;0.47;0.48;0.85;1.82
Clus205;9;1.0122222222222221;0.4825913845526507;0.28;0.89;1.11;1.23;1.81
Clus180;9;0.3011111111111111;0.1260401170703642;0.2;0.24;0.27;0.3;0.62
Clus174;9;1.171111111111111;0.2978021341614447;0.49;1.09;1.2;1.39;1.49
Clus22;9;1.1066666666666667;0.8497793831342344;0.14;0.25;1.48;1.79;2.19
Clus193;9;0.5255555555555556;0.3041426931191637;0.11;0.33;0.46;0.63;1.07
Clus201;9;1.5655555555555558;1.1737664920152464;0.28;1.01;1.36;1.87;4.29
Clus200;9;1.3499999999999999;0.4849226742481733;0.84;0.99;1.28;1.43;2.25
Clus171;9;0.8233333333333333;0.47053161424074363;0.23;0.54;0.73;1.05;1.71
Clus192;9;0.7144444444444444;0.3644897498939823;0.32;0.46;0.56;1.12;1.3
Clus199;9;2.117777777777778;2.3309213724286035;0.48;0.57;0.95;2.04;6.67
Clus177;9;0.8500000000000001;0.4051542915976579;0.26;0.56;0.78;1.12;1.56
Clus196;9;0.7455555555555555;0.539840511427012;0.28;0.41;0.51;1.07;1.89
Clus178;9;2.7377777777777776;2.365648842166657;0.36;0.47;2.45;3.79;7.14
Clus194;9;2.1977777777777776;1.3648239609724193;0.81;1.43;1.94;2.5;5.22
Clus191;9;6.101111111111111;6.074270418009978;0.47;1.52;3.81;11.16;16.32
Clus71;8;3.2537499999999997;4.643169907047801;0.35;0.7825;1.0150000000000001;3.01;12.6
Clus208;8;1.21375;0.7124993734333085;0.29;0.62;1.2650000000000001;1.5125;2.42
Clus27;8;1.06625;0.8324651429854072;0.08;0.35;1.01;1.6600000000000001;2.25
Clus209;8;1.1287500000000001;0.8190314401779702;0.28;0.40249999999999997;1.0150000000000001;1.6175;2.52
Clus231;8;0.685;0.5283126779798927;0.24;0.395;0.48;0.7325;1.87
Clus147;8;0.62;0.4338860943348414;0.19;0.37;0.495;0.7325;1.53
Clus197;8;1.10125;1.0112006654043924;0.14;0.29;0.89;1.4475000000000002;2.82
Clus198;8;1.7487499999999998;1.3435394353295753;0.32;0.7625000000000001;1.515;2.36;3.83
Clus172;8;1.355;1.2840671989536108;0.23;0.5325;0.7849999999999999;1.9575;3.98
Clus230;8;0.62;0.24011901810798508;0.38;0.41;0.5900000000000001;0.71;1.06
Clus211;8;0.625;0.4884669896727925;0.21;0.36750000000000005;0.5;0.6000000000000001;1.76
Clus210;8;1.6037499999999998;1.1722741939129624;0.17;0.83;1.315;2.3075;3.28
Clus225;8;1.2075;1.0231708417603442;0.38;0.84;0.885;1.0325;3.68
Clus241;8;1.37625;0.9722865171484029;0.29;0.5675;1.335;1.8800000000000001;3.1
Clus242;8;0.37374999999999997;0.5064424237476838;0.07;0.09500000000000001;0.13;0.3425;1.41
Clus239;8;1.0125000000000002;0.6025125961931656;0.32;0.63;0.795;1.3425;1.94
Clus227;8;3.06375;5.4863569424527965;0.25;0.38;0.785;2.0725;16.18
Clus243;8;0.42625;0.21882396708639704;0.15;0.24;0.41500000000000004;0.5900000000000001;0.71
Clus221;8;0.45124999999999993;0.37406788917826894;0.11;0.26249999999999996;0.305;0.5775;1.27
Clus245;8;1.9275;1.434381399767858;0.37;0.93;1.76;2.4775;4.76
Clus179;8;1.2875;1.5597687557547022;0.23;0.6675;0.76;1.065;5.08
Clus220;8;1.2075;0.6066241481699003;0.48;0.6974999999999999;1.135;1.5675;2.25
Clus217;8;0.13;0.062105900340811884;0.08;0.09500000000000001;0.11499999999999999;0.13;0.27
Clus237;8;2.76125;2.2085576256267996;0.57;1.6275;1.795;3.4975;7.61
Clus215;8;0.97625;0.6872083797094278;0.17;0.535;0.825;1.2175;2.26
Clus184;8;1.5999999999999999;1.2000119047028541;0.39;0.86;1.31;1.9075;3.52
Clus212;8;0.9450000000000001;0.7655623516642616;0.07;0.5549999999999999;0.81;1.0125000000000002;2.6
Clus235;8;0.55625;0.4255731429495992;0.18;0.26;0.35;0.7874999999999999;1.32
Clus234;8;2.6025;3.3625362451578127;0.54;0.6100000000000001;1.05;2.58;9.72
Clus229;8;1.135;1.0721673643339724;0.34;0.625;0.87;1.0025;3.71
Clus222;8;2.0;2.512278419511432;0.17;0.5874999999999999;1.4649999999999999;1.98;7.95
Clus301;7;2.6114285714285717;0.9922437296590082;1.16;1.915;3.02;3.115;4.04
Clus302;7;1.6442857142857146;1.4871209000711985;0.25;0.35;1.58;2.67;3.64
Clus300;7;3.918571428571428;7.6544832801250715;0.35;0.73;1.15;1.615;21.24
Clus190;7;0.6799999999999999;0.4557777236036589;0.14;0.385;0.53;0.9199999999999999;1.48
Clus304;7;1.3942857142857144;0.9825961724407632;0.18;0.585;1.55;2.125;2.61
Clus306;7;3.3728571428571428;0.341502283336158;2.78;3.245;3.3;3.63;3.78
Clus311;7;1.8171428571428572;1.1108662428590625;0.31;0.9299999999999999;2.16;2.5300000000000002;3.33
Clus308;7;0.40142857142857136;0.1656732297253212;0.26;0.28500000000000003;0.35;0.46;0.71
Clus309;7;1.864285714285714;1.4466611805908707;0.28;0.35;2.88;2.925;3.34
Clus316;7;1.1785714285714286;0.2990779481132286;0.65;1.045;1.19;1.4100000000000001;1.5
Clus314;7;0.6771428571428572;0.2295440615447853;0.3;0.54;0.76;0.815;0.97
Clus310;7;0.48;0.26783079235467555;0.2;0.28;0.35;0.685;0.88
Clus313;7;1.7771428571428571;1.1557207604739461;0.38;1.435;1.48;1.775;4.16
Clus299;7;1.58;0.9079647570252934;0.45;1.135;1.54;1.7149999999999999;3.37
Clus291;7;0.27571428571428575;0.19932027350114545;0.08;0.12;0.29;0.33499999999999996;0.65
Clus267;7;1.3942857142857144;0.7463211360367855;0.34;0.9299999999999999;1.45;1.81;2.49
Clus269;7;1.5399999999999998;0.54644304369257;0.77;1.385;1.49;1.5750000000000002;2.6
Clus296;7;3.137142857142858;4.735020993567379;0.31;0.765;1.42;2.55;13.6
Clus249;7;5.404285714285714;4.522775169969787;1.78;2.675;3.28;6.3149999999999995;14.79
Clus255;7;1.6171428571428572;1.6819008520690144;0.28;0.75;0.96;1.67;5.24
Clus257;7;4.194285714285714;6.938827607847638;0.32;0.585;0.88;3.975;19.04
Clus143;7;1.0785714285714287;0.8397505298485691;0.08;0.45;1.15;1.5150000000000001;2.39
Clus246;7;0.41714285714285715;0.10812250547631695;0.26;0.345;0.42;0.495;0.56
Clus259;7;1.895714285714286;1.5734765875056966;0.3;0.94;1.32;2.3899999999999997;4.99
Clus116;7;0.6042857142857143;0.7080220604580327;0.12;0.16999999999999998;0.2;0.745;2.08
Clus261;7;0.44571428571428573;0.3097233788860173;0.11;0.25;0.35;0.64;0.88
Clus262;7;1.1828571428571428;0.7188814062072242;0.45;0.7150000000000001;0.92;1.48;2.52
Clus253;7;1.195714285714286;0.40153277752703004;0.61;0.94;1.46;1.47;1.48
Clus218;7;1.6514285714285715;0.28985217907458577;1.48;1.495;1.5;1.6600000000000001;2.27
Clus256;7;0.5771428571428573;0.2704141444595854;0.25;0.39;0.56;0.6950000000000001;1.06
Clus274;7;1.372857142857143;0.7858692487879114;0.27;0.935;1.21;1.86;2.54
Clus275;7;1.4428571428571428;1.3508480581436522;0.41;0.44999999999999996;0.49;2.23;3.84
Clus276;7;0.8857142857142858;0.4173270956478919;0.2;0.645;0.91;1.21;1.38
Clus282;7;0.8100000000000002;0.4904079934095692;0.35;0.585;0.67;0.815;1.85
Clus254;7;0.38714285714285707;0.2362000766098017;0.26;0.29;0.3;0.325;0.92
Clus228;7;1.0285714285714287;0.6273337381710146;0.29;0.65;0.87;1.405;1.93
Clus284;7;0.6042857142857142;0.13745995087747592;0.38;0.53;0.64;0.715;0.72
Clus233;7;2.9628571428571426;3.9104804235358532;0.41;0.69;0.74;4.5;9.21
Clus290;7;2.848571428571429;3.2364869255177937;0.44;0.5800000000000001;1.66;4.234999999999999;8.21
Clus292;7;0.4657142857142857;0.2761555807183783;0.11;0.31;0.42;0.59;0.93
Clus294;7;1.8928571428571428;2.0209462658675044;0.19;0.655;0.91;2.705;5.43
Clus295;7;1.6628571428571426;2.9627898692826338;0.17;0.575;0.61;0.6699999999999999;8.37
Clus374;6;0.5533333333333333;0.09521904571390465;0.44;0.49;0.54;0.605;0.7
Clus371;6;2.0433333333333334;0.6089553897180537;1.06;1.795;2.175;2.2925;2.85
Clus370;6;0.45333333333333337;0.22455882673960215;0.07;0.3875;0.475;0.5925;0.71
Clus149;6;1.1833333333333333;0.9443233909348359;0.29;0.6375;0.885;1.4025;2.91
Clus365;6;1.7283333333333335;2.119768069074224;0.69;0.8325;0.915;0.975;6.05
Clus368;6;0.89;1.3062618420515848;0.14;0.28;0.36;0.6124999999999999;3.53
Clus367;6;0.4533333333333333;0.34436414834687223;0.19;0.3025;0.345;0.395;1.14
Clus366;6;0.63;0.2337520053389917;0.34;0.42500000000000004;0.6950000000000001;0.7925000000000001;0.89
Clus376;6;2.5349999999999997;2.920374975923468;0.64;0.9524999999999999;1.6;2.0975;8.37
Clus363;6;0.735;0.32135649985646775;0.37;0.535;0.6699999999999999;0.8799999999999999;1.26
Clus361;6;2.651666666666667;1.8997412104459561;0.4;0.985;2.92;4.2475;4.64
Clus375;6;0.35333333333333333;0.15068731421943474;0.18;0.2725;0.30000000000000004;0.4475;0.58
Clus393;6;1.2083333333333333;1.6425153474676173;0.13;0.195;0.615;1.2225000000000001;4.41
Clus377;6;1.2466666666666668;1.526822408358833;0.5;0.615;0.655;0.695;4.36
Clus379;6;0.7166666666666667;0.5153898201038382;0.3;0.3175;0.495;1.07;1.49
Clus407;6;0.43166666666666664;0.2908894406242115;0.07;0.2325;0.42000000000000004;0.5925;0.86
Clus406;6;0.5333333333333333;0.1949016846173133;0.31;0.38;0.55;0.615;0.83
Clus410;6;0.6416666666666667;0.2395342703386442;0.4;0.54;0.6;0.6225;1.1
Clus358;6;0.19999999999999998;0.08461678320522473;0.1;0.1275;0.20500000000000002;0.2675;0.3
Clus404;6;2.518333333333333;1.555948799500378;0.8;1.52;2.185;3.2175;5.08
Clus150;6;1.3666666666666665;0.8408249916996203;0.6;0.815;1.04;1.76;2.78
Clus398;6;5.331666666666667;2.698684247307689;0.42;4.535;6.57;7.164999999999999;7.21
Clus397;6;4.501666666666666;2.2228937596445464;2.13;2.9825;4.0;5.5875;8.12
Clus396;6;1.5183333333333333;1.9929216408746897;0.23;0.47750000000000004;0.835;1.2149999999999999;5.51
Clus394;6;1.055;1.1088146824424718;0.28;0.3725;0.53;1.3025000000000002;3.11
Clus389;6;1.8516666666666666;1.2662293104594706;0.55;1.3425;1.585;1.79;4.27
Clus387;6;2.021666666666667;2.1249698037070237;0.19;0.3125;1.22;3.74;4.91
Clus384;6;0.79;0.3582178108358098;0.14;0.7075;0.875;1.02;1.13
Clus381;6;5.113333333333334;6.475648744849173;0.59;1.0525000000000002;2.6100000000000003;5.757499999999999;17.53
Clus380;6;4.095;4.5596348538013425;0.42;0.655;3.05;5.3175;12.12
Clus359;6;0.555;0.19685019685029528;0.35;0.42250000000000004;0.515;0.63;0.89
Clus317;6;2.151666666666667;3.962370081992174;0.19;0.24;0.38;1.2925;10.17
Clus325;6;0.5283333333333333;0.35807354924186546;0.09;0.2275;0.565;0.8275;0.92
Clus343;6;2.3716666666666666;1.8213557221659549;0.54;1.6575;1.955;2.2525;5.87
Clus329;6;1.736666666666667;0.8238851052584131;1.11;1.1625;1.49;1.87;3.28
Clus236;6;1.15;0.6015313790651324;0.56;0.7649999999999999;1.065;1.2375;2.25
Clus324;6;0.4816666666666667;0.1417627125398871;0.36;0.375;0.45;0.525;0.73
Clus131;6;1.135;0.8108945677460171;0.37;0.5775;0.87;1.515;2.49
Clus330;6;1.566666666666667;1.412199230514826;0.39;0.515;1.01;2.3225;3.88
Clus283;6;0.2816666666666667;0.05564770136013407;0.24;0.24;0.255;0.315;0.37
Clus333;6;0.2816666666666667;0.1260819839099412;0.16;0.19;0.26;0.3225;0.5
Clus318;6;1.26;0.9007996447601431;0.57;0.8825000000000001;0.98;1.085;3.06
Clus165;6;3.348333333333333;6.663036595026826;0.29;0.49250000000000005;0.72;0.9325;16.94
Clus336;6;11.633333333333333;2.578144035283263;9.1;9.85;10.934999999999999;12.7475;15.99
Clus356;6;1.3149999999999997;0.9034544814211726;0.48;0.73;0.975;1.7075;2.86
Clus341;6;0.6749999999999999;0.276315037592962;0.17;0.6025;0.7749999999999999;0.85;0.91
Clus327;6;1.405;0.7931141153705437;0.43;0.78;1.565;1.7875;2.49
Clus344;6;2.005;1.8464100303020454;0.54;0.7075;1.1;3.3149999999999995;4.66
Clus328;6;1.0566666666666666;0.41931690481861883;0.45;0.785;1.125;1.3900000000000001;1.49
Clus265;6;0.9516666666666665;0.3717750215744284;0.38;0.7849999999999999;1.01;1.0925;1.48
Clus266;6;2.1916666666666664;3.4874255069702444;0.2;0.6475;0.89;1.2225;9.27
Clus80;6;5.01;1.7912453768258552;1.64;4.715;5.66;6.0875;6.47
Clus348;6;0.705;1.01069777876475;0.16;0.2625;0.315;0.405;2.76
Clus349;6;2.7183333333333333;1.9884608788373652;0.39;1.4249999999999998;2.29;4.1975;5.37
Clus251;6;0.8383333333333334;0.4773433425393787;0.31;0.48000000000000004;0.77;1.135;1.54
Clus206;6;0.6416666666666667;0.6151883180512018;0.05;0.4425;0.46499999999999997;0.5625;1.84
Clus321;6;0.33499999999999996;0.05089204259999788;0.27;0.29250000000000004;0.345;0.375;0.39
Clus78;6;1.6333333333333335;1.4241722742234053;0.15;0.7525;1.415;1.9274999999999998;4.19
Clus258;6;1.1900000000000002;1.005365605140737;0.19;0.345;1.115;1.885;2.49
Clus268;6;2.5066666666666664;4.178577110293247;0.4;0.5925;0.905;1.225;11.01
Clus354;6;0.27999999999999997;0.10545141061171255;0.09;0.25;0.315;0.35000000000000003;0.37
Clus355;6;0.6783333333333333;0.22604571808965251;0.49;0.51;0.575;0.8724999999999999;0.97
Clus244;6;1.8083333333333333;2.6871056299793397;0.24;0.475;0.7350000000000001;1.3325;7.22
Clus511;5;0.584;0.35521824277477637;0.28;0.37;0.41;0.71;1.15
Clus513;5;1.074;0.35125489320435094;0.52;0.98;1.14;1.32;1.41
Clus509;5;1.56;1.1390566272139415;0.59;0.64;1.06;2.37;3.14
Clus512;5;2.292;1.8009219860949;0.52;1.29;1.29;3.59;4.77
Clus518;5;1.1760000000000002;1.5422321485431434;0.39;0.41;0.54;0.61;3.93
Clus514;5;0.898;0.4847886137276741;0.52;0.57;0.6;1.18;1.62
Clus515;5;0.6539999999999999;0.4237098063533578;0.23;0.28;0.57;1.06;1.13
Clus519;5;0.6679999999999999;0.3285878877865098;0.27;0.5;0.62;0.81;1.14
Clus521;5;6.279999999999999;11.152909934183096;0.55;1.18;1.51;1.95;26.21
Clus522;5;0.6759999999999999;0.38862578401336156;0.21;0.46;0.56;1.01;1.14
Clus523;5;1.34;0.6604922406811453;0.59;0.68;1.61;1.8;2.02
Clus524;5;1.7619999999999998;0.6608857692521454;1.07;1.45;1.67;1.78;2.84
Clus507;5;0.89;0.600291595809903;0.35;0.42;0.86;0.97;1.85
Clus561;5;0.9720000000000001;0.8413798191066864;0.28;0.47;0.81;0.89;2.41
Clus506;5;1.0699999999999998;0.9021363533302491;0.25;0.43;0.69;1.58;2.4
Clus505;5;1.24;0.4313351365237939;0.54;1.13;1.42;1.48;1.63
Clus473;5;1.008;0.6684833580576257;0.3;0.66;0.78;1.27;2.03
Clus474;5;1.5060000000000002;0.8890894218243743;0.48;0.59;2.06;2.2;2.2
Clus475;5;0.8160000000000001;0.5857303133695575;0.29;0.39;0.77;0.86;1.77
Clus478;5;1.5939999999999999;0.6054997935590068;1.09;1.25;1.46;1.54;2.63
Clus480;5;2.4160000000000004;2.4039613141646017;0.62;1.05;1.09;2.9;6.42
Clus482;5;0.6239999999999999;0.21184900282984576;0.34;0.48;0.66;0.82;0.82
Clus484;5;0.868;1.047792918471966;0.21;0.42;0.44;0.54;2.73
Clus488;5;1.2639999999999998;0.40358394418014204;0.9;0.94;1.1;1.58;1.8
Clus95;5;3.07;1.5163113136819895;0.38;3.46;3.74;3.76;4.01
Clus490;5;0.508;0.5077105474578995;0.18;0.2;0.37;0.39;1.4
Clus492;5;1.558;2.5122340655281308;0.09;0.24;0.58;0.86;6.02
Clus493;5;1.5859999999999999;0.7683944299641947;0.8;0.87;1.64;2.01;2.61
Clus494;5;1.3459999999999999;1.0386674154896745;0.35;0.64;0.8;2.47;2.47
Clus497;5;0.644;0.600483138814072;0.13;0.15;0.66;0.67;1.61
Clus499;5;1.282;0.5508811124008519;0.37;1.16;1.57;1.6;1.71
Clus527;5;1.198;0.7058470089190716;0.4;0.5;1.52;1.59;1.98
Clus500;5;1.172;0.5682165080319296;0.52;0.71;1.24;1.47;1.92
Clus501;5;1.0080000000000002;0.8612316761475973;0.27;0.49;0.49;1.5;2.29
Clus502;5;1.7719999999999998;0.9577421364855991;0.55;1.35;1.7;2.12;3.14
Clus503;5;1.214;1.0579839318250537;0.34;0.43;0.67;1.88;2.75
Clus504;5;0.45400000000000007;0.28058866691297424;0.2;0.29;0.33;0.55;0.9
Clus525;5;0.916;0.2663268668384772;0.51;0.88;0.96;0.98;1.25
Clus539;5;0.6140000000000001;0.5400740689942446;0.12;0.2;0.4;0.98;1.37
Clus528;5;0.8;0.3497141690009142;0.31;0.59;0.95;0.95;1.2
Clus573;5;1.8559999999999999;1.2424693155164839;0.8;0.9;1.78;1.91;3.89
Clus549;5;1.702;2.1283138866248086;0.52;0.73;0.86;0.9;5.5
Clus582;5;0.908;0.24201239637671454;0.66;0.74;0.82;1.09;1.23
Clus550;5;1.6759999999999997;1.2233274295952004;0.66;0.76;1.01;2.59;3.36
Clus551;5;1.656;1.1595387013808554;0.17;1.27;1.28;2.36;3.2
Clus552;5;2.176;2.8282644855105046;0.47;0.89;1.1;1.21;7.21
Clus581;5;1.5559999999999998;0.6998071162827655;0.57;1.24;1.67;1.86;2.44
Clus579;5;1.342;1.3197802847443965;0.46;0.66;0.68;1.27;3.64
Clus554;5;0.752;0.2098094373473224;0.49;0.57;0.83;0.91;0.96
Clus577;5;1.17;0.801779271370868;0.53;0.61;1.01;1.18;2.52
Clus555;5;1.134;1.2164004274908817;0.33;0.49;0.72;0.85;3.28
Clus529;5;1.008;0.5491083681751717;0.33;0.54;1.23;1.31;1.63
Clus570;5;1.7819999999999996;0.7261335965233946;0.87;1.2;1.95;2.32;2.57
Clus556;5;2.21;1.4718186029535025;0.29;1.51;1.95;3.28;4.02
Clus568;5;0.8699999999999999;0.7871467461661771;0.29;0.53;0.55;0.73;2.25
Clus566;5;0.8440000000000001;0.6605527987980976;0.29;0.55;0.6;0.8;1.98
Clus557;5;1.4120000000000001;0.7954055569330654;0.7;0.88;1.01;1.9;2.57
Clus564;5;1.366;0.9468262776243591;0.32;0.68;1.28;1.85;2.7
Clus558;5;1.592;0.9739712521424849;0.31;1.17;1.61;1.91;2.96
Clus563;5;0.186;0.05770615218501404;0.12;0.15;0.18;0.21;0.27
Clus562;5;1.0059999999999998;0.6512142504583265;0.25;0.73;1.01;1.01;2.03
Clus548;5;0.45599999999999996;0.2606338427756457;0.18;0.32;0.34;0.61;0.83
Clus583;5;0.5900000000000001;0.20346989949375807;0.41;0.47;0.49;0.67;0.91
Clus547;5;1.7120000000000002;1.3078684949183537;0.45;0.93;1.37;1.99;3.82
Clus584;5;0.982;0.5015675428095403;0.35;0.65;1.01;1.28;1.62
Clus530;5;1.1500000000000001;0.4734976240700686;0.6;0.68;1.37;1.5;1.6
Clus531;5;0.43599999999999994;0.14859340496805368;0.25;0.31;0.51;0.51;0.6
Clus532;5;1.27;0.5028916384272063;0.7;0.86;1.28;1.6;1.91
Clus533;5;1.768;2.584409023355243;0.36;0.36;0.67;1.09;6.36
Clus535;5;0.382;0.4832908027264744;0.09;0.14;0.19;0.25;1.24
Clus536;5;0.628;0.4655319537904998;0.37;0.37;0.4;0.55;1.45
Clus537;5;3.998;2.504839316203736;0.48;2.76;4.03;6.24;6.48
Clus540;5;0.9540000000000001;0.4830941937138139;0.5;0.61;0.82;1.14;1.7
Clus541;5;2.4859999999999998;2.203072853992804;0.43;0.74;2.01;3.45;5.8
Clus542;5;1.308;0.6030505783099789;0.55;1.14;1.28;1.34;2.23
Clus591;5;0.4;0.09246621004453466;0.31;0.36;0.36;0.42;0.55
Clus590;5;1.0619999999999998;1.1506389529300667;0.19;0.26;0.32;1.81;2.73
Clus589;5;1.206;0.6326373368684464;0.48;0.96;1.05;1.35;2.19
Clus587;5;1.022;0.5315731370187925;0.24;0.87;1.01;1.34;1.65
Clus543;5;2.602;2.04447303723967;0.82;1.75;1.91;2.42;6.11
Clus545;5;0.892;0.2201590334281108;0.7;0.79;0.84;0.86;1.27
Clus546;5;7.398000000000001;8.90871876309944;1.48;2.17;2.19;8.71;22.44
Clus586;5;9.124;5.4130194900812985;1.75;5.98;9.39;13.85;14.65
Clus585;5;0.8619999999999999;0.5576916710871699;0.32;0.42;0.68;1.3;1.59
Clus472;5;0.312;0.18102486017119307;0.12;0.14;0.37;0.38;0.55
Clus405;5;0.36;0.13322912594474226;0.24;0.27;0.35;0.36;0.58
Clus428;5;0.952;0.31475387209691325;0.42;0.95;1.04;1.12;1.23
Clus392;5;0.648;0.1678392087683924;0.38;0.63;0.65;0.78;0.8
Clus413;5;0.5719999999999998;0.6323527496579737;0.23;0.26;0.32;0.35;1.7
Clus441;5;0.958;1.3114190787082518;0.14;0.32;0.39;0.66;3.28
Clus440;5;0.592;0.40014997188554197;0.18;0.27;0.49;0.95;1.07
Clus364;5;3.66;1.8754599435871726;1.44;2.47;3.27;5.14;5.98
Clus369;5;2.932;1.5116944135637995;0.35;3.19;3.23;3.58;4.31
Clus373;5;4.792;3.4942624400579874;0.5;1.6;6.48;7.15;8.23
Clus312;5;1.302;1.347597862865625;0.39;0.48;0.96;1.02;3.66
Clus435;5;1.3519999999999999;1.0535036782090512;0.36;0.55;1.06;1.87;2.92
Clus434;5;0.53;0.22472205054244232;0.28;0.3;0.64;0.66;0.77
Clus278;5;2.2920000000000003;1.9470927045212822;0.91;1.48;1.64;1.7;5.73
Clus391;5;1.4540000000000002;0.4413955142499752;1.09;1.16;1.41;1.41;2.2
Clus432;5;0.726;0.11414902540100812;0.62;0.65;0.66;0.85;0.85
Clus431;5;1.6939999999999997;0.7081878281924929;0.46;1.79;1.92;2.09;2.21
Clus430;5;0.702;0.6469312173639482;0.12;0.28;0.54;0.81;1.76
Clus429;5;0.248;0.1796385259347226;0.02;0.2;0.23;0.27;0.52
Clus446;5;0.696;0.2369177072318572;0.41;0.51;0.72;0.86;0.98
Clus339;5;0.6;0.2478911051248108;0.38;0.46;0.51;0.64;1.01
Clus395;5;0.976;1.1779770795732825;0.3;0.35;0.54;0.62;3.07
Clus426;5;1.0260000000000002;0.9120197366285446;0.18;0.66;0.81;0.9;2.58
Clus425;5;1.768;1.9956753242950116;0.22;0.57;0.81;2.15;5.09
Clus281;5;2.562;1.769172122773813;0.73;1.51;2.27;2.94;5.36
Clus424;5;0.7000000000000001;0.620322496770833;0.22;0.42;0.46;0.62;1.78
Clus298;5;1.5340000000000003;1.5531355381936247;0.28;0.28;1.17;1.91;4.03
Clus421;5;1.432;0.42628628877785874;0.76;1.44;1.46;1.56;1.94
Clus286;5;0.364;0.28597202660400195;0.11;0.22;0.29;0.35;0.85
Clus419;5;0.318;0.06418722614352486;0.24;0.26;0.34;0.37;0.38
Clus408;5;0.712;0.4232847741178508;0.25;0.56;0.63;0.72;1.4
Clus417;5;1.7299999999999998;0.9106591019695569;0.69;1.24;1.38;2.44;2.9
Clus416;5;2.362;2.1357715233610546;0.31;0.76;1.9;3.24;5.6
Clus411;5;3.186;6.4403594620176285;0.09;0.09;0.46;0.59;14.7
Clus445;5;2.32;0.6669707639769528;1.32;2.08;2.36;2.91;2.93
Clus442;5;1.846;1.6660972360579678;0.23;0.63;1.19;3.09;4.09
Clus447;5;1.328;0.5540036100965408;0.78;0.81;1.41;1.53;2.11
Clus457;5;1.274;1.0458393758125577;0.46;0.66;1.05;1.12;3.08
Clus468;5;2.35;0.5476769120567345;1.96;2.01;2.13;2.36;3.29
Clus467;5;1.428;0.974638394482795;0.38;0.72;1.2;2.12;2.72
Clus202;5;0.654;0.3803025111670971;0.3;0.46;0.55;0.67;1.29
Clus465;5;2.154;2.545344770360196;0.86;0.93;1.04;1.24;6.7
Clus345;5;3.6159999999999997;4.807871670500369;0.71;1.34;1.63;2.24;12.16
Clus219;5;3.9839999999999995;4.2722160525891;0.66;2.12;2.45;3.25;11.44
Clus232;5;0.524;0.21961329650091774;0.32;0.41;0.46;0.54;0.89
Clus238;5;2.5300000000000002;1.1691877522451215;0.45;2.89;3.01;3.07;3.23
Clus461;5;3.1740000000000004;1.9226492139753417;1.84;2.0;2.48;3.04;6.51
Clus347;5;1.3980000000000001;1.468322171732076;0.39;0.6;0.65;1.42;3.93
Clus460;5;1.314;0.6719970238029331;0.76;1.06;1.06;1.21;2.48
Clus159;5;0.5880000000000001;0.7739638234439643;0.19;0.21;0.26;0.31;1.97
Clus319;5;1.008;0.8437535185111824;0.42;0.57;0.71;0.85;2.49
Clus459;5;1.5279999999999998;1.1625274190314823;0.6;0.69;0.76;2.65;2.94
Clus414;5;2.164;0.9947763567757328;0.53;2.27;2.38;2.39;3.25
Clus456;5;6.9239999999999995;9.118691243813446;0.44;1.66;4.19;5.49;22.84
Clus453;5;2.008;0.686236110970561;0.82;2.06;2.24;2.4;2.52
Clus326;5;1.1179999999999999;0.5817817460182125;0.49;0.77;1.05;1.26;2.02
Clus449;5;3.102;3.944929657167539;0.59;0.75;0.89;3.44;9.84
Clus450;5;2.7640000000000002;2.3987663496055633;1.09;1.48;1.77;2.53;6.95
Clus357;5;1.78;1.103653025184999;0.32;1.08;2.06;2.27;3.17
Clus451;5;0.568;0.375259909929105;0.07;0.48;0.51;0.67;1.11
Clus323;5;1.486;0.717481707083881;0.74;0.74;1.62;2.11;2.22
Clus409;4;4.9399999999999995;3.272440475649124;1.44;3.66;4.485;5.765000000000001;9.35
Clus559;4;1.3975;0.6743577191174823;0.51;1.0875;1.505;1.815;2.07
Clus574;4;1.0750000000000002;0.6121274377121156;0.44;0.7100000000000001;0.995;1.3599999999999999;1.87
Clus544;4;1.3699999999999999;0.5242136968832463;0.96;1.005;1.21;1.5749999999999997;2.1
Clus351;4;8.8975;5.4814862643873035;1.8;5.970000000000001;10.165000000000001;13.092500000000001;13.46
Clus334;4;0.91;0.2719068467937748;0.56;0.7625;0.97;1.1175;1.14
Clus382;4;1.9925000000000002;2.1610549121513163;0.15;0.8999999999999999;1.355;2.4475;5.11
Clus470;4;3.9124999999999996;3.2852739611788846;1.58;1.85;2.69;4.7524999999999995;8.69
Clus353;4;1.18;0.7144695001654491;0.49;0.6475;1.1;1.6324999999999998;2.03
Clus386;4;0.8325;0.29702693480558295;0.52;0.61;0.845;1.0675000000000001;1.12
Clus580;4;0.97;0.45614325235244535;0.58;0.7675;0.835;1.0375;1.63
Clus565;4;0.5975;0.42578359135441873;0.19;0.3325;0.515;0.78;1.17
Clus362;4;1.2;0.54571054598569;0.7;0.835;1.085;1.45;1.93
Clus438;4;0.7125;0.388533567833377;0.13;0.7;0.9;0.9125;0.92
Clus437;4;1.6375000000000002;0.7926485139496994;0.74;1.205;1.5950000000000002;2.0275;2.62
Clus476;4;11.0275;12.420728306611762;0.46;0.505;9.515;20.0375;24.62
Clus477;4;1.1099999999999999;0.3942080668885405;0.62;0.9575;1.12;1.2725;1.58
Clus168;4;0.5575;0.24649205531483837;0.23;0.44;0.61;0.7275;0.78
Clus485;4;2.43;1.214660446379975;1.04;1.7825;2.375;3.0225;3.93
Clus46;4;1.285;0.8115212053093047;0.46;0.7525;1.185;1.7175000000000002;2.31
Clus455;4;4.654999999999999;7.979245996124361;0.21;0.54;0.8999999999999999;5.015;16.61
Clus247;4;2.88;2.844421440879205;0.83;1.4975;1.7999999999999998;3.1825;7.09
Clus495;4;1.6549999999999998;1.3780299948356227;0.44;0.9724999999999999;1.275;1.9574999999999998;3.63
Clus75;4;9.6125;14.962273390096842;1.33;1.675;2.55;10.4875;32.02
Clus448;4;2.035;1.6233812450150662;0.58;0.9775;1.6550000000000002;2.7125000000000004;4.25
Clus508;4;8.147499999999999;8.85770239208039;0.34;1.24;6.615;13.5225;19.02
Clus439;4;1.1575;0.16459546368799674;1.01;1.0475;1.12;1.23;1.38
Clus510;4;2.1199999999999997;0.6814690014960327;1.67;1.67;1.8499999999999999;2.3;3.11
Clus572;4;0.91;0.2626785107312739;0.54;0.8325;0.9750000000000001;1.0525;1.15
Clus277;4;0.815;0.3029301349596416;0.42;0.6599999999999999;0.875;1.03;1.09
Clus287;4;0.6775;0.17346949779908474;0.54;0.5475000000000001;0.63;0.76;0.91
Clus534;4;0.5149999999999999;0.16380883167074153;0.3;0.435;0.5449999999999999;0.625;0.67
Clus433;4;0.6399999999999999;0.5745142876088172;0.13;0.2875;0.495;0.8475;1.44
Clus517;4;0.5025000000000001;0.18006943105369108;0.32;0.395;0.475;0.5825;0.74
Clus279;4;0.7224999999999999;0.8584239434374292;0.12;0.24749999999999997;0.39;0.865;1.99
Clus418;4;1.1925;1.3279401341928032;0.33;0.42750000000000005;0.64;1.405;3.16
Clus427;4;6.1475;3.626057317068591;0.73;5.845;7.76;8.0625;8.34
Clus423;4;0.8024999999999999;0.24676236882204436;0.65;0.665;0.6950000000000001;0.8325;1.17
Clus285;4;1.2325;1.1726430261024312;0.13;0.355;1.07;1.9475;2.66
Clus240;3;0.68;0.45210618221829263;0.18;0.49;0.8;0.93;1.06
Clus226;3;2.1999999999999997;1.6014992975334081;0.64;1.3800000000000001;2.12;2.98;3.84
Clus132;3;2.3633333333333333;1.8842858947976375;0.41;1.46;2.51;3.34;4.17
Clus592;3;7.746666666666665;11.47285637203453;0.83;1.125;1.42;11.204999999999998;20.99
Clus315;3;0.79;0.5008991914547277;0.36;0.515;0.67;1.0050000000000001;1.34
Clus248;3;1.0199999999999998;0.7408103670980853;0.26;0.66;1.06;1.4;1.74
Clus264;3;0.51;0.2264950330581225;0.3;0.39;0.48;0.615;0.75
Clus303;3;1.8866666666666665;1.4407058455261896;0.76;1.075;1.39;2.4499999999999997;3.51
Clus297;3;1.7066666666666663;0.7910330797971306;0.94;1.2999999999999998;1.66;2.09;2.52
Clus129;3;2.57;0.3218695387886217;2.21;2.44;2.67;2.75;2.83
Clus383;3;0.34;0.19467922333931784;0.12;0.265;0.41;0.44999999999999996;0.49
Clus571;3;0.7566666666666667;0.5016306742348731;0.28;0.495;0.71;0.995;1.28
Clus420;3;4.473333333333334;6.275924898637119;0.81;0.8500000000000001;0.89;6.305000000000001;11.72
Clus403;3;10.186666666666667;8.383593103993855;0.8;6.815;12.83;14.879999999999999;16.93
Clus526;3;1.22;1.1793218390244455;0.48;0.54;0.6;1.59;2.58
Clus350;3;0.58;0.09848857801796107;0.47;0.54;0.61;0.635;0.66
Clus479;3;0.7466666666666667;0.17785762095938798;0.62;0.645;0.67;0.81;0.95
Clus462;3;0.3333333333333333;0.18929694486000914;0.2;0.225;0.25;0.4;0.55
Clus155;3;1.3233333333333333;0.49702447961175245;0.76;1.135;1.51;1.605;1.7
Clus263;2;0.595;0.27577164466275356;0.4;0.49750000000000005;0.595;0.6925;0.79
Clus415;2;1.605;0.1767766952966369;1.48;1.5425;1.605;1.6675;1.73
Clus422;2;4.4399999999999995;2.9698484809834995;2.34;3.3899999999999997;4.4399999999999995;5.49;6.54
Clus520;2;0.49;0.07071067811865477;0.44;0.465;0.49;0.515;0.54
Clus123;2;1.1400000000000001;1.0323759005323596;0.41;0.775;1.1400000000000001;1.5050000000000001;1.87
Clus452;2;1.1400000000000001;0.6788225099390857;0.66;0.9;1.1400000000000001;1.3800000000000001;1.62
Clus272;2;3.9;3.2668333290818494;1.59;2.745;3.9;5.055;6.21
Clus252;2;0.645;0.5020458146424487;0.29;0.46749999999999997;0.645;0.8225;1.0
Clus260;2;0.42500000000000004;0.3323401871576774;0.19;0.3075;0.42500000000000004;0.5425;0.66
Clus289;2;3.0149999999999997;3.712310601229374;0.39;1.7025;3.0149999999999997;4.3275;5.64
Clus496;2;2.35;0.14142135623730964;2.25;2.3;2.35;2.4000000000000004;2.45
Clus486;2;2.995;2.2556706319850863;1.4;2.1975;2.995;3.7925;4.59
Clus224;2;1.06;0.6363961030678927;0.61;0.835;1.06;1.2850000000000001;1.51
Clus223;2;2.17;0.3535533905932738;1.92;2.045;2.17;2.295;2.42
Clus464;2;1.265;1.0535891039679557;0.52;0.8925;1.265;1.6374999999999997;2.01
Clus207;2;1.3399999999999999;0.4808326112068523;1.0;1.17;1.3399999999999999;1.51;1.68
Clus466;2;1.8699999999999999;1.6970562748477138;0.67;1.27;1.8699999999999999;2.4699999999999998;3.07
Clus288;2;1.3599999999999999;1.2727922061357855;0.46;0.9099999999999999;1.3599999999999999;1.8099999999999998;2.26
Clus469;2;0.47;0.1979898987322333;0.33;0.4;0.47;0.54;0.61
Clus538;2;1.52;0.6646803743153546;1.05;1.2850000000000001;1.52;1.755;1.99
Clus322;2;1.655;1.5202795795510773;0.58;1.1175;1.655;2.1925;2.73
Clus378;2;0.84;0.014142135623730963;0.83;0.835;0.84;0.845;0.85
Clus588;2;1.965;2.170817818242701;0.43;1.1975;1.965;2.7325;3.5
Clus360;2;0.39;0.16970562748477142;0.27;0.33;0.39;0.45;0.51
Clus352;2;0.9949999999999999;0.20506096654409872;0.85;0.9224999999999999;0.9949999999999999;1.0675;1.14
Clus320;2;3.4450000000000003;3.4860364312496794;0.98;2.2125;3.4450000000000003;4.6775;5.91
Clus400;2;1.01;0.9192388155425117;0.36;0.685;1.01;1.335;1.66
Clus134;2;0.475;0.007071067811865481;0.47;0.4725;0.475;0.4775;0.48
Clus402;2;0.58;0.7778174593052022;0.03;0.305;0.58;0.8549999999999999;1.13
Clus346;1;1.36;;1.36;1.36;1.36;1.36;1.36
Clus214;1;1.56;;1.56;1.56;1.56;1.56;1.56
Clus216;1;4.69;;4.69;4.69;4.69;4.69;4.69
Clus578;1;4.4;;4.4;4.4;4.4;4.4;4.4
Clus332;1;4.36;;4.36;4.36;4.36;4.36;4.36
Clus567;1;2.31;;2.31;2.31;2.31;2.31;2.31
Clus576;1;0.43;;0.43;0.43;0.43;0.43;0.43
Clus463;1;1.51;;1.51;1.51;1.51;1.51;1.51
Clus483;1;0.56;;0.56;0.56;0.56;0.56;0.56
Clus181;1;1.02;;1.02;1.02;1.02;1.02;1.02
Clus105;1;0.97;;0.97;0.97;0.97;0.97;0.97
Clus166;1;1.46;;1.46;1.46;1.46;1.46;1.46
Clus454;1;0.57;;0.57;0.57;0.57;0.57;0.57
Clus293;1;3.88;;3.88;3.88;3.88;3.88;3.88
Clus553;1;0.2;;0.2;0.2;0.2;0.2;0.2
Clus498;1;0.25;;0.25;0.25;0.25;0.25;0.25
Clus270;1;3.08;;3.08;3.08;3.08;3.08;3.08
Clus307;1;1.32;;1.32;1.32;1.32;1.32;1.32
Clus273;1;1.8;;1.8;1.8;1.8;1.8;1.8
Clus120;1;0.22;;0.22;0.22;0.22;0.22;0.22
Clus305;1;0.33;;0.33;0.33;0.33;0.33;0.33
Clus436;1;2.01;;2.01;2.01;2.01;2.01;2.01
Clus516;1;1.7;;1.7;1.7;1.7;1.7;1.7
Clus385;1;1.29;;1.29;1.29;1.29;1.29;1.29
Clus575;1;7.29;;7.29;7.29;7.29;7.29;7.29
Clus412;1;1.12;;1.12;1.12;1.12;1.12;1.12
Clus280;1;2.04;;2.04;2.04;2.04;2.04;2.04
