Type;Apo_ID;Holo_ID;Model_ID_lowest_RMSD_vs_Apo/Holo;lowest_RMSD_vs_Apo_Holo;RMSD_Apo_vs_Holo;RMSD_prom_models_vs_Apo;RMSD_prom_models_vs_Holo
Holo;1A6D_A;1A6E_A;1A6D_A_Julieta_8e140_relaxed_model_5;1.58;0.83;1.904000;1.785000
Holo;1AEL-12_A;1URE-8_A;1AEL_1a8e9_relaxed_model_5;1.53;2.69;2.516000;1.554000
Apo;1AKZ_A;1SSP_E;1AKZ_A_tes_f478a_relaxed_model_5;0.51;1.50;0.533000;1.329000
Holo;1AW2_A;1AW1_B;1AW2_A_dfb9d_relaxed_model_1;0.55;1.02;1.075000;0.560000
Holo;1BV2-3_A;1UVB_A;1BV2_6e58e_relaxed_model_5;1.13;1.96;1.553000;1.243000
Holo;1C54-19_A;1RGH_B;1C54_60315_relaxed_model_1;0.42;1.49;1.522000;0.466000
Holo;1CBI_A;1CBR_B;1CBI_d066c_relaxed_model_3;0.83;1.64;1.597000;0.937000
Holo;1E5L_A;1E5Q_A;1E5L_A_julia_09a2b_relaxed_model_1;0.78;2.44;1.743000;1.027000
Apo;1EAL-2_A;1EIO-3_A;1EAL-2_A_a52d3_relaxed_model_3;1.37;2.39;1.452000;2.043000
Holo;1EVK_A;1EVL_A;1EVK_A_tes_7808e_relaxed_model_3;0.92;1.64;1.398000;1.174000
Apo;1EX6_B;1EX7_A;1EX6_B_b03f9_relaxed_model_1;0.94;4.37;1.314000;3.486000
Holo;1F3Y-17_A;1JKN-15_A;1F3Y-17_A_a4256_relaxed_model_3;2.98;5.08;5.365000;3.624000
Apo;1FMF-4_A;1ID8-11_A;1FMF_88836_relaxed_model_5;1.78;4.74;1.834000;4.592000
Holo;1FSF_A;1FQO_B;1FSF_A_tes_ec4d9_relaxed_model_1;0.43;1.11;1.031000;0.455000
Holo;1G6W_D;1K0B_C;1G6W_D_tes_a62f6_relaxed_model_2;0.71;1.36;0.988000;0.802000
Apo;1GH1-7_A;1CZ2-8_A;1GH1_A_ee632_relaxed_model_5;2.45;3.04;2.579000;2.740000
Holo;1GQN_A;1QFE_B;1GQN_c239b_relaxed_model_2;0.36;1.26;1.233000;0.393000
Apo;1GQZ_A;2GKE_A;1GQZ_2aa6f_relaxed_model_5;1.58;2.45;1.823000;2.349000
Holo;1GUD_A;1RPJ_A;1GUD_A_cbee3_relaxed_model_1;0.92;4.45;3.696000;1.126000
Holo;1HOO_B;1CG0_A;1HOO_27db7_relaxed_model_1;0.87;2.21;1.672000;1.158000
Holo;1HSI_B;1HSH_D;1HSI_31771_relaxed_model_5;0.98;0.99;1.490000;1.240000
Apo;1HW1_B;1H9G_A;1HW1_B_c0c4b_relaxed_model_3;0.75;1.67;0.858000;1.609000
Holo;1I56_A;1EL1_A;1I56_daef7_relaxed_model_1;0.78;1.95;2.017000;0.959000
Holo;1IGP_A;2AU6_A;1IGP_76f26_relaxed_model_3;0.76;1.12;1.004000;0.823000
Holo;1IJA-15_A;2KID-4_A;1IJA_c5993_relaxed_model_4;2.01;4.54;3.392000;2.409000
Holo;1JEJ_A;1JG6_A;1JEJ_20406_relaxed_model_2;1.16;2.10;1.928000;2.038000
Holo;1JFJ-3_A;1JFK_A;1JFJ_f1c73_relaxed_model_1;13.06;14.73;13.555000;13.205000
Apo;1JM4-15_B;1WUM_A;1JM4_B_b5818_relaxed_model_1;2.76;5.33;3.194000;3.809000
Holo;1JSP-15_B;2L84-18_A;1JSP_45dbc_relaxed_model_4;4.12;6.10;5.337000;4.252000
Holo;1JYU_A;1JYR_A;1JYU_8a2f6_relaxed_model_5;0.59;12.78;12.786000;0.689000
Holo;1K2H-4_A;1ZFS-13_B;1K2H_f0ed9_relaxed_model_2;2.13;6.59;6.447000;2.198000
Holo;1K5H_A;1Q0Q_A;1K5H_A_Tomas_be661_relaxed_model_2;1.05;4.93;4.866000;1.302000
Holo;1K6W_A;1K70_A;1K6W_A_Tomas_7bd61_relaxed_model_2;0.81;1.08;1.030000;0.979000
Holo;1L0W_B;1G51_A;1L0W_B_740d0_relaxed_model_1;1.09;1.77;1.642000;1.160000
Apo;1LIP-2_A;1JTB-6_A;1LIP_0cedc_relaxed_model_1;1.67;3.30;1.990000;2.937000
Holo;1LMZ-9_A;1P7M-18_A;1LMZ_91a8b_relaxed_model_4;2.23;3.81;3.402000;2.306000
Holo;1MO7-3_A;1MO8-14_A;1MO7_f42b8_relaxed_model_5;3.34;4.93;4.102000;3.414000
Holo;1MUT-11_A;1PUN-7_A;1MUT_A_AgusGM_8c169_relaxed_model_4;3.73;4.98;3.825000;4.031000
Holo;1MX7-20_A;1MX8-25_A;1MX7_A_tes_a5007_relaxed_model_5;1.48;2.25;2.029000;1.523000
Holo;1NJG_B;1NJF_A;1NJG_4bdf4_relaxed_model_3;0.80;1.33;1.583000;0.914000
Apo;1NM4_A;1OT4-33_A;1NM4_A_julia_47a16_relaxed_model_4;2.32;3.61;2.330000;3.654000
Holo;1NTR-7_A;1KRX-4_A;1NTR-7_A_ba355_relaxed_model_1;3.39;4.55;4.281000;3.455000
Apo;1O1U-9_A;1O1V-5_A;1O1U-9_A_e89f5_relaxed_model_4;1.64;2.25;1.724000;1.833000
Holo;1ORM-9_A;1QJ8_A;1ORM_9_A_tes_4dc9b_relaxed_model_2;0.73;6.13;5.922000;0.944000
Apo;1OTJ_D;1GY9_A;1OTJ_47264_relaxed_model_1;0.80;1.74;0.901000;1.156000
Apo;1PDB_A;1YHO-9_A;1PDB_A_tes_a678f_relaxed_model_2;0.81;1.66;0.989000;1.613000
Holo;1PFL-19_A;1FIL_A;1PFL-19_A_tes_4d6f0_relaxed_model_2;0.75;1.91;2.001000;0.811000
Holo;1RF5_A;1RF4_A;1RF5_A_tes_8a9d2_relaxed_model_2;0.63;3.69;3.208000;0.694000
Apo;1RKA_A;1GQT_A;1RKA_A_Julieta_29b53_relaxed_model_5;0.90;1.22;1.160000;1.984000
Holo;1RKM_A;1B6H_A;1RKM_A_1807c_relaxed_model_2;0.59;3.16;2.855000;0.618000
Holo;1S2O_A;1TJ5_A;1S2O_A_tes_63fd6_relaxed_model_2;0.58;3.30;3.205000;0.646000
Holo;1SKT-10_A;1TNQ-33_A;1SKT_d1326_relaxed_model_1;3.10;7.19;4.743000;3.414000
Holo;1SYM-2_B;1XYD-15_B;1SYM_04dfe_relaxed_model_2;1.91;6.69;6.227000;1.981000
Holo;1TFU_A;3UC5_A;1TFU_be7b7_relaxed_model_3;0.68;1.06;1.075000;0.750000
Apo;1TJD_A;1EEJ_B;1TJD_86db7_relaxed_model_5;2.05;2.08;2.291000;2.904000
Holo;1URP_D;2DRI_A;1URP_D_tes_65d2e_relaxed_model_4;0.46;4.20;3.857000;0.534000
Holo;1VIY_C;1VHL_A;1VIY_C_tes_ad796_relaxed_model_2;2.55;2.61;2.777000;2.647000
Apo;1VR6_A;1RZM_A;1VR6_A_0c626_relaxed_model_3;1.70;10.11;1.910000;9.134000
Apo;1W0J_E;1E1R_F;1W0J_E_39697_relaxed_model_3;1.27;3.89;1.596000;2.633000
Holo;1W4U-9_A;1UR6-4_A;1W4U-9_A_bd51a_relaxed_model_5;2.15;3.01;2.301000;2.167000
Holo;1WD7_B;1WCW_A;1WD7_B_ef358_relaxed_model_1;0.92;4.12;4.214000;3.681000
Holo;1XSA-23_A;1XSC-20_A;1XSA_A_julia_2847f_relaxed_model_5;2.63;4.76;3.852000;2.900000
Apo;1Y3Q_A;1Y3N_A;1Y3Q_125b0_relaxed_model_4;2.06;4.79;2.761000;2.475000
Holo;1YL5_B;1YL7_A;1YL5_B_tes_bf63b_relaxed_model_1;1.17;1.23;2.181000;1.891000
Holo;1Z15_A;1Z17_A;1Z15_A_8b906_relaxed_model_5;0.60;6.45;6.208000;0.639000
Apo;1ZA1_A;1Q95_A;1ZA1_2f19f_relaxed_model_3;0.96;2.25;1.077000;2.043000
Holo;1ZOL_A;1O03_A;1ZOL_A_Tomas_2222e_relaxed_model_1;0.84;3.13;2.934000;0.952000
Apo;2AI6-18_A;2OZW-3_A;2AI6_18_A_tes_9b4bd_relaxed_model_4;2.50;3.09;2.546000;3.202000
Holo;2BNH_A;1DFJ_I;2BNH_05ef0_relaxed_model_4;0.96;1.51;1.098000;1.076000
Apo;2CG7_A;2CG6_A;2CG7_A_tes_68ab2_relaxed_model_1;1.08;6.25;1.119000;6.329000
Holo;2CGK_B;2CGJ_A;2CGK_B_4e89e_relaxed_model_3;0.57;1.58;1.621000;0.592000
Apo;2CJO-5_A;1ROE-10_A;2CJO_38cee_relaxed_model_5;1.36;4.55;1.448000;4.452000
Apo;2D9E-12_A;2RS9-13_B;2D9E_MCh_37eaf_relaxed_model_1;2.75;5.30;2.965000;3.360000
Apo;2F63-4_A;1EQM_A;2F63_A_7da39_relaxed_model_4;1.90;4.62;1.943000;4.052000
Holo;2FHM-12_A;2HLT-19_A;2FHM_97b41_relaxed_model_3;0.86;1.90;1.618000;0.925000
Holo;2IN2_A;2B0F_A;2IN2_A_b282b_relaxed_model_5;1.62;1.91;1.724000;1.660000
Holo;2JU3-3_A;2JU8-9_A;2JU3_A_tes_f07cb_relaxed_model_5;1.72;3.17;2.953000;1.909000
Holo;2JWW-13_A;1RTP_1;2JWW_A_7d679_relaxed_model_3;0.41;2.79;2.670000;0.471000
Apo;2K43-1_A;2K8R-1_A;2K43_1a006_relaxed_model_1;2.78;3.93;2.845000;4.124000
Holo;2KAX-5_A;2KAY-16_B;2KAX_A_9f46f_relaxed_model_3;1.70;5.08;5.090000;1.735000
Apo;2KE0-15_A;2KO7-12_A;2KE0_A_Tomas_a558a_relaxed_model_3;2.11;4.85;2.333000;4.457000
Holo;2KXL-8_A;2K0G-9_A;2KXL_A_tes_552d0_relaxed_model_5;3.36;6.09;5.338000;3.520000
Apo;2L50-24_A;2L51-15_B;2L50-24_A_EDU_25fb9_relaxed_model_4;3.08;4.56;4.297000;5.008000
Holo;2L68-9_A;2LKK-10_A;2L68_A_d1f9c_relaxed_model_1;1.30;1.58;1.442000;1.317000
Holo;2LAO_A;1LAH_E;2LAO_A_tes_15956_relaxed_model_1;0.45;4.75;4.670000;0.504000
Holo;2LHS-6_A;2BEM_A;2LHS_b7207_relaxed_model_4;0.43;1.52;1.488000;0.441000
Holo;2LKC-4_A;2LKD-18_A;2LKC_96caf_relaxed_model_2;4.48;7.47;7.962000;4.649000
Apo;2MCG_2;1A8J_H;2MCG_4718a_relaxed_model_2;2.25;12.97;2.944000;11.681000
Holo;2NLN-4_A;1RRO_A;2NLN_A_1c3e2_relaxed_model_5;0.61;3.90;3.942000;0.658000
Holo;2P3M-16_A;2VBT_A;2P3M_A_390ea_relaxed_model_5;1.63;2.78;2.033000;1.827000
Holo;2QMV-9_A;4PRG_D;2QMV-9_A_tes_64682_relaxed_model_2;2.55;4.20;3.981000;2.653000
Holo;2RCS_H;1AJ7_H;2RCS_H_tes_1ed8e_relaxed_model_2;2.68;7.21;5.277000;2.771000
Holo;2UZ5-9_A;2VCD-8_A;2UZ5_A_a9318_relaxed_model_5;1.49;3.37;3.158000;1.528000
Holo;4AKE_B;2ECK_B;4AKE_B_27f14_relaxed_model_1;0.76;6.95;6.162000;1.431000
Apo;6OY9_B;1A0R_B;6OY9_B_tes_01596_relaxed_model_1;1.30;1.75;1.448000;3.071000
Apo;7AZP_A;4PJ1_A;7AZP_A_tes_nr_3_templates_8ab1a_relaxed_rank_5_model_1;1.9192;13.2368;4.4800;11.0105
Apo;4LP5_A;4P2Y_A;4LP5_A_tes_nr_3_templates_141e6_relaxed_rank_5_model_1;5.2678;11.6874;6.5892;7.6155
Holo;1CFC_A;5DOW_A;1CFC_A_tes_nr_3_templates_02471_relaxed_rank_3_model_3;5.1275;9.2462;6.1806;6.9407
Apo;2KQ2-6_A;2KW4-19_A;2kq2_56ab7_relaxed_rank_5_model_5;9.1722;14.1415;9.2856;10.9055
Apo;1DMO-18_A;3CLN_A;3cln_f1864_relaxed_rank_3_model_2;7.6537;14.6398;8.4380;11.1624
