{
    "edu.state.prof": [
        "Elektroinstallateur_in EFZ",
        "Informatiker_in EFZ"
    ],
    "edu.state.higher": [
        "eidg. dipl. Stromer HF",
        "Elektrotechnik BSc",
        "Elektrotechnik MSc"
    ],
    "med": [
        "Tunnel-Tauglichkeit",
        "Taucher-Brevet"
    ],
    "biz.ch.sbb": [
        "RTE 20001"
    ]
}