(module "SC-70-5_L2.1-W1.3-P0.65-LS2.1-BR" (layer F.Cu) (tedit 6438445E)
  (descr "SC-70-5_L2.1-W1.3-P0.65-LS2.1-BR footprint")
  (tags "SC-70-5_L2.1-W1.3-P0.65-LS2.1-BR footprint")
  (fp_text reference REF** (at 0 -3.150038) (layer F.SilkS)
    (effects (font (size 1 1) (thickness 0.15)))
  )
  (fp_text value SC-70-5_L2.1-W1.3-P0.65-LS2.1-BR (at 0 3.149987) (layer F.Fab)
    (effects (font (size 1 1) (thickness 0.15)))
  )
  (fp_circle (center 1.053086 1.052121) (end 1.083058 1.052121) (layer F.SilkS) (width 0.059995))
  (fp_circle (center 1.905004 0.635052) (end 2.032004 0.635052) (layer F.Fab) (width 0.254001))
  (fp_circle (center 1.143002 1.270053) (end 1.270003 1.270053) (layer F.SilkS) (width 0.254001))
  (fp_line (start -0.699975 0.241935) (end -0.699975 -0.241935) (layer F.SilkS) (width 0.254001))
  (fp_line (start 0.7 -1.058141) (end 0.7 -1.150038) (layer F.SilkS) (width 0.254001))
  (fp_line (start 0.7 1.149987) (end 0.7 1.058141) (layer F.SilkS) (width 0.254001))
  (fp_line (start -0.699975 -1.058065) (end -0.699975 -1.150038) (layer F.SilkS) (width 0.254001))
  (fp_line (start -0.699975 1.149987) (end -0.699975 1.05809) (layer F.SilkS) (width 0.254001))
  (fp_line (start -0.699975 -1.150038) (end 0.7 -1.150038) (layer F.SilkS) (width 0.254001))
  (fp_line (start -0.699975 1.149987) (end 0.7 1.149987) (layer F.SilkS) (width 0.254001))
  (pad 5 smd rect (at -1.100076 0.650038 90) (size 0.4 0.9) (layers F.Cu F.Mask F.Paste))
  (pad 4 smd rect (at -1.100076 -0.649936 90) (size 0.4 0.9) (layers F.Cu F.Mask F.Paste))
  (pad 3 smd rect (at 1.100076 -0.649936 90) (size 0.4 0.9) (layers F.Cu F.Mask F.Paste))
  (pad 2 smd rect (at 1.100076 0.000051 90) (size 0.4 0.9) (layers F.Cu F.Mask F.Paste))
  (pad 1 smd rect (at 1.100076 0.650038 90) (size 0.4 0.9) (layers F.Cu F.Mask F.Paste))
  (fp_text user REF** (at 0 5.149987) (layer F.Fab)
    (effects (font (size 1 1) (thickness 0.15)))
  )
  (model "C:/Users/dylan/OneDrive - University of Cape Town/UNIVERSITY FILES/Third Year/Semester 1/EEE3088F/group-34-hat/PCB/main/JLC2KiCad_lib/footprint/packages3d/SC-70-5_L2.1-W1.3-P0.65-LS2.1-BR.wrl"
    (at (xyz 0 0 0.00394))
    (scale (xyz 1 1 1))
    (rotate (xyz 0 0 -180))
  )
)