#VRML V2.0 utf8
#created by JLC2KiCad_lib using the JLCPCB library
#for more info see https://github.com/TousstNicolas/JLC2KICAD_lib

Shape{
	appearance Appearance {
		material  Material 	{ 
			diffuseColor 0.2235294117647059 0.2235294117647059 0.2235294117647059 
			specularColor 0.11372549019607843 0.11372549019607843 0.11372549019607843
			ambientIntensity 0.2
			transparency 0.0
			shininess 0.5
		}
	}
	geometry IndexedFaceSet {
		ccw TRUE 
		solid FALSE
		coord DEF co Coordinate {
			point [
				-0.1262 -0.2445 0.3543, -0.1262 0.0315 0.3543, -0.1284 0.0315 0.3543, -0.0692 -0.3523 0.3543, -0.0692 -0.3523 0.3543, -0.0692 -0.3557 0.3543, -0.0859 -0.3409 0.3543, -0.0868 -0.341 0.3543, -0.0779 -0.341 0.3543, -0.1143 -0.2449 0.3543, -0.1114 -0.2445 0.3543, -0.1047 -0.282 0.3543, -0.1071 -0.2822 0.3543, -0.0948 -0.2822 0.3543, -0.3473 -0.2964 0.3543, -0.3467 -0.2931 0.3543, -0.3937 -0.2931 0.3543, -0.1963 -0.2737 0.3543, -0.1891 -0.2797 0.3543, -0.1641 -0.2445 0.3543, -0.1641 -0.2822 0.3543, -0.2313 -0.2407 0.3543, -0.2256 -0.2445 0.3543, -0.2196 -0.2486 0.3543, -0.2109 -0.2586 0.3543, -0.2053 -0.2694 0.3543, -0.2041 -0.2698 0.3543, -0.2446 -0.236 0.3543, -0.1641 0.0315 0.3543, -0.2554 -0.2349 0.3543, -0.3445 0.0315 0.3543, -0.2685 -0.2365 0.3543, -0.2806 -0.2412 0.3543, -0.3445 -0.2445 0.3543, -0.3151 -0.2575 0.3543, -0.3047 -0.2562 0.3543, -0.3456 -0.2865 0.3543, -0.3445 -0.284 0.3543, -0.3445 -0.2822 0.3543, -0.3437 -0.2822 0.3543, -0.3414 -0.277 0.3543, -0.335 -0.2689 0.3543, -0.286 -0.2445 0.3543, -0.287 -0.2451 0.3543, -0.2932 -0.2504 0.3543, -0.3017 -0.2564 0.3543, -0.2986 -0.2567 0.3543, -0.3333 -0.2672 0.3543, -0.3249 -0.2613 0.3543, -0.3937 -0.2822 0.3543, -0.3445 -0.3135 0.3543, -0.3461 -0.3093 0.3543, -0.3937 -0.341 0.3543, -0.3474 -0.2989 0.3543, -0.3445 -0.341 0.3543, -0.3363 -0.3276 0.3543, -0.3423 -0.3191 0.3543, -0.3152 -0.3403 0.3543, -0.3186 -0.3393 0.3543, -0.3281 -0.3346 0.3543, -0.3445 -0.3557 0.3543, -0.3011 -0.3557 0.3543, -0.3038 -0.3545 0.3543, -0.3089 -0.3506 0.3543, -0.3128 -0.3457 0.3543, -0.3149 -0.341 0.3543, -0.2977 -0.3571 0.3543, -0.3445 -0.3937 0.3543, -0.2915 -0.3582 0.3543, -0.2792 -0.3557 0.3543, -0.2842 -0.3575 0.3543, -0.1641 -0.3937 0.3543, -0.2902 -0.3582 0.3543, -0.2655 -0.341 0.3543, -0.2655 -0.341 0.3543, -0.1641 -0.3557 0.3543, -0.2686 -0.3469 0.3543, -0.273 -0.3518 0.3543, -0.2783 -0.3553 0.3543, -0.1805 -0.2952 0.3543, -0.1792 -0.3039 0.3543, -0.1641 -0.2931 0.3543, -0.2318 -0.3254 0.3543, -0.23 -0.3247 0.3543, -0.227 -0.3097 0.3543, -0.189 -0.3289 0.3543, -0.1961 -0.335 0.3543, -0.1641 -0.341 0.3543, -0.3285 -0.309 0.3543, -0.3251 -0.3147 0.3543, -0.3118 -0.3166 0.3543, -0.3203 -0.3194 0.3543, -0.315 -0.3226 0.3543, -0.2704 -0.3142 0.3543, -0.2351 -0.2957 0.3543, -0.2748 -0.3101 0.3543, -0.2804 -0.3071 0.3543, -0.1957 -0.3019 0.3543, -0.1969 -0.2969 0.3543, -0.199 -0.2931 0.3543, -0.3302 -0.2931 0.3543, -0.2334 -0.3265 0.3543, -0.1837 -0.3216 0.3543, -0.228 -0.3245 0.3543, -0.2277 -0.3245 0.3543, -0.227 -0.3247 0.3543, -0.1804 -0.3133 0.3543, -0.302 -0.3081 0.3543, -0.3074 -0.3117 0.3543, -0.3308 -0.2984 0.3543, -0.3305 -0.3025 0.3543, -0.2042 -0.3389 0.3543, -0.213 -0.3408 0.3543, -0.2285 -0.3408 0.3543, -0.2299 -0.3406 0.3543, -0.2316 -0.34 0.3543, -0.2334 -0.3388 0.3543, -0.2341 -0.338 0.3543, -0.2009 -0.3181 0.3543, -0.198 -0.314 0.3543, -0.1962 -0.3093 0.3543, -0.1956 -0.3042 0.3543, -0.2961 -0.3059 0.3543, -0.2902 -0.3052 0.3543, -0.2867 -0.3054 0.3543, -0.2362 -0.3326 0.3543, -0.2361 -0.3318 0.3543, -0.2638 -0.3292 0.3543, -0.2357 -0.3298 0.3543, -0.2347 -0.328 0.3543, -0.2264 -0.3247 0.3543, -0.2146 -0.3247 0.3543, -0.2099 -0.3238 0.3543, -0.2353 -0.3363 0.3543, -0.2359 -0.3346 0.3543, -0.264 -0.3345 0.3543, -0.2638 -0.3318 0.3543, -0.2052 -0.3217 0.3543, -0.2013 -0.3185 0.3543, -0.3279 -0.2865 0.3543, -0.3301 -0.2924 0.3543, -0.2183 -0.2836 0.3543, -0.2161 -0.2836 0.3543, -0.1994 -0.2923 0.3543, -0.2025 -0.2888 0.3543, -0.2066 -0.286 0.3543, -0.2112 -0.2842 0.3543, -0.224 -0.2676 0.3543, -0.23 -0.2606 0.3543, -0.2905 -0.276 0.3543, -0.2305 -0.2601 0.3543, -0.2379 -0.255 0.3543, -0.2864 -0.2676 0.3543, -0.325 -0.2822 0.3543, -0.2927 -0.2747 0.3543, -0.2186 -0.2822 0.3543, -0.2199 -0.2761 0.3543, -0.2987 -0.2727 0.3543, -0.3044 -0.272 0.3543, -0.3071 -0.2722 0.3543, -0.2805 -0.2605 0.3543, -0.2462 -0.2518 0.3543, -0.2735 -0.2554 0.3543, -0.2552 -0.2507 0.3543, -0.2649 -0.2519 0.3543, -0.3136 -0.2737 0.3543, -0.3195 -0.2768 0.3543, -0.3244 -0.2812 0.3543, -0.1873 -0.2822 0.3543, -0.1837 -0.2872 0.3543, -0.1814 -0.2931 0.3543, -0.0092 -0.2717 0.3543, -0.0228 -0.2717 0.3543, -0.0054 -0.2819 0.3543, -0.0228 -0.2822 0.3543, -0.0001 -0.2819 0.3543, 0.3937 -0.2822 0.3543, 0.3937 -0.2445 0.3543, -0.0142 -0.2448 0.3543, -0.0228 -0.2445 0.3543, -0.0246 -0.2717 0.3543, -0.0282 -0.2819 0.3543, -0.0345 -0.2822 0.3543, -0.0335 -0.2819 0.3543, -0.0345 -0.2445 0.3543, -0.0228 -0.2538 0.3543, -0.0194 -0.2448 0.3543, -0.0779 -0.2652 0.3543, -0.0879 -0.2652 0.3543, -0.0779 -0.2776 0.3543, -0.0879 -0.2776 0.3543, -0.0692 -0.2445 0.3543, -0.0779 -0.2445 0.3543, -0.0736 -0.2448 0.3543, -0.0779 -0.2448 0.3543, -0.0736 -0.2491 0.3543, -0.0727 -0.2776 0.3543, -0.0692 -0.2822 0.3543, -0.0727 -0.2819 0.3543, -0.0779 -0.2822 0.3543, -0.0746 -0.2652 0.3543, -0.0746 -0.2609 0.3543, -0.0779 -0.2609 0.3543, -0.0779 -0.2491 0.3543, -0.0879 -0.2491 0.3543, -0.0879 -0.2609 0.3543, -0.0927 -0.2448 0.3543, -0.0948 -0.2445 0.3543, -0.0927 -0.2819 0.3543, -0.1001 -0.2457 0.3543, -0.1039 -0.2446 0.3543, -0.105 -0.2445 0.3543, -0.0779 -0.2819 0.3543, -0.1001 -0.2507 0.3543, -0.1007 -0.2807 0.3543, -0.1079 -0.2782 0.3543, -0.1037 -0.2774 0.3543, -0.1001 -0.2757 0.3543, -0.1001 -0.2803 0.3543, -0.121 -0.2718 0.3543, -0.1192 -0.2743 0.3543, -0.1185 -0.275 0.3543, -0.1161 -0.2767 0.3543, -0.1134 -0.2778 0.3543, -0.1096 -0.2782 0.3543, -0.1042 -0.249 0.3543, -0.1194 -0.2531 0.3543, -0.1005 -0.2505 0.3543, -0.1211 -0.2558 0.3543, -0.1223 -0.2591 0.3543, -0.1088 -0.2485 0.3543, -0.1102 -0.2486 0.3543, -0.1189 -0.2526 0.3543, -0.1135 -0.2492 0.3543, -0.1164 -0.2505 0.3543, -0.1228 -0.2638 0.3543, -0.1228 -0.2651 0.3543, -0.1222 -0.2688 0.3543, -0.1089 -0.2442 0.3543, -0.0948 0.0315 0.3543, -0.1087 -0.2442 0.3543, -0.1262 -0.2555 0.3543, -0.1252 -0.2532 0.3543, -0.1225 -0.2496 0.3543, -0.1216 -0.2488 0.3543, -0.1182 -0.2464 0.3543, -0.1278 -0.2621 0.3543, -0.1269 -0.2573 0.3543, -0.1284 -0.2445 0.3543, -0.1262 -0.2725 0.3543, -0.1271 -0.27 0.3543, -0.1284 -0.2822 0.3543, -0.1278 -0.264 0.3543, -0.1166 -0.2816 0.3543, -0.1201 -0.2799 0.3543, -0.1262 -0.2822 0.3543, -0.1231 -0.2774 0.3543, -0.1234 -0.2771 0.3543, -0.1256 -0.2739 0.3543, -0.1136 -0.2822 0.3543, -0.1262 -0.2931 0.3543, -0.1126 -0.2824 0.3543, -0.1103 -0.2825 0.3543, -0.0948 -0.2931 0.3543, -0.0365 -0.2695 0.3543, -0.0384 -0.2734 0.3543, -0.0411 -0.2767 0.3543, -0.0487 -0.2445 0.3543, -0.0487 -0.2457 0.3543, -0.045 -0.2471 0.3543, -0.0487 -0.2809 0.3543, -0.0487 -0.2822 0.3543, -0.0451 -0.2795 0.3543, -0.0416 -0.2771 0.3543, -0.0411 -0.2497 0.3543, -0.0399 -0.2509 0.3543, -0.0376 -0.2541 0.3543, -0.0362 -0.2577 0.3543, -0.0355 -0.2629 0.3543, -0.0356 -0.2652 0.3543, -0.0551 -0.2448 0.3543, -0.0495 -0.2454 0.3543, -0.0494 -0.2812 0.3543, -0.0555 -0.2819 0.3543, -0.0657 -0.2819 0.3543, -0.0657 -0.2448 0.3543, -0.1079 -0.3407 0.3543, -0.1135 -0.341 0.3543, -0.1032 -0.3407 0.3543, -0.0948 -0.341 0.3543, -0.1226 -0.3281 0.3543, -0.1219 -0.3206 0.3543, -0.1236 -0.3294 0.3543, -0.1242 -0.331 0.3543, -0.1079 -0.3366 0.3543, -0.108 -0.3366 0.3543, -0.1091 -0.3382 0.3543, -0.1192 -0.3409 0.3543, -0.1209 -0.3402 0.3543, -0.1262 -0.341 0.3543, -0.1236 -0.3374 0.3543, -0.1242 -0.3359 0.3543, -0.1106 -0.3396 0.3543, -0.1117 -0.3403 0.3543, -0.1219 -0.3161 0.3543, -0.121 -0.3155 0.3543, -0.1222 -0.3392 0.3543, -0.1227 -0.3388 0.3543, -0.1065 -0.3153 0.3543, -0.0967 -0.3196 0.3543, -0.1081 -0.3144 0.3543, -0.0961 -0.3181 0.3543, -0.0952 -0.3168 0.3543, -0.1212 -0.3268 0.3543, -0.1192 -0.3258 0.3543, -0.1187 -0.3185 0.3543, -0.1157 -0.3249 0.3543, -0.1116 -0.3175 0.3543, -0.1132 -0.3174 0.3543, -0.1158 -0.3176 0.3543, -0.1053 -0.3165 0.3543, -0.1043 -0.318 0.3543, -0.1036 -0.3201 0.3543, -0.1245 -0.3336 0.3543, -0.1245 -0.333 0.3543, -0.1176 -0.3142 0.3543, -0.1128 -0.3136 0.3543, -0.11 -0.3138 0.3543, -0.1079 -0.3238 0.3543, -0.108 -0.3219 0.3543, -0.1085 -0.3202 0.3543, -0.109 -0.3192 0.3543, -0.0956 -0.3255 0.3543, -0.0962 -0.3245 0.3543, -0.1032 -0.3236 0.3543, -0.0967 -0.323 0.3543, -0.0969 -0.3213 0.3543, -0.1097 -0.3185 0.3543, -0.1106 -0.3179 0.3543, -0.0948 -0.3263 0.3543, -0.0969 -0.335 0.3543, -0.0948 -0.3264 0.3543, -0.0953 -0.336 0.3543, -0.0948 -0.3362 0.3543, -0.1161 -0.3413 0.3543, -0.1171 -0.3413 0.3543, -0.1262 -0.3557 0.3543, -0.1187 -0.341 0.3543, -0.0969 -0.3397 0.3543, -0.0948 -0.3405 0.3543, -0.0937 -0.3409 0.3543, -0.0927 -0.341 0.3543, -0.0898 -0.3413 0.3543, -0.0948 -0.3557 0.3543, -0.0779 -0.3557 0.3543, -0.0803 -0.3148 0.3543, -0.0803 -0.3193 0.3543, -0.0939 -0.3157 0.3543, -0.0928 -0.315 0.3543, -0.0948 -0.3165 0.3543, -0.0793 -0.3354 0.3543, -0.0799 -0.3369 0.3543, -0.0808 -0.3381 0.3543, -0.0904 -0.3141 0.3543, -0.0866 -0.3136 0.3543, -0.0779 -0.2931 0.3543, -0.0833 -0.3139 0.3543, -0.0806 -0.3291 0.3543, -0.0805 -0.3292 0.3543, -0.0797 -0.3304 0.3543, -0.0792 -0.3318 0.3543, -0.0791 -0.3335 0.3543, -0.082 -0.3392 0.3543, -0.0834 -0.34 0.3543, -0.0871 -0.3174 0.3543, -0.0884 -0.3175 0.3543, -0.0921 -0.3209 0.3543, -0.0897 -0.3178 0.3543, -0.0907 -0.3184 0.3543, -0.0921 -0.3215 0.3543, -0.0919 -0.3223 0.3543, -0.0916 -0.3229 0.3543, -0.0911 -0.3234 0.3543, -0.0895 -0.3244 0.3543, -0.0838 -0.3178 0.3543, -0.0866 -0.3257 0.3543, -0.0812 -0.3188 0.3543, -0.0848 -0.3264 0.3543, -0.0817 -0.3281 0.3543, -0.0914 -0.319 0.3543, -0.0918 -0.3196 0.3543, -0.092 -0.3202 0.3543, -0.0924 -0.3371 0.3543, -0.0899 -0.329 0.3543, -0.0927 -0.3278 0.3543, -0.0893 -0.3375 0.3543, -0.0891 -0.3375 0.3543, -0.0868 -0.3303 0.3543, -0.0867 -0.3372 0.3543, -0.0838 -0.3339 0.3543, -0.0839 -0.3334 0.3543, -0.0855 -0.3368 0.3543, -0.0851 -0.3365 0.3543, -0.0846 -0.3361 0.3543, -0.0842 -0.3355 0.3543, -0.0839 -0.3348 0.3543, -0.0841 -0.3326 0.3543, -0.0844 -0.332 0.3543, -0.085 -0.3314 0.3543, -0.056 -0.3142 0.3543, -0.0512 -0.3142 0.3543, -0.0487 -0.2931 0.3543, -0.0645 -0.3341 0.3543, -0.064 -0.3363 0.3543, -0.0638 -0.3363 0.3543, -0.0692 -0.2931 0.3543, -0.0692 -0.3206 0.3543, -0.0633 -0.3341 0.3543, -0.0636 -0.3354 0.3543, -0.0692 -0.3331 0.3543, -0.0766 -0.3142 0.3543, -0.0715 -0.3142 0.3543, -0.0664 -0.341 0.3543, -0.0663 -0.3406 0.3543, -0.0692 -0.3471 0.3543, -0.0692 -0.347 0.3543, -0.0692 -0.341 0.3543, -0.0683 -0.3454 0.3543, -0.0757 -0.3486 0.3543, -0.0757 -0.3528 0.3543, -0.0746 -0.349 0.3543, -0.0731 -0.3492 0.3543, -0.072 -0.3491 0.3543, -0.071 -0.353 0.3543, -0.0727 -0.3531 0.3543, -0.0743 -0.3531 0.3543, -0.071 -0.3487 0.3543, -0.07 -0.348 0.3543, -0.0675 -0.3512 0.3543, -0.0487 -0.3557 0.3543, -0.0666 -0.3504 0.3543, -0.0618 -0.341 0.3543, -0.0632 -0.3447 0.3543, -0.0646 -0.3475 0.3543, -0.0345 -0.324 0.3543, -0.0414 -0.324 0.3543, -0.0345 -0.3365 0.3543, -0.0414 -0.3365 0.3543, -0.0263 -0.3365 0.3543, -0.0263 -0.3407 0.3543, -0.0228 -0.341 0.3543, -0.0345 -0.341 0.3543, -0.0228 -0.2931 0.3543, -0.0271 -0.3036 0.3543, -0.0271 -0.3079 0.3543, -0.0282 -0.324 0.3543, -0.0282 -0.3197 0.3543, -0.0345 -0.3079 0.3543, -0.0345 -0.3197 0.3543, -0.0414 -0.3079 0.3543, -0.0414 -0.3197 0.3543, -0.0345 -0.3407 0.3543, -0.0462 -0.3407 0.3543, -0.0487 -0.341 0.3543, -0.0462 -0.3036 0.3543, -0.0345 -0.3036 0.3543, -0.0345 -0.2931 0.3543, -0.1641 0.3937 0.3543, -0.1284 0.3937 0.3543, -0.1262 0.3937 0.3543, -0.0948 0.3937 0.3543, -0.0779 0.0315 0.3543, -0.0779 0.3937 0.3543, -0.0692 0.0315 0.3543, -0.0692 0.3937 0.3543, -0.0487 0.0315 0.3543, -0.0487 0.3937 0.3543, -0.0345 0.0315 0.3543, -0.0345 0.3937 0.3543, -0.0228 0.0315 0.3543, -0.0228 0.3937 0.3543, 0.3937 0.0315 0.3543, 0.3937 0.3937 0.3543, -0.3122 0.3005 0.3543, -0.3169 0.2985 0.3543, -0.322 0.2979 0.3543, -0.327 0.2985 0.3543, -0.3031 0.3123 0.3543, -0.3051 0.3076 0.3543, -0.3082 0.3036 0.3543, -0.3318 0.3005 0.3543, -0.3358 0.3036 0.3543, -0.3389 0.3076 0.3543, -0.3409 0.3123 0.3543, -0.3415 0.3174 0.3543, -0.3445 0.3937 0.3543, -0.3409 0.3225 0.3543, -0.3389 0.3272 0.3543, -0.3082 0.3312 0.3543, -0.3051 0.3272 0.3543, -0.3031 0.3225 0.3543, -0.3024 0.3174 0.3543, -0.3358 0.3312 0.3543, -0.3318 0.3343 0.3543, -0.327 0.3363 0.3543, -0.322 0.3369 0.3543, -0.3169 0.3363 0.3543, -0.3122 0.3343 0.3543, -0.1293 -0.2776 0.3543, -0.1293 -0.2819 0.3543, -0.1489 -0.2819 0.3543, -0.1489 -0.2448 0.3543, -0.1441 -0.2448 0.3543, -0.1441 -0.2776 0.3543, -0.3937 0.3937 0.3543, -0.3937 0.0315 0.3543, -0.3937 -0.2445 0.3543, -0.1284 -0.2931 0.3543, -0.0193 -0.3407 0.3543, -0.0193 -0.3036 0.3543, -0.0091 -0.3407 0.3543, 0.041 -0.3407 0.3543, 0.0463 -0.3407 0.3543, 0.3937 -0.341 0.3543, 0.0322 -0.3036 0.3543, 0.3937 -0.2931 0.3543, 0.0271 -0.3036 0.3543, 0.0102 -0.3165 0.3543, 0.0109 -0.3217 0.3543, 0.0108 -0.324 0.3543, 0.0129 -0.3407 0.3543, 0.0099 -0.3283 0.3543, 0.0081 -0.3322 0.3543, 0.0053 -0.3355 0.3543, -0.003 -0.34 0.3543, 0.0182 -0.3407 0.3543, 0.0218 -0.3305 0.3543, 0.0372 -0.3305 0.3543, 0.0049 -0.3359 0.3543, 0.0013 -0.3383 0.3543, 0.0053 -0.3085 0.3543, 0.0066 -0.3097 0.3543, 0.0089 -0.313 0.3543, -0.0087 -0.3036 0.3543, -0.0031 -0.3042 0.3543, 0.0014 -0.3059 0.3543, -0.1284 -0.341 0.3543, -0.1489 -0.3407 0.3543, -0.129 -0.3407 0.3543, -0.129 -0.3365 0.3543, -0.1298 -0.3079 0.3543, -0.1489 -0.3036 0.3543, -0.1298 -0.3036 0.3543, -0.1441 -0.324 0.3543, -0.1441 -0.3365 0.3543, -0.1308 -0.324 0.3543, -0.1308 -0.3197 0.3543, -0.1441 -0.3197 0.3543, -0.1441 -0.3079 0.3543, -0.0345 -0.3557 0.3543, -0.0228 -0.3557 0.3543, 0.3937 -0.3557 0.3543, -0.1284 -0.3557 0.3543, -0.1284 -0.3937 0.3543, -0.1262 -0.3937 0.3543, -0.0948 -0.3937 0.3543, -0.0779 -0.3937 0.3543, -0.0692 -0.3937 0.3543, -0.0487 -0.3937 0.3543, -0.0345 -0.3937 0.3543, -0.0228 -0.3937 0.3543, 0.3937 -0.3937 0.3543, -0.3937 -0.3557 0.3543, -0.3937 -0.3937 0.3543, 0.3937 -0.1969 0.0787, 0.3937 -0.1969 0.0, 0.3937 -0.0591 0.0, 0.3937 -0.0591 0.0787, 0.3937 0.0591 0.0787, 0.3937 -0.315 0.0787, 0.3937 -0.3937 0.0, 0.3937 -0.315 0.0, 0.3937 0.315 0.0, 0.3937 0.3937 0.0, 0.3937 0.315 0.0787, 0.3937 0.1969 0.0787, 0.3937 0.1969 0.0, 0.3937 0.0591 0.0, -0.3937 0.3937 0.0, -0.3937 0.1969 0.0787, -0.3937 0.1969 0.0, -0.3937 0.0591 0.0, -0.3937 -0.0591 0.0, -0.3937 -0.1969 0.0, -0.3937 -0.0591 0.0787, -0.3937 -0.1969 0.0787, -0.3937 0.0591 0.0787, -0.3937 0.315 0.0787, -0.3937 0.315 0.0, -0.3937 -0.315 0.0, -0.3937 -0.3937 0.0, -0.3937 -0.315 0.0787, -0.2008 0.1969 0.0, 0.1811 -0.1969 0.0, 0.1767 -0.1973 0.0, -0.1767 -0.3145 0.0, -0.1811 -0.315 0.0, 0.1767 0.3145 0.0, 0.1811 0.315 0.0, 0.1657 -0.3075 0.0, 0.1688 -0.3107 0.0, 0.1619 -0.0438 0.0, 0.1634 -0.0479 0.0, 0.1688 -0.0548 0.0, 0.1726 -0.0571 0.0, 0.1726 -0.313 0.0, 0.1767 -0.3145 0.0, 0.1811 -0.315 0.0, -0.1767 -0.1973 0.0, -0.1726 -0.0571 0.0, -0.1726 -0.1988 0.0, -0.1688 -0.0548 0.0, -0.1657 -0.0516 0.0, 0.1688 0.2011 0.0, 0.1767 0.0586 0.0, 0.1726 0.0571 0.0, -0.1634 0.0479 0.0, -0.1657 0.0516 0.0, -0.1688 0.0548 0.0, -0.1726 0.0571 0.0, -0.1811 0.0591 0.0, -0.1767 0.0586 0.0, -0.1634 -0.0479 0.0, -0.1619 -0.0438 0.0, -0.1614 -0.0394 0.0, 0.1657 -0.0516 0.0, 0.1688 0.0548 0.0, 0.1657 0.0516 0.0, 0.1634 0.0479 0.0, 0.1726 -0.1988 0.0, 0.1688 -0.2011 0.0, 0.1657 -0.2043 0.0, -0.1619 0.0438 0.0, -0.2598 0.315 0.0, -0.2008 0.2559 0.0, 0.1726 0.313 0.0, 0.1688 0.3107 0.0, 0.1657 0.3075 0.0, 0.1634 0.3038 0.0, 0.1811 -0.0591 0.0, 0.1767 -0.0586 0.0, 0.1811 0.1969 0.0, 0.1811 0.0591 0.0, 0.1767 0.1973 0.0, 0.1726 0.1988 0.0, -0.1811 -0.1969 0.0, -0.1811 -0.0591 0.0, -0.1767 -0.0586 0.0, 0.1634 -0.3038 0.0, -0.1726 -0.313 0.0, -0.1688 -0.3107 0.0, 0.1634 -0.208 0.0, -0.1614 0.0394 0.0, 0.1619 -0.2122 0.0, -0.1634 -0.208 0.0, -0.1657 -0.2043 0.0, -0.1688 -0.2011 0.0, 0.1619 0.2122 0.0, 0.1634 0.208 0.0, 0.1657 0.2043 0.0, 0.1619 0.2997 0.0, 0.1614 0.2953 0.0, 0.1614 0.2165 0.0, 0.1619 0.0438 0.0, 0.1614 0.0394 0.0, 0.1614 -0.0394 0.0, -0.1657 -0.3075 0.0, -0.1634 -0.3038 0.0, 0.1619 -0.2997 0.0, -0.1619 -0.2997 0.0, 0.1614 -0.2953 0.0, -0.1614 -0.2953 0.0, 0.1614 -0.2165 0.0, -0.1614 -0.2165 0.0, -0.1619 -0.2122 0.0, -0.1619 -0.2122 0.0
			]
		}
		coordIndex [
			0,1,2,-1,3,4,5,-1,6,7,8,-1,9,10,0,-1,11,12,13,-1,14,15,16,-1,17,18,19,-1,19,18,20,-1,21,22,19,-1,19,22,23,-1,19,23,24,-1,24,25,19,-1,19,25,26,-1,19,26,17,-1,27,28,29,-1,29,28,30,-1,29,30,31,-1,31,30,32,-1,33,34,35,-1,36,37,38,-1,38,37,39,-1,38,39,33,-1,33,39,40,-1,33,40,41,-1,32,30,42,-1,42,30,33,-1,42,33,43,-1,43,33,35,-1,43,35,44,-1,44,35,45,-1,44,45,46,-1,41,47,33,-1,33,47,48,-1,33,48,34,-1,16,15,49,-1,50,51,52,-1,52,51,16,-1,16,51,53,-1,16,53,14,-1,54,55,56,-1,57,58,54,-1,54,58,59,-1,54,59,55,-1,60,61,62,-1,62,63,60,-1,60,63,64,-1,60,64,54,-1,54,64,65,-1,54,65,57,-1,61,60,66,-1,66,60,67,-1,66,67,68,-1,69,70,71,-1,71,70,67,-1,67,70,72,-1,67,72,68,-1,73,74,75,-1,75,74,76,-1,76,77,75,-1,75,77,78,-1,75,78,69,-1,79,80,81,-1,82,83,84,-1,85,86,87,-1,88,89,90,-1,90,89,91,-1,90,91,92,-1,93,94,95,-1,95,94,96,-1,97,98,94,-1,94,98,99,-1,94,99,100,-1,82,84,101,-1,85,87,102,-1,83,103,84,-1,84,103,104,-1,84,104,105,-1,81,80,87,-1,87,80,106,-1,87,106,102,-1,107,100,108,-1,108,100,109,-1,108,109,90,-1,90,109,110,-1,90,110,88,-1,86,111,87,-1,87,111,112,-1,87,112,73,-1,73,112,113,-1,73,113,114,-1,114,115,73,-1,73,115,116,-1,73,116,117,-1,118,119,84,-1,84,119,120,-1,84,120,94,-1,94,120,121,-1,94,121,97,-1,107,122,100,-1,100,122,123,-1,100,123,94,-1,94,123,124,-1,94,124,96,-1,125,126,127,-1,127,126,128,-1,127,128,84,-1,84,128,129,-1,84,129,101,-1,105,130,84,-1,84,130,131,-1,84,131,132,-1,117,133,73,-1,73,133,134,-1,73,134,135,-1,135,134,125,-1,135,125,136,-1,136,125,127,-1,132,137,84,-1,84,137,138,-1,84,138,118,-1,139,140,141,-1,140,100,141,-1,141,100,99,-1,141,99,142,-1,142,99,143,-1,143,144,142,-1,142,144,145,-1,142,145,146,-1,147,148,149,-1,148,150,149,-1,149,150,151,-1,149,151,152,-1,153,149,154,-1,139,141,153,-1,153,141,155,-1,153,155,149,-1,149,155,156,-1,149,156,147,-1,154,157,153,-1,153,157,158,-1,153,158,159,-1,152,151,160,-1,160,151,161,-1,160,161,162,-1,162,161,163,-1,162,163,164,-1,165,166,159,-1,159,166,167,-1,159,167,153,-1,18,168,20,-1,20,168,169,-1,20,169,81,-1,81,169,170,-1,81,170,79,-1,171,172,173,-1,173,172,174,-1,173,174,175,-1,176,177,178,-1,178,177,179,-1,172,180,174,-1,174,180,181,-1,174,181,182,-1,182,181,183,-1,182,183,184,-1,184,183,185,-1,184,185,179,-1,179,185,186,-1,179,186,178,-1,187,188,189,-1,189,188,190,-1,191,192,193,-1,193,192,194,-1,193,195,191,-1,191,195,196,-1,191,196,197,-1,197,196,198,-1,197,198,199,-1,187,189,200,-1,200,189,196,-1,200,196,201,-1,201,196,195,-1,201,195,202,-1,195,203,202,-1,202,203,204,-1,202,204,205,-1,194,192,206,-1,206,192,207,-1,206,207,208,-1,209,207,210,-1,210,207,211,-1,198,212,199,-1,199,212,208,-1,199,208,13,-1,13,208,207,-1,13,207,213,-1,213,207,209,-1,11,13,214,-1,215,216,213,-1,213,216,217,-1,213,217,13,-1,13,217,218,-1,13,218,214,-1,219,220,213,-1,213,220,221,-1,213,221,222,-1,222,223,213,-1,213,223,224,-1,213,224,215,-1,225,226,227,-1,227,226,228,-1,227,228,229,-1,225,230,226,-1,226,230,231,-1,226,231,232,-1,232,231,233,-1,232,233,234,-1,229,235,227,-1,227,235,236,-1,227,236,213,-1,213,236,237,-1,213,237,219,-1,0,10,1,-1,1,10,238,-1,1,238,239,-1,239,238,240,-1,239,240,211,-1,241,242,0,-1,0,242,243,-1,243,244,0,-1,0,244,245,-1,0,245,9,-1,246,247,248,-1,249,250,251,-1,251,250,252,-1,246,248,252,-1,253,254,255,-1,254,256,255,-1,255,256,257,-1,255,257,258,-1,253,255,259,-1,259,255,260,-1,259,260,261,-1,261,260,262,-1,262,260,263,-1,262,263,12,-1,264,265,182,-1,182,265,266,-1,267,268,184,-1,184,268,269,-1,270,271,272,-1,272,271,182,-1,272,182,273,-1,273,182,266,-1,269,274,184,-1,184,274,275,-1,184,275,276,-1,276,277,184,-1,184,277,278,-1,184,278,182,-1,182,278,279,-1,182,279,264,-1,191,280,267,-1,267,280,281,-1,267,281,268,-1,270,282,271,-1,271,282,283,-1,271,283,197,-1,197,283,284,-1,197,284,191,-1,191,284,285,-1,191,285,280,-1,286,287,288,-1,288,287,289,-1,290,291,292,-1,292,291,293,-1,294,295,286,-1,286,295,296,-1,297,298,299,-1,299,300,301,-1,296,302,286,-1,286,302,303,-1,286,303,287,-1,260,304,305,-1,298,306,299,-1,299,306,307,-1,299,307,300,-1,308,309,310,-1,310,309,311,-1,310,311,312,-1,290,313,291,-1,291,313,314,-1,291,314,315,-1,315,314,316,-1,317,318,316,-1,316,318,319,-1,316,319,315,-1,308,320,309,-1,309,320,321,-1,309,321,322,-1,301,323,299,-1,299,323,324,-1,299,324,260,-1,260,324,293,-1,260,293,304,-1,304,293,291,-1,305,325,260,-1,260,325,326,-1,260,326,327,-1,328,329,316,-1,316,329,330,-1,316,330,331,-1,332,333,334,-1,334,333,335,-1,334,335,322,-1,322,335,336,-1,322,336,309,-1,331,337,316,-1,316,337,338,-1,316,338,317,-1,339,340,341,-1,341,340,342,-1,341,342,343,-1,344,345,346,-1,346,345,347,-1,339,332,340,-1,340,332,334,-1,340,334,348,-1,348,334,288,-1,348,288,349,-1,349,288,289,-1,349,289,350,-1,350,289,351,-1,352,351,353,-1,353,351,289,-1,353,289,346,-1,346,289,287,-1,346,287,344,-1,352,353,7,-1,7,353,354,-1,7,354,8,-1,355,356,8,-1,357,358,263,-1,327,310,260,-1,260,310,312,-1,260,312,263,-1,263,312,359,-1,263,359,357,-1,360,361,8,-1,8,361,362,-1,358,363,263,-1,263,363,364,-1,263,364,365,-1,365,364,366,-1,365,366,355,-1,356,367,368,-1,368,369,356,-1,356,369,370,-1,356,370,8,-1,8,370,371,-1,8,371,360,-1,362,372,8,-1,8,372,373,-1,8,373,6,-1,374,375,376,-1,376,375,377,-1,376,377,378,-1,376,379,374,-1,374,379,380,-1,374,380,381,-1,381,382,374,-1,374,382,383,-1,374,383,384,-1,384,383,385,-1,384,385,386,-1,386,385,387,-1,386,387,356,-1,356,387,388,-1,356,388,367,-1,389,390,378,-1,378,390,391,-1,378,391,376,-1,392,393,343,-1,343,393,394,-1,343,394,341,-1,392,395,393,-1,393,395,396,-1,393,396,397,-1,397,396,398,-1,397,399,400,-1,398,401,397,-1,397,401,402,-1,397,402,403,-1,403,404,397,-1,397,404,405,-1,397,405,399,-1,400,406,397,-1,397,406,407,-1,397,407,408,-1,409,410,411,-1,412,413,414,-1,411,415,409,-1,409,415,416,-1,409,416,417,-1,417,416,412,-1,417,412,418,-1,418,412,414,-1,419,420,8,-1,355,8,365,-1,365,8,420,-1,365,420,415,-1,415,420,421,-1,415,421,416,-1,422,423,419,-1,424,425,426,-1,426,425,427,-1,426,427,422,-1,422,419,426,-1,426,419,8,-1,426,8,428,-1,428,8,354,-1,428,354,429,-1,428,430,426,-1,426,430,431,-1,426,431,432,-1,4,433,5,-1,5,433,434,-1,5,434,354,-1,354,434,435,-1,354,435,429,-1,432,436,426,-1,426,436,437,-1,426,437,424,-1,3,5,438,-1,438,5,439,-1,438,439,440,-1,441,442,439,-1,439,442,443,-1,439,443,440,-1,444,445,446,-1,446,445,447,-1,448,449,450,-1,450,449,451,-1,452,453,454,-1,444,446,455,-1,455,446,448,-1,455,448,456,-1,454,457,458,-1,458,457,459,-1,458,459,460,-1,449,461,451,-1,451,461,462,-1,451,462,463,-1,463,462,464,-1,453,452,465,-1,465,452,466,-1,465,466,464,-1,464,466,411,-1,464,411,463,-1,463,411,410,-1,463,410,441,-1,467,2,468,-1,468,2,1,-1,468,1,469,-1,469,1,239,-1,469,239,470,-1,470,239,471,-1,470,471,472,-1,472,471,473,-1,472,473,474,-1,474,473,475,-1,474,475,476,-1,476,475,477,-1,476,477,478,-1,478,477,479,-1,478,479,480,-1,480,479,481,-1,480,481,482,-1,483,484,28,-1,28,484,30,-1,30,484,485,-1,30,485,486,-1,487,488,28,-1,28,488,489,-1,28,489,483,-1,486,490,30,-1,30,490,491,-1,30,491,492,-1,492,493,30,-1,30,493,494,-1,30,494,495,-1,495,494,496,-1,495,496,497,-1,498,499,467,-1,467,499,500,-1,467,500,501,-1,497,502,495,-1,495,502,503,-1,495,503,504,-1,504,505,495,-1,495,505,506,-1,495,506,467,-1,467,506,507,-1,467,507,498,-1,211,207,239,-1,239,207,192,-1,239,192,471,-1,471,192,191,-1,471,191,473,-1,473,191,267,-1,473,267,475,-1,475,267,184,-1,475,184,477,-1,477,184,179,-1,477,179,479,-1,479,179,177,-1,479,177,481,-1,501,487,467,-1,467,487,28,-1,467,28,2,-1,2,28,248,-1,2,248,0,-1,0,248,247,-1,0,247,241,-1,252,248,251,-1,251,248,508,-1,251,508,509,-1,20,510,19,-1,19,510,511,-1,19,511,512,-1,513,508,512,-1,512,508,248,-1,512,248,19,-1,19,248,28,-1,19,28,21,-1,21,28,27,-1,495,514,30,-1,30,514,515,-1,30,515,33,-1,33,515,516,-1,33,516,38,-1,38,516,49,-1,38,49,36,-1,36,49,15,-1,12,263,13,-1,13,263,365,-1,13,365,199,-1,199,365,415,-1,199,415,197,-1,197,415,411,-1,197,411,271,-1,271,411,466,-1,271,466,182,-1,182,466,452,-1,182,452,174,-1,509,510,251,-1,251,510,20,-1,251,20,517,-1,517,20,81,-1,518,519,452,-1,520,518,450,-1,450,518,452,-1,450,452,448,-1,448,452,454,-1,448,454,456,-1,456,454,458,-1,521,450,522,-1,522,450,523,-1,522,523,524,-1,524,523,525,-1,178,175,176,-1,176,175,174,-1,176,174,525,-1,525,174,452,-1,525,452,524,-1,524,452,526,-1,527,528,526,-1,526,528,529,-1,526,529,530,-1,529,531,530,-1,530,531,532,-1,530,532,533,-1,534,520,530,-1,530,520,450,-1,530,450,535,-1,535,450,521,-1,535,521,536,-1,536,521,537,-1,533,538,530,-1,530,538,539,-1,530,539,534,-1,540,541,526,-1,526,541,542,-1,526,542,527,-1,519,543,452,-1,452,543,544,-1,452,544,526,-1,526,544,545,-1,526,545,540,-1,258,249,255,-1,255,249,251,-1,255,251,260,-1,260,251,517,-1,260,517,299,-1,299,517,546,-1,87,546,547,-1,547,546,548,-1,548,546,549,-1,549,546,517,-1,549,517,550,-1,87,547,81,-1,81,547,551,-1,81,551,517,-1,517,551,552,-1,517,552,550,-1,553,554,555,-1,555,554,549,-1,555,549,556,-1,556,549,550,-1,556,550,557,-1,557,550,558,-1,441,439,463,-1,463,439,559,-1,463,559,451,-1,451,559,560,-1,451,560,450,-1,450,560,561,-1,450,561,523,-1,73,75,87,-1,87,75,562,-1,87,562,546,-1,546,562,346,-1,546,346,299,-1,299,346,347,-1,299,347,297,-1,69,71,75,-1,75,71,563,-1,75,563,562,-1,562,563,564,-1,562,564,346,-1,346,564,565,-1,346,565,353,-1,353,565,566,-1,353,566,354,-1,354,566,567,-1,354,567,5,-1,5,567,568,-1,5,568,439,-1,439,568,569,-1,439,569,559,-1,559,569,570,-1,559,570,560,-1,560,570,571,-1,560,571,561,-1,56,50,54,-1,54,50,52,-1,54,52,60,-1,60,52,572,-1,60,572,67,-1,67,572,573,-1,574,575,576,-1,571,577,482,-1,482,577,578,-1,576,577,574,-1,574,577,571,-1,574,571,579,-1,579,571,580,-1,579,580,581,-1,582,583,584,-1,584,583,482,-1,584,482,585,-1,585,482,578,-1,585,578,586,-1,586,578,587,-1,514,482,588,-1,588,482,583,-1,589,590,591,-1,592,593,594,-1,594,593,595,-1,591,596,589,-1,589,596,514,-1,589,514,597,-1,597,514,588,-1,597,588,598,-1,599,600,601,-1,601,600,573,-1,601,573,595,-1,595,573,514,-1,595,514,594,-1,594,514,596,-1,571,573,580,-1,580,573,600,-1,602,603,604,-1,605,580,606,-1,606,580,600,-1,606,600,599,-1,607,583,608,-1,608,583,582,-1,609,610,605,-1,611,612,602,-1,603,613,614,-1,610,615,605,-1,605,615,616,-1,605,616,580,-1,580,616,617,-1,580,617,581,-1,618,619,620,-1,620,619,621,-1,620,621,622,-1,623,624,625,-1,626,627,602,-1,602,627,628,-1,602,628,629,-1,591,590,630,-1,630,590,602,-1,630,602,631,-1,631,602,629,-1,622,632,620,-1,620,632,633,-1,620,633,634,-1,602,612,603,-1,603,612,635,-1,603,635,613,-1,625,636,623,-1,623,636,637,-1,623,637,638,-1,604,639,602,-1,602,639,640,-1,602,640,626,-1,626,640,641,-1,626,641,642,-1,598,588,643,-1,643,588,583,-1,643,583,644,-1,644,583,607,-1,644,607,645,-1,645,646,644,-1,644,646,647,-1,644,647,648,-1,576,575,649,-1,649,575,603,-1,649,603,650,-1,650,603,614,-1,586,587,651,-1,651,587,652,-1,651,652,653,-1,653,652,624,-1,653,624,654,-1,654,624,623,-1,593,592,655,-1,655,592,656,-1,655,656,618,-1,618,656,657,-1,618,657,619,-1,609,605,658,-1,658,605,659,-1,658,659,660,-1,661,634,641,-1,641,634,662,-1,641,662,642,-1,663,664,661,-1,661,664,665,-1,661,665,634,-1,634,665,666,-1,634,666,620,-1,667,668,602,-1,602,668,669,-1,602,669,623,-1,648,670,644,-1,644,670,671,-1,644,671,602,-1,602,671,672,-1,602,672,667,-1,638,673,623,-1,623,673,674,-1,623,674,602,-1,602,674,675,-1,602,675,611,-1,660,676,658,-1,658,676,677,-1,658,677,678,-1,678,677,679,-1,678,679,680,-1,680,679,681,-1,680,681,682,-1,682,681,683,-1,682,683,663,-1,663,683,684,-1,663,684,664,-1,
		]
	}
}
Shape{
	appearance Appearance {
		material  Material 	{ 
			diffuseColor 0.6666666666666666 0.6980392156862745 0.7686274509803922 
			specularColor 0.3333333333333333 0.34901960784313724 0.3843137254901961
			ambientIntensity 0.2
			transparency 0.0
			shininess 0.5
		}
	}
	geometry IndexedFaceSet {
		ccw TRUE 
		solid FALSE
		coord DEF co Coordinate {
			point [
				0.3976 0.1969 0.0787, 0.3976 0.315 0.0787, 0.3937 0.1969 0.0787, 0.3937 0.315 0.0787, 0.3937 0.315 0.0, 0.3976 0.315 -0.0039, 0.1811 0.315 0.0, 0.1811 0.315 -0.0039, 0.1767 0.3145 -0.0039, 0.1767 0.3145 0.0, 0.1726 0.313 -0.0039, 0.1726 0.313 0.0, 0.1688 0.3107 -0.0039, 0.1688 0.3107 0.0, 0.1657 0.3075 -0.0039, 0.1657 0.3075 0.0, 0.1634 0.3038 -0.0039, 0.1634 0.3038 0.0, 0.1619 0.2997 -0.0039, 0.1619 0.2997 0.0, 0.1614 0.2953 -0.0039, 0.1614 0.2953 0.0, 0.1614 0.2165 -0.0039, 0.1614 0.2165 0.0, 0.1619 0.2122 -0.0039, 0.1619 0.2122 0.0, 0.1634 0.208 -0.0039, 0.1634 0.208 0.0, 0.1657 0.2043 -0.0039, 0.1657 0.2043 0.0, 0.1688 0.2011 -0.0039, 0.1688 0.2011 0.0, 0.1726 0.1988 -0.0039, 0.1726 0.1988 0.0, 0.1767 0.1973 -0.0039, 0.1767 0.1973 0.0, 0.1811 0.1969 -0.0039, 0.1811 0.1969 0.0, 0.3937 0.1969 0.0, 0.3976 0.1969 -0.0039, -0.3937 0.315 0.0787, -0.3976 0.315 0.0787, -0.3937 0.1969 0.0787, -0.3976 0.1969 0.0787, -0.2598 0.315 0.0, -0.2598 0.315 -0.0039, -0.3937 0.315 0.0, -0.3976 0.315 -0.0039, -0.3937 0.1969 0.0, -0.3976 0.1969 -0.0039, -0.2008 0.1969 0.0, -0.2008 0.1969 -0.0039, -0.2008 0.2559 -0.0039, 0.3976 -0.0591 0.0787, 0.3976 0.0591 0.0787, 0.3937 -0.0591 0.0787, 0.3937 0.0591 0.0787, 0.3937 0.0591 0.0, 0.3976 0.0591 -0.0039, 0.1811 0.0591 0.0, 0.1811 0.0591 -0.0039, 0.1767 0.0586 -0.0039, 0.1767 0.0586 0.0, 0.1726 0.0571 -0.0039, 0.1726 0.0571 0.0, 0.1688 0.0548 -0.0039, 0.1688 0.0548 0.0, 0.1657 0.0516 -0.0039, 0.1657 0.0516 0.0, 0.1634 0.0479 -0.0039, 0.1634 0.0479 0.0, 0.1619 0.0438 -0.0039, 0.1619 0.0438 0.0, 0.1614 0.0394 -0.0039, 0.1614 0.0394 0.0, 0.1614 -0.0394 -0.0039, 0.1614 -0.0394 0.0, 0.1619 -0.0438 -0.0039, 0.1619 -0.0438 0.0, 0.1634 -0.0479 -0.0039, 0.1634 -0.0479 0.0, 0.1657 -0.0516 -0.0039, 0.1657 -0.0516 0.0, 0.1688 -0.0548 -0.0039, 0.1688 -0.0548 0.0, 0.1726 -0.0571 -0.0039, 0.1726 -0.0571 0.0, 0.1767 -0.0586 -0.0039, 0.1767 -0.0586 0.0, 0.1811 -0.0591 -0.0039, 0.1811 -0.0591 0.0, 0.3937 -0.0591 0.0, 0.3976 -0.0591 -0.0039, -0.3937 0.0591 0.0787, -0.3976 0.0591 0.0787, -0.3937 -0.0591 0.0787, -0.3976 -0.0591 0.0787, -0.1811 0.0591 0.0, -0.1811 0.0591 -0.0039, -0.3937 0.0591 0.0, -0.3976 0.0591 -0.0039, -0.3937 -0.0591 0.0, -0.3976 -0.0591 -0.0039, -0.1811 -0.0591 0.0, -0.1811 -0.0591 -0.0039, -0.1767 -0.0586 -0.0039, -0.1767 -0.0586 0.0, -0.1726 -0.0571 -0.0039, -0.1726 -0.0571 0.0, -0.1688 -0.0548 -0.0039, -0.1688 -0.0548 0.0, -0.1657 -0.0516 -0.0039, -0.1657 -0.0516 0.0, -0.1634 -0.0479 -0.0039, -0.1634 -0.0479 0.0, -0.1619 -0.0438 -0.0039, -0.1619 -0.0438 0.0, -0.1614 -0.0394 -0.0039, -0.1614 -0.0394 0.0, -0.1614 0.0394 -0.0039, -0.1614 0.0394 0.0, -0.1619 0.0438 -0.0039, -0.1619 0.0438 0.0, -0.1634 0.0479 -0.0039, -0.1634 0.0479 0.0, -0.1657 0.0516 -0.0039, -0.1657 0.0516 0.0, -0.1688 0.0548 -0.0039, -0.1688 0.0548 0.0, -0.1726 0.0571 -0.0039, -0.1726 0.0571 0.0, -0.1767 0.0586 -0.0039, -0.1767 0.0586 0.0, 0.3976 -0.315 0.0787, 0.3976 -0.1969 0.0787, 0.3937 -0.315 0.0787, 0.3937 -0.1969 0.0787, 0.3937 -0.1969 0.0, 0.3976 -0.1969 -0.0039, 0.1811 -0.1969 0.0, 0.1811 -0.1969 -0.0039, 0.1767 -0.1973 -0.0039, 0.1767 -0.1973 0.0, 0.1726 -0.1988 -0.0039, 0.1726 -0.1988 0.0, 0.1688 -0.2011 -0.0039, 0.1688 -0.2011 0.0, 0.1657 -0.2043 -0.0039, 0.1657 -0.2043 0.0, 0.1634 -0.208 -0.0039, 0.1634 -0.208 0.0, 0.1619 -0.2122 -0.0039, 0.1619 -0.2122 0.0, 0.1614 -0.2165 -0.0039, 0.1614 -0.2165 0.0, 0.1614 -0.2953 -0.0039, 0.1614 -0.2953 0.0, 0.1619 -0.2997 -0.0039, 0.1619 -0.2997 0.0, 0.1634 -0.3038 -0.0039, 0.1634 -0.3038 0.0, 0.1657 -0.3075 -0.0039, 0.1657 -0.3075 0.0, 0.1688 -0.3107 -0.0039, 0.1688 -0.3107 0.0, 0.1726 -0.313 -0.0039, 0.1726 -0.313 0.0, 0.1767 -0.3145 -0.0039, 0.1767 -0.3145 0.0, 0.1811 -0.315 -0.0039, 0.1811 -0.315 0.0, 0.3937 -0.315 0.0, 0.3976 -0.315 -0.0039, -0.3937 -0.1969 0.0787, -0.3976 -0.1969 0.0787, -0.3937 -0.315 0.0787, -0.3976 -0.315 0.0787, -0.1811 -0.1969 0.0, -0.1811 -0.1969 -0.0039, -0.3937 -0.1969 0.0, -0.3976 -0.1969 -0.0039, -0.3937 -0.315 0.0, -0.3976 -0.315 -0.0039, -0.1811 -0.315 0.0, -0.1811 -0.315 -0.0039, -0.1767 -0.3145 -0.0039, -0.1767 -0.3145 0.0, -0.1726 -0.313 -0.0039, -0.1726 -0.313 0.0, -0.1688 -0.3107 -0.0039, -0.1688 -0.3107 0.0, -0.1657 -0.3075 -0.0039, -0.1657 -0.3075 0.0, -0.1634 -0.3038 -0.0039, -0.1634 -0.3038 0.0, -0.1619 -0.2997 -0.0039, -0.1619 -0.2997 0.0, -0.1614 -0.2953 -0.0039, -0.1614 -0.2953 0.0, -0.1614 -0.2165 -0.0039, -0.1614 -0.2165 0.0, -0.1619 -0.2122 -0.0039, -0.1619 -0.2122 0.0, -0.1634 -0.208 -0.0039, -0.1634 -0.208 0.0, -0.1657 -0.2043 -0.0039, -0.1657 -0.2043 0.0, -0.1688 -0.2011 -0.0039, -0.1688 -0.2011 0.0, -0.1726 -0.1988 -0.0039, -0.1726 -0.1988 0.0, -0.1767 -0.1973 -0.0039, -0.1767 -0.1973 0.0, -0.2008 0.2559 0.0, -0.2008 0.2559 0.0
			]
		}
		coordIndex [
			0,1,2,-1,2,1,3,-1,3,1,4,-1,4,1,5,-1,4,5,6,-1,6,5,7,-1,6,7,8,-1,6,8,9,-1,9,8,10,-1,9,10,11,-1,11,10,12,-1,11,12,13,-1,13,12,14,-1,13,14,15,-1,15,14,16,-1,15,16,17,-1,17,16,18,-1,17,18,19,-1,19,18,20,-1,19,20,21,-1,20,22,21,-1,21,22,23,-1,23,22,24,-1,23,24,25,-1,25,24,26,-1,25,26,27,-1,27,26,28,-1,27,28,29,-1,29,28,30,-1,29,30,31,-1,31,30,32,-1,31,32,33,-1,33,32,34,-1,33,34,35,-1,35,34,36,-1,35,36,37,-1,37,36,38,-1,38,36,39,-1,38,39,2,-1,2,39,0,-1,5,1,39,-1,39,1,0,-1,5,39,7,-1,7,39,36,-1,32,30,28,-1,32,28,34,-1,20,7,22,-1,22,7,36,-1,22,36,24,-1,34,28,36,-1,36,28,26,-1,36,26,24,-1,18,16,14,-1,14,12,18,-1,18,12,10,-1,18,10,20,-1,20,10,8,-1,20,8,7,-1,40,41,42,-1,42,41,43,-1,44,45,46,-1,46,45,47,-1,46,47,40,-1,40,47,41,-1,42,43,48,-1,48,43,49,-1,48,49,50,-1,50,49,51,-1,49,43,47,-1,47,43,41,-1,47,45,49,-1,49,45,52,-1,49,52,51,-1,53,54,55,-1,55,54,56,-1,56,54,57,-1,57,54,58,-1,57,58,59,-1,59,58,60,-1,59,60,61,-1,59,61,62,-1,62,61,63,-1,62,63,64,-1,64,63,65,-1,64,65,66,-1,66,65,67,-1,66,67,68,-1,68,67,69,-1,68,69,70,-1,70,69,71,-1,70,71,72,-1,72,71,73,-1,72,73,74,-1,73,75,74,-1,74,75,76,-1,76,75,77,-1,76,77,78,-1,78,77,79,-1,78,79,80,-1,80,79,81,-1,80,81,82,-1,82,81,83,-1,82,83,84,-1,84,83,85,-1,84,85,86,-1,86,85,87,-1,86,87,88,-1,88,87,89,-1,88,89,90,-1,90,89,91,-1,91,89,92,-1,91,92,55,-1,55,92,53,-1,58,54,92,-1,92,54,53,-1,61,60,71,-1,77,75,89,-1,58,92,60,-1,60,92,89,-1,85,83,81,-1,85,81,87,-1,89,75,60,-1,60,75,73,-1,60,73,71,-1,87,81,89,-1,89,81,79,-1,89,79,77,-1,67,65,63,-1,61,71,63,-1,63,71,69,-1,63,69,67,-1,93,94,95,-1,95,94,96,-1,97,98,99,-1,99,98,100,-1,99,100,93,-1,93,100,94,-1,95,96,101,-1,101,96,102,-1,101,102,103,-1,103,102,104,-1,103,104,105,-1,103,105,106,-1,106,105,107,-1,106,107,108,-1,108,107,109,-1,108,109,110,-1,110,109,111,-1,110,111,112,-1,112,111,113,-1,112,113,114,-1,114,113,115,-1,114,115,116,-1,116,115,117,-1,116,117,118,-1,117,119,118,-1,118,119,120,-1,120,119,121,-1,120,121,122,-1,122,121,123,-1,122,123,124,-1,124,123,125,-1,124,125,126,-1,126,125,127,-1,126,127,128,-1,128,127,129,-1,128,129,130,-1,130,129,131,-1,130,131,132,-1,132,131,98,-1,132,98,97,-1,102,96,100,-1,100,96,94,-1,119,117,104,-1,129,127,119,-1,109,107,105,-1,102,100,104,-1,104,100,98,-1,104,98,119,-1,119,98,131,-1,119,131,129,-1,125,123,127,-1,127,123,121,-1,127,121,119,-1,117,115,104,-1,104,115,113,-1,104,113,105,-1,105,113,111,-1,105,111,109,-1,133,134,135,-1,135,134,136,-1,136,134,137,-1,137,134,138,-1,137,138,139,-1,139,138,140,-1,139,140,141,-1,139,141,142,-1,142,141,143,-1,142,143,144,-1,144,143,145,-1,144,145,146,-1,146,145,147,-1,146,147,148,-1,148,147,149,-1,148,149,150,-1,150,149,151,-1,150,151,152,-1,152,151,153,-1,152,153,154,-1,153,155,154,-1,154,155,156,-1,156,155,157,-1,156,157,158,-1,158,157,159,-1,158,159,160,-1,160,159,161,-1,160,161,162,-1,162,161,163,-1,162,163,164,-1,164,163,165,-1,164,165,166,-1,166,165,167,-1,166,167,168,-1,168,167,169,-1,168,169,170,-1,170,169,171,-1,171,169,172,-1,171,172,135,-1,135,172,133,-1,138,134,172,-1,172,134,133,-1,138,172,140,-1,140,172,169,-1,165,163,161,-1,165,161,167,-1,153,140,155,-1,155,140,169,-1,155,169,157,-1,167,161,169,-1,169,161,159,-1,169,159,157,-1,151,149,147,-1,147,145,151,-1,151,145,143,-1,151,143,153,-1,153,143,141,-1,153,141,140,-1,173,174,175,-1,175,174,176,-1,177,178,179,-1,179,178,180,-1,179,180,173,-1,173,180,174,-1,175,176,181,-1,181,176,182,-1,181,182,183,-1,183,182,184,-1,183,184,185,-1,183,185,186,-1,186,185,187,-1,186,187,188,-1,188,187,189,-1,188,189,190,-1,190,189,191,-1,190,191,192,-1,192,191,193,-1,192,193,194,-1,194,193,195,-1,194,195,196,-1,196,195,197,-1,196,197,198,-1,197,199,198,-1,198,199,200,-1,200,199,201,-1,200,201,202,-1,202,201,203,-1,202,203,204,-1,204,203,205,-1,204,205,206,-1,206,205,207,-1,206,207,208,-1,208,207,209,-1,208,209,210,-1,210,209,211,-1,210,211,212,-1,212,211,178,-1,212,178,177,-1,182,176,180,-1,180,176,174,-1,182,180,184,-1,184,180,178,-1,197,184,199,-1,199,184,178,-1,199,178,211,-1,211,209,199,-1,199,209,207,-1,199,207,201,-1,201,207,205,-1,201,205,203,-1,195,193,191,-1,191,189,195,-1,195,189,187,-1,195,187,197,-1,197,187,185,-1,197,185,184,-1,213,50,52,-1,52,50,51,-1,52,45,213,-1,213,45,44,-1,
		]
	}
}
Shape{
	appearance Appearance {
		material  Material 	{ 
			diffuseColor 0.8509803921568627 0.8509803921568627 0.8509803921568627 
			specularColor 0.4235294117647059 0.4235294117647059 0.4235294117647059
			ambientIntensity 0.2
			transparency 0.0
			shininess 0.5
		}
	}
	geometry IndexedFaceSet {
		ccw TRUE 
		solid FALSE
		coord DEF co Coordinate {
			point [
				-0.3024 0.3174 0.3504, -0.3024 0.3174 0.3543, -0.3031 0.3225 0.3504, -0.3031 0.3225 0.3543, -0.3051 0.3272 0.3504, -0.3051 0.3272 0.3543, -0.3082 0.3312 0.3504, -0.3082 0.3312 0.3543, -0.3122 0.3343 0.3504, -0.3122 0.3343 0.3543, -0.3169 0.3363 0.3504, -0.3169 0.3363 0.3543, -0.322 0.3369 0.3504, -0.322 0.3369 0.3543, -0.327 0.3363 0.3504, -0.327 0.3363 0.3543, -0.3318 0.3343 0.3504, -0.3318 0.3343 0.3543, -0.3358 0.3312 0.3504, -0.3358 0.3312 0.3543, -0.3389 0.3272 0.3504, -0.3389 0.3272 0.3543, -0.3409 0.3225 0.3504, -0.3409 0.3225 0.3543, -0.3415 0.3174 0.3504, -0.3415 0.3174 0.3543, -0.3409 0.3123 0.3504, -0.3409 0.3123 0.3543, -0.3389 0.3076 0.3504, -0.3389 0.3076 0.3543, -0.3358 0.3036 0.3504, -0.3358 0.3036 0.3543, -0.3318 0.3005 0.3504, -0.3318 0.3005 0.3543, -0.327 0.2985 0.3504, -0.327 0.2985 0.3543, -0.322 0.2979 0.3504, -0.322 0.2979 0.3543, -0.3169 0.2985 0.3504, -0.3169 0.2985 0.3543, -0.3122 0.3005 0.3504, -0.3122 0.3005 0.3543, -0.3082 0.3036 0.3504, -0.3082 0.3036 0.3543, -0.3051 0.3076 0.3504, -0.3051 0.3076 0.3543, -0.3031 0.3123 0.3504, -0.3031 0.3123 0.3543, -0.322 0.3174 0.3504, -0.322 0.3174 0.3504
			]
		}
		coordIndex [
			0,1,2,-1,2,1,3,-1,2,3,4,-1,4,3,5,-1,4,5,6,-1,6,5,7,-1,6,7,8,-1,8,7,9,-1,8,9,10,-1,10,9,11,-1,10,11,12,-1,12,11,13,-1,12,13,14,-1,14,13,15,-1,14,15,16,-1,16,15,17,-1,16,17,18,-1,18,17,19,-1,18,19,20,-1,20,19,21,-1,20,21,22,-1,22,21,23,-1,22,23,24,-1,24,23,25,-1,24,25,26,-1,26,25,27,-1,26,27,28,-1,28,27,29,-1,28,29,30,-1,30,29,31,-1,30,31,32,-1,32,31,33,-1,32,33,34,-1,34,33,35,-1,34,35,36,-1,36,35,37,-1,36,37,38,-1,38,37,39,-1,38,39,40,-1,40,39,41,-1,40,41,42,-1,42,41,43,-1,42,43,44,-1,44,43,45,-1,44,45,46,-1,46,45,47,-1,46,47,0,-1,0,47,1,-1,44,46,48,-1,48,46,0,-1,48,0,2,-1,38,40,48,-1,48,40,42,-1,48,42,44,-1,32,34,48,-1,48,34,36,-1,48,36,38,-1,26,28,48,-1,48,28,30,-1,48,30,32,-1,20,22,48,-1,48,22,24,-1,48,24,26,-1,14,16,48,-1,48,16,18,-1,48,18,20,-1,8,10,48,-1,48,10,12,-1,48,12,14,-1,2,4,48,-1,48,4,6,-1,48,6,8,-1,
		]
	}
}
Shape{
	appearance Appearance {
		material  Material 	{ 
			diffuseColor 1.0 1.0 1.0 
			specularColor 0.5019607843137255 0.5019607843137255 0.5019607843137255
			ambientIntensity 0.2
			transparency 0.0
			shininess 0.5
		}
	}
	geometry IndexedFaceSet {
		ccw TRUE 
		solid FALSE
		coord DEF co Coordinate {
			point [
				-0.1293 -0.2776 0.3583, -0.1293 -0.2819 0.3583, -0.1293 -0.2776 0.3543, -0.1293 -0.2819 0.3543, -0.1441 -0.2776 0.3583, -0.1441 -0.2776 0.3543, -0.1441 -0.2448 0.3583, -0.1441 -0.2448 0.3543, -0.1489 -0.2448 0.3583, -0.1489 -0.2448 0.3543, -0.1489 -0.2819 0.3583, -0.1489 -0.2819 0.3543, -0.1103 -0.2825 0.3583, -0.1103 -0.2825 0.3543, -0.1047 -0.282 0.3583, -0.1071 -0.2822 0.3543, -0.1047 -0.282 0.3543, -0.1007 -0.2807 0.3543, -0.1007 -0.2807 0.3583, -0.1001 -0.2803 0.3543, -0.1001 -0.2803 0.3583, -0.1001 -0.2757 0.3583, -0.1001 -0.2757 0.3543, -0.1037 -0.2774 0.3543, -0.1037 -0.2774 0.3583, -0.1079 -0.2782 0.3543, -0.1079 -0.2782 0.3583, -0.1096 -0.2782 0.3543, -0.1096 -0.2782 0.3583, -0.1134 -0.2778 0.3543, -0.1134 -0.2778 0.3583, -0.1161 -0.2767 0.3543, -0.1161 -0.2767 0.3583, -0.1185 -0.275 0.3543, -0.1185 -0.275 0.3583, -0.1192 -0.2743 0.3543, -0.1192 -0.2743 0.3583, -0.121 -0.2718 0.3543, -0.121 -0.2718 0.3583, -0.1222 -0.2688 0.3543, -0.1222 -0.2688 0.3583, -0.1228 -0.2651 0.3543, -0.1228 -0.2651 0.3583, -0.1228 -0.2638 0.3543, -0.1228 -0.2638 0.3583, -0.1223 -0.2591 0.3543, -0.1223 -0.2591 0.3583, -0.1211 -0.2558 0.3543, -0.1211 -0.2558 0.3583, -0.1194 -0.2531 0.3543, -0.1194 -0.2531 0.3583, -0.1189 -0.2526 0.3543, -0.1189 -0.2526 0.3583, -0.1164 -0.2505 0.3543, -0.1164 -0.2505 0.3583, -0.1135 -0.2492 0.3543, -0.1135 -0.2492 0.3583, -0.1102 -0.2486 0.3543, -0.1102 -0.2486 0.3583, -0.1088 -0.2485 0.3543, -0.1088 -0.2485 0.3583, -0.1042 -0.249 0.3543, -0.1042 -0.249 0.3583, -0.1005 -0.2505 0.3543, -0.1005 -0.2505 0.3583, -0.1001 -0.2507 0.3543, -0.1001 -0.2507 0.3583, -0.1001 -0.2457 0.3583, -0.1001 -0.2457 0.3543, -0.1089 -0.2442 0.3543, -0.1089 -0.2442 0.3583, -0.1087 -0.2442 0.3583, -0.1039 -0.2446 0.3543, -0.1039 -0.2446 0.3583, -0.105 -0.2445 0.3543, -0.1087 -0.2442 0.3543, -0.1114 -0.2445 0.3543, -0.1143 -0.2449 0.3583, -0.1143 -0.2449 0.3543, -0.1182 -0.2464 0.3543, -0.1182 -0.2464 0.3583, -0.1216 -0.2488 0.3543, -0.1216 -0.2488 0.3583, -0.1225 -0.2496 0.3543, -0.1225 -0.2496 0.3583, -0.1252 -0.2532 0.3543, -0.1252 -0.2532 0.3583, -0.1262 -0.2555 0.3543, -0.1269 -0.2573 0.3583, -0.1269 -0.2573 0.3543, -0.1278 -0.2621 0.3543, -0.1278 -0.2621 0.3583, -0.1278 -0.264 0.3543, -0.1278 -0.264 0.3583, -0.1271 -0.27 0.3543, -0.1271 -0.27 0.3583, -0.1262 -0.2725 0.3543, -0.1256 -0.2739 0.3583, -0.1256 -0.2739 0.3543, -0.1234 -0.2771 0.3543, -0.1234 -0.2771 0.3583, -0.1231 -0.2774 0.3543, -0.1231 -0.2774 0.3583, -0.1126 -0.2824 0.3583, -0.1201 -0.2799 0.3543, -0.1201 -0.2799 0.3583, -0.1166 -0.2816 0.3543, -0.1166 -0.2816 0.3583, -0.1136 -0.2822 0.3543, -0.1126 -0.2824 0.3543, -0.0727 -0.2776 0.3583, -0.0727 -0.2819 0.3583, -0.0727 -0.2776 0.3543, -0.0727 -0.2819 0.3543, -0.0879 -0.2776 0.3543, -0.0879 -0.2776 0.3583, -0.0779 -0.2776 0.3543, -0.0879 -0.2652 0.3583, -0.0879 -0.2652 0.3543, -0.0746 -0.2652 0.3583, -0.0779 -0.2652 0.3543, -0.0746 -0.2652 0.3543, -0.0746 -0.2609 0.3583, -0.0746 -0.2609 0.3543, -0.0879 -0.2609 0.3543, -0.0879 -0.2609 0.3583, -0.0779 -0.2609 0.3543, -0.0879 -0.2491 0.3583, -0.0879 -0.2491 0.3543, -0.0736 -0.2491 0.3583, -0.0779 -0.2491 0.3543, -0.0736 -0.2491 0.3543, -0.0736 -0.2448 0.3583, -0.0736 -0.2448 0.3543, -0.0927 -0.2448 0.3543, -0.0927 -0.2448 0.3583, -0.0779 -0.2448 0.3543, -0.0927 -0.2819 0.3583, -0.0927 -0.2819 0.3543, -0.0779 -0.2819 0.3543, -0.0555 -0.2776 0.3583, -0.0555 -0.2819 0.3583, -0.0508 -0.2771 0.3583, -0.0494 -0.2812 0.3583, -0.0477 -0.276 0.3583, -0.0451 -0.2795 0.3583, -0.0452 -0.2744 0.3583, -0.0416 -0.2771 0.3583, -0.0445 -0.2738 0.3583, -0.0411 -0.2767 0.3583, -0.0427 -0.2715 0.3583, -0.0384 -0.2734 0.3583, -0.0414 -0.2687 0.3583, -0.0365 -0.2695 0.3583, -0.0407 -0.2653 0.3583, -0.0356 -0.2652 0.3583, -0.0406 -0.263 0.3583, -0.0355 -0.2629 0.3583, -0.041 -0.2587 0.3583, -0.0362 -0.2577 0.3583, -0.042 -0.2559 0.3583, -0.0376 -0.2541 0.3583, -0.0434 -0.2538 0.3583, -0.0399 -0.2509 0.3583, -0.0446 -0.2526 0.3583, -0.0411 -0.2497 0.3583, -0.0473 -0.2508 0.3583, -0.045 -0.2471 0.3583, -0.0505 -0.2496 0.3583, -0.0495 -0.2454 0.3583, -0.0553 -0.2491 0.3583, -0.0551 -0.2448 0.3583, -0.0609 -0.2491 0.3583, -0.0657 -0.2448 0.3583, -0.0609 -0.2776 0.3583, -0.0657 -0.2819 0.3583, -0.0555 -0.2819 0.3543, -0.0657 -0.2819 0.3543, -0.0494 -0.2812 0.3543, -0.0487 -0.2809 0.3543, -0.0451 -0.2795 0.3543, -0.0416 -0.2771 0.3543, -0.0411 -0.2767 0.3543, -0.0384 -0.2734 0.3543, -0.0365 -0.2695 0.3543, -0.0356 -0.2652 0.3543, -0.0355 -0.2629 0.3543, -0.0362 -0.2577 0.3543, -0.0376 -0.2541 0.3543, -0.0399 -0.2509 0.3543, -0.0411 -0.2497 0.3543, -0.0551 -0.2448 0.3543, -0.045 -0.2471 0.3543, -0.0487 -0.2457 0.3543, -0.0495 -0.2454 0.3543, -0.0657 -0.2448 0.3543, -0.0553 -0.2491 0.3543, -0.0609 -0.2491 0.3543, -0.0609 -0.2776 0.3543, -0.0555 -0.2776 0.3543, -0.0445 -0.2738 0.3543, -0.0452 -0.2744 0.3543, -0.0477 -0.276 0.3543, -0.0508 -0.2771 0.3543, -0.0406 -0.263 0.3543, -0.0407 -0.2653 0.3543, -0.0414 -0.2687 0.3543, -0.0427 -0.2715 0.3543, -0.0446 -0.2526 0.3543, -0.0434 -0.2538 0.3543, -0.042 -0.2559 0.3543, -0.041 -0.2587 0.3543, -0.0505 -0.2496 0.3543, -0.0473 -0.2508 0.3543, -0.0473 -0.2508 0.3543
			]
		}
		coordIndex [
			0,1,2,-1,2,1,3,-1,4,0,5,-1,5,0,2,-1,6,4,7,-1,7,4,5,-1,8,6,9,-1,9,6,7,-1,10,8,11,-1,11,8,9,-1,1,10,3,-1,3,10,11,-1,6,8,4,-1,4,8,10,-1,4,10,0,-1,0,10,1,-1,12,13,14,-1,14,13,15,-1,15,16,14,-1,14,16,17,-1,14,17,18,-1,18,17,19,-1,18,19,20,-1,21,20,22,-1,22,20,19,-1,21,22,23,-1,21,23,24,-1,24,23,25,-1,24,25,26,-1,26,25,27,-1,26,27,28,-1,28,27,29,-1,28,29,30,-1,30,29,31,-1,30,31,32,-1,32,31,33,-1,32,33,34,-1,34,33,35,-1,34,35,36,-1,36,35,37,-1,36,37,38,-1,38,37,39,-1,38,39,40,-1,40,39,41,-1,40,41,42,-1,42,41,43,-1,42,43,44,-1,44,43,45,-1,44,45,46,-1,46,45,47,-1,46,47,48,-1,48,47,49,-1,48,49,50,-1,50,49,51,-1,50,51,52,-1,52,51,53,-1,52,53,54,-1,54,53,55,-1,54,55,56,-1,56,55,57,-1,56,57,58,-1,58,57,59,-1,58,59,60,-1,60,59,61,-1,60,61,62,-1,62,61,63,-1,62,63,64,-1,64,63,65,-1,64,65,66,-1,67,66,68,-1,68,66,65,-1,69,70,71,-1,67,68,72,-1,67,72,73,-1,73,72,74,-1,73,74,71,-1,71,74,75,-1,71,75,69,-1,70,69,76,-1,70,76,77,-1,76,78,77,-1,77,78,79,-1,77,79,80,-1,80,79,81,-1,80,81,82,-1,82,81,83,-1,82,83,84,-1,84,83,85,-1,84,85,86,-1,86,85,87,-1,86,87,88,-1,87,89,88,-1,88,89,90,-1,88,90,91,-1,91,90,92,-1,91,92,93,-1,93,92,94,-1,93,94,95,-1,95,94,96,-1,95,96,97,-1,96,98,97,-1,97,98,99,-1,97,99,100,-1,100,99,101,-1,100,101,102,-1,13,12,103,-1,102,101,104,-1,102,104,105,-1,105,104,106,-1,105,106,107,-1,107,106,108,-1,107,108,103,-1,103,108,109,-1,103,109,13,-1,64,66,67,-1,46,48,86,-1,64,67,62,-1,62,67,73,-1,62,73,60,-1,60,73,71,-1,60,71,58,-1,58,71,70,-1,58,70,56,-1,56,70,77,-1,56,77,54,-1,20,21,18,-1,18,21,24,-1,18,24,14,-1,14,24,26,-1,14,26,12,-1,12,26,28,-1,12,28,103,-1,103,28,30,-1,103,30,107,-1,107,30,32,-1,107,32,105,-1,105,32,34,-1,105,34,102,-1,102,34,36,-1,102,36,100,-1,100,36,38,-1,100,38,97,-1,86,48,84,-1,77,80,54,-1,54,80,82,-1,54,82,52,-1,52,82,84,-1,52,84,50,-1,50,84,48,-1,93,44,91,-1,91,44,46,-1,91,46,88,-1,88,46,86,-1,97,38,95,-1,95,38,40,-1,95,40,93,-1,93,40,42,-1,93,42,44,-1,110,111,112,-1,112,111,113,-1,114,115,116,-1,116,115,110,-1,116,110,112,-1,117,115,118,-1,118,115,114,-1,117,118,119,-1,119,118,120,-1,119,120,121,-1,122,119,123,-1,123,119,121,-1,124,125,126,-1,126,125,122,-1,126,122,123,-1,127,125,128,-1,128,125,124,-1,127,128,129,-1,129,128,130,-1,129,130,131,-1,132,129,133,-1,133,129,131,-1,134,135,136,-1,136,135,132,-1,136,132,133,-1,137,135,138,-1,138,135,134,-1,137,138,111,-1,111,138,139,-1,111,139,113,-1,137,111,110,-1,110,115,137,-1,137,115,117,-1,137,117,135,-1,129,132,127,-1,127,132,135,-1,127,135,125,-1,125,135,117,-1,125,117,122,-1,122,117,119,-1,140,141,142,-1,142,141,143,-1,142,143,144,-1,144,143,145,-1,144,145,146,-1,146,145,147,-1,146,147,148,-1,148,147,149,-1,148,149,150,-1,150,149,151,-1,150,151,152,-1,152,151,153,-1,152,153,154,-1,154,153,155,-1,154,155,156,-1,156,155,157,-1,156,157,158,-1,158,157,159,-1,158,159,160,-1,160,159,161,-1,160,161,162,-1,162,161,163,-1,162,163,164,-1,164,163,165,-1,164,165,166,-1,166,165,167,-1,166,167,168,-1,168,167,169,-1,168,169,170,-1,170,169,171,-1,170,171,172,-1,172,171,173,-1,172,173,174,-1,174,173,175,-1,174,175,140,-1,140,175,141,-1,141,175,176,-1,176,175,177,-1,141,176,178,-1,141,178,143,-1,143,178,179,-1,143,179,145,-1,179,180,145,-1,145,180,181,-1,145,181,147,-1,147,181,182,-1,147,182,149,-1,149,182,183,-1,149,183,151,-1,151,183,184,-1,151,184,153,-1,153,184,185,-1,153,185,155,-1,155,185,186,-1,155,186,157,-1,157,186,187,-1,157,187,159,-1,159,187,188,-1,159,188,161,-1,161,188,189,-1,161,189,163,-1,163,189,190,-1,163,190,165,-1,191,171,169,-1,165,190,192,-1,165,192,167,-1,167,192,193,-1,167,193,169,-1,169,193,194,-1,169,194,191,-1,173,171,195,-1,195,171,191,-1,175,173,177,-1,177,173,195,-1,170,172,196,-1,196,172,197,-1,172,174,197,-1,197,174,198,-1,174,140,198,-1,198,140,199,-1,148,200,201,-1,148,201,146,-1,146,201,202,-1,146,202,144,-1,144,202,203,-1,144,203,142,-1,142,203,199,-1,142,199,140,-1,156,204,205,-1,156,205,154,-1,154,205,206,-1,154,206,152,-1,152,206,207,-1,152,207,150,-1,150,207,200,-1,150,200,148,-1,164,208,209,-1,164,209,162,-1,162,209,210,-1,162,210,160,-1,160,210,211,-1,160,211,158,-1,158,211,204,-1,158,204,156,-1,170,196,212,-1,170,212,168,-1,168,212,213,-1,168,213,166,-1,166,213,208,-1,166,208,164,-1,
		]
	}
}
Shape{
	appearance Appearance {
		material  Material 	{ 
			diffuseColor 0.2235294117647059 0.2235294117647059 0.2235294117647059 
			specularColor 0.11372549019607843 0.11372549019607843 0.11372549019607843
			ambientIntensity 0.2
			transparency 0.0
			shininess 0.5
		}
	}
	geometry IndexedFaceSet {
		ccw TRUE 
		solid FALSE
		coord DEF co Coordinate {
			point [
				-0.0609 -0.2491 0.3543, -0.0609 -0.2776 0.3543, -0.0553 -0.2491 0.3543, -0.0555 -0.2776 0.3543, -0.0508 -0.2771 0.3543, -0.0477 -0.276 0.3543, -0.0452 -0.2744 0.3543, -0.0445 -0.2738 0.3543, -0.0427 -0.2715 0.3543, -0.0414 -0.2687 0.3543, -0.0407 -0.2653 0.3543, -0.0406 -0.263 0.3543, -0.041 -0.2587 0.3543, -0.042 -0.2559 0.3543, -0.0434 -0.2538 0.3543, -0.0446 -0.2526 0.3543, -0.0505 -0.2496 0.3543, -0.0473 -0.2508 0.3543, -0.0473 -0.2508 0.3543
			]
		}
		coordIndex [
			0,1,2,-1,2,1,3,-1,2,3,4,-1,4,5,2,-1,2,5,6,-1,2,6,7,-1,7,8,2,-1,2,8,9,-1,2,9,10,-1,10,11,2,-1,2,11,12,-1,2,12,13,-1,13,14,2,-1,2,14,15,-1,2,15,16,-1,16,15,17,-1,
		]
	}
}
Shape{
	appearance Appearance {
		material  Material 	{ 
			diffuseColor 1.0 1.0 1.0 
			specularColor 0.5019607843137255 0.5019607843137255 0.5019607843137255
			ambientIntensity 0.2
			transparency 0.0
			shininess 0.5
		}
	}
	geometry IndexedFaceSet {
		ccw TRUE 
		solid FALSE
		coord DEF co Coordinate {
			point [
				-0.0231 -0.2675 0.3583, -0.0246 -0.2717 0.3583, -0.0107 -0.2675 0.3583, -0.0092 -0.2717 0.3583, -0.0176 -0.2521 0.3583, -0.0194 -0.2448 0.3583, -0.0335 -0.2819 0.3583, -0.0282 -0.2819 0.3583, -0.0172 -0.251 0.3583, -0.017 -0.2495 0.3583, -0.0142 -0.2448 0.3583, -0.0168 -0.2495 0.3583, -0.0165 -0.2511 0.3583, -0.0163 -0.2521 0.3583, -0.0001 -0.2819 0.3583, -0.0054 -0.2819 0.3583, -0.0142 -0.2448 0.3543, -0.0001 -0.2819 0.3543, -0.0194 -0.2448 0.3543, -0.0335 -0.2819 0.3543, -0.0228 -0.2538 0.3543, -0.0282 -0.2819 0.3543, -0.0246 -0.2717 0.3543, -0.0092 -0.2717 0.3543, -0.0228 -0.2717 0.3543, -0.0054 -0.2819 0.3543, -0.0231 -0.2675 0.3543, -0.0107 -0.2675 0.3543, -0.0163 -0.2521 0.3543, -0.0168 -0.2495 0.3543, -0.0165 -0.2511 0.3543, -0.017 -0.2495 0.3543, -0.0176 -0.2521 0.3543, -0.0172 -0.251 0.3543, -0.0172 -0.251 0.3543
			]
		}
		coordIndex [
			0,1,2,-1,2,1,3,-1,4,5,0,-1,0,5,6,-1,0,6,1,-1,1,6,7,-1,4,8,5,-1,5,8,9,-1,5,9,10,-1,10,9,11,-1,10,11,12,-1,12,13,10,-1,10,13,2,-1,10,2,14,-1,14,2,3,-1,14,3,15,-1,10,14,16,-1,16,14,17,-1,5,10,18,-1,18,10,16,-1,19,6,20,-1,20,6,5,-1,20,5,18,-1,7,6,21,-1,21,6,19,-1,1,7,22,-1,22,7,21,-1,23,3,24,-1,24,3,1,-1,24,1,22,-1,15,3,25,-1,25,3,23,-1,14,15,17,-1,17,15,25,-1,0,2,26,-1,26,2,27,-1,2,13,27,-1,27,13,28,-1,11,29,30,-1,11,30,12,-1,12,30,28,-1,12,28,13,-1,11,9,29,-1,29,9,31,-1,4,32,33,-1,4,33,8,-1,8,33,31,-1,8,31,9,-1,4,0,32,-1,32,0,26,-1,
		]
	}
}
Shape{
	appearance Appearance {
		material  Material 	{ 
			diffuseColor 0.2235294117647059 0.2235294117647059 0.2235294117647059 
			specularColor 0.11372549019607843 0.11372549019607843 0.11372549019607843
			ambientIntensity 0.2
			transparency 0.0
			shininess 0.5
		}
	}
	geometry IndexedFaceSet {
		ccw TRUE 
		solid FALSE
		coord DEF co Coordinate {
			point [
				-0.0168 -0.2495 0.3543, -0.017 -0.2495 0.3543, -0.0165 -0.2511 0.3543, -0.0172 -0.251 0.3543, -0.0163 -0.2521 0.3543, -0.0176 -0.2521 0.3543, -0.0107 -0.2675 0.3543, -0.0231 -0.2675 0.3543, -0.0231 -0.2675 0.3543
			]
		}
		coordIndex [
			0,1,2,-1,2,1,3,-1,2,3,4,-1,4,3,5,-1,4,5,6,-1,6,5,7,-1,
		]
	}
}
Shape{
	appearance Appearance {
		material  Material 	{ 
			diffuseColor 1.0 1.0 1.0 
			specularColor 0.5019607843137255 0.5019607843137255 0.5019607843137255
			ambientIntensity 0.2
			transparency 0.0
			shininess 0.5
		}
	}
	geometry IndexedFaceSet {
		ccw TRUE 
		solid FALSE
		coord DEF co Coordinate {
			point [
				-0.129 -0.3365 0.3583, -0.129 -0.3407 0.3583, -0.129 -0.3365 0.3543, -0.129 -0.3407 0.3543, -0.1441 -0.3365 0.3583, -0.1441 -0.3365 0.3543, -0.1441 -0.324 0.3583, -0.1441 -0.324 0.3543, -0.1308 -0.324 0.3583, -0.1308 -0.324 0.3543, -0.1308 -0.3197 0.3583, -0.1308 -0.3197 0.3543, -0.1441 -0.3197 0.3583, -0.1441 -0.3197 0.3543, -0.1441 -0.3079 0.3583, -0.1441 -0.3079 0.3543, -0.1298 -0.3079 0.3583, -0.1298 -0.3079 0.3543, -0.1298 -0.3036 0.3583, -0.1298 -0.3036 0.3543, -0.1489 -0.3036 0.3583, -0.1489 -0.3036 0.3543, -0.1489 -0.3407 0.3583, -0.1489 -0.3407 0.3543, -0.1079 -0.3407 0.3583, -0.1032 -0.3407 0.3583, -0.1079 -0.3366 0.3583, -0.1032 -0.3236 0.3583, -0.1079 -0.3238 0.3583, -0.1179 -0.3294 0.3583, -0.1168 -0.3289 0.3583, -0.1141 -0.3282 0.3583, -0.1079 -0.3274 0.3583, -0.1079 -0.3299 0.3583, -0.108 -0.3366 0.3583, -0.1105 -0.336 0.3583, -0.1091 -0.3382 0.3583, -0.1118 -0.3368 0.3583, -0.1079 -0.3305 0.3583, -0.1082 -0.3324 0.3583, -0.1089 -0.3341 0.3583, -0.1099 -0.3353 0.3583, -0.1188 -0.3359 0.3583, -0.1222 -0.3392 0.3583, -0.1185 -0.3363 0.3583, -0.1209 -0.3402 0.3583, -0.1175 -0.3369 0.3583, -0.1192 -0.3409 0.3583, -0.1165 -0.3373 0.3583, -0.1171 -0.3413 0.3583, -0.1149 -0.3375 0.3583, -0.108 -0.3219 0.3583, -0.1036 -0.3201 0.3583, -0.1085 -0.3202 0.3583, -0.1043 -0.318 0.3583, -0.109 -0.3192 0.3583, -0.1053 -0.3165 0.3583, -0.1097 -0.3185 0.3583, -0.1065 -0.3153 0.3583, -0.1106 -0.3179 0.3583, -0.1081 -0.3144 0.3583, -0.1116 -0.3175 0.3583, -0.11 -0.3138 0.3583, -0.1132 -0.3174 0.3583, -0.1128 -0.3136 0.3583, -0.1158 -0.3176 0.3583, -0.1176 -0.3142 0.3583, -0.1187 -0.3185 0.3583, -0.121 -0.3155 0.3583, -0.1219 -0.3206 0.3583, -0.1219 -0.3161 0.3583, -0.1161 -0.3413 0.3583, -0.1135 -0.341 0.3583, -0.1133 -0.3373 0.3583, -0.1117 -0.3403 0.3583, -0.1106 -0.3396 0.3583, -0.1198 -0.3325 0.3583, -0.1245 -0.333 0.3583, -0.1198 -0.3332 0.3583, -0.1245 -0.3336 0.3583, -0.1197 -0.3343 0.3583, -0.1242 -0.3359 0.3583, -0.1194 -0.3351 0.3583, -0.1236 -0.3374 0.3583, -0.1227 -0.3388 0.3583, -0.1157 -0.3249 0.3583, -0.1192 -0.3258 0.3583, -0.1186 -0.3299 0.3583, -0.1212 -0.3268 0.3583, -0.1191 -0.3305 0.3583, -0.1226 -0.3281 0.3583, -0.1195 -0.3314 0.3583, -0.1236 -0.3294 0.3583, -0.1242 -0.331 0.3583, -0.1128 -0.3136 0.3543, -0.1176 -0.3142 0.3543, -0.121 -0.3155 0.3543, -0.1219 -0.3161 0.3543, -0.1219 -0.3206 0.3543, -0.1187 -0.3185 0.3543, -0.1158 -0.3176 0.3543, -0.1132 -0.3174 0.3543, -0.1116 -0.3175 0.3543, -0.1106 -0.3179 0.3543, -0.1097 -0.3185 0.3543, -0.109 -0.3192 0.3543, -0.1085 -0.3202 0.3543, -0.108 -0.3219 0.3543, -0.1079 -0.3238 0.3543, -0.1157 -0.3249 0.3543, -0.1192 -0.3258 0.3543, -0.1212 -0.3268 0.3543, -0.1226 -0.3281 0.3543, -0.1236 -0.3294 0.3543, -0.1242 -0.331 0.3543, -0.1245 -0.333 0.3543, -0.1245 -0.3336 0.3543, -0.1242 -0.3359 0.3543, -0.1236 -0.3374 0.3543, -0.1227 -0.3388 0.3543, -0.1222 -0.3392 0.3543, -0.1161 -0.3413 0.3543, -0.1209 -0.3402 0.3543, -0.1192 -0.3409 0.3543, -0.1187 -0.341 0.3543, -0.1171 -0.3413 0.3543, -0.1135 -0.341 0.3543, -0.1117 -0.3403 0.3543, -0.1106 -0.3396 0.3543, -0.1091 -0.3382 0.3543, -0.108 -0.3366 0.3543, -0.1079 -0.3366 0.3543, -0.1079 -0.3407 0.3543, -0.1032 -0.3407 0.3543, -0.1032 -0.3236 0.3543, -0.1036 -0.3201 0.3543, -0.1043 -0.318 0.3543, -0.1053 -0.3165 0.3543, -0.1065 -0.3153 0.3543, -0.1081 -0.3144 0.3543, -0.11 -0.3138 0.3543, -0.1186 -0.3299 0.3543, -0.1179 -0.3294 0.3543, -0.1168 -0.3289 0.3543, -0.1141 -0.3282 0.3543, -0.1198 -0.3332 0.3543, -0.1198 -0.3325 0.3543, -0.1195 -0.3314 0.3543, -0.1191 -0.3305 0.3543, -0.1185 -0.3363 0.3543, -0.1188 -0.3359 0.3543, -0.1194 -0.3351 0.3543, -0.1197 -0.3343 0.3543, -0.1149 -0.3375 0.3543, -0.1165 -0.3373 0.3543, -0.1175 -0.3369 0.3543, -0.1099 -0.3353 0.3543, -0.1105 -0.336 0.3543, -0.1118 -0.3368 0.3543, -0.1133 -0.3373 0.3543, -0.1079 -0.3299 0.3543, -0.1079 -0.3305 0.3543, -0.1082 -0.3324 0.3543, -0.1089 -0.3341 0.3543, -0.1079 -0.3274 0.3543, -0.1079 -0.3274 0.3543
			]
		}
		coordIndex [
			0,1,2,-1,2,1,3,-1,4,0,5,-1,5,0,2,-1,6,4,7,-1,7,4,5,-1,8,6,9,-1,9,6,7,-1,10,8,11,-1,11,8,9,-1,12,10,13,-1,13,10,11,-1,14,12,15,-1,15,12,13,-1,16,14,17,-1,17,14,15,-1,18,16,19,-1,19,16,17,-1,20,18,21,-1,21,18,19,-1,22,20,23,-1,23,20,21,-1,1,22,3,-1,3,22,23,-1,22,1,0,-1,0,4,22,-1,22,4,6,-1,22,6,20,-1,16,18,14,-1,14,18,20,-1,14,20,12,-1,12,20,6,-1,12,6,10,-1,10,6,8,-1,24,25,26,-1,26,25,27,-1,28,29,30,-1,31,32,27,-1,27,32,33,-1,34,35,36,-1,36,35,37,-1,33,38,27,-1,27,38,39,-1,27,39,26,-1,26,39,40,-1,26,40,34,-1,34,40,41,-1,34,41,35,-1,42,43,44,-1,44,43,45,-1,44,45,46,-1,46,45,47,-1,46,47,48,-1,48,47,49,-1,48,49,50,-1,30,31,28,-1,28,31,27,-1,28,27,51,-1,51,27,52,-1,51,52,53,-1,53,52,54,-1,53,54,55,-1,55,54,56,-1,55,56,57,-1,57,56,58,-1,57,58,59,-1,59,58,60,-1,59,60,61,-1,61,60,62,-1,61,62,63,-1,63,62,64,-1,63,64,65,-1,65,64,66,-1,65,66,67,-1,67,66,68,-1,67,68,69,-1,69,68,70,-1,49,71,50,-1,50,71,72,-1,50,72,73,-1,73,72,74,-1,73,74,37,-1,37,74,75,-1,37,75,36,-1,76,77,78,-1,78,77,79,-1,78,79,80,-1,80,79,81,-1,80,81,82,-1,82,81,83,-1,82,83,42,-1,42,83,84,-1,42,84,43,-1,28,85,29,-1,29,85,86,-1,29,86,87,-1,87,86,88,-1,87,88,89,-1,89,88,90,-1,89,90,91,-1,91,90,92,-1,91,92,76,-1,76,92,93,-1,76,93,77,-1,64,94,95,-1,64,95,66,-1,66,95,96,-1,66,96,68,-1,68,96,97,-1,68,97,70,-1,69,70,98,-1,98,70,97,-1,69,98,99,-1,69,99,67,-1,67,99,100,-1,67,100,65,-1,65,100,101,-1,65,101,63,-1,63,101,102,-1,63,102,61,-1,61,102,103,-1,61,103,59,-1,59,103,104,-1,59,104,57,-1,57,104,105,-1,57,105,55,-1,55,105,106,-1,55,106,53,-1,53,106,107,-1,53,107,51,-1,51,107,108,-1,51,108,28,-1,85,28,109,-1,109,28,108,-1,85,109,110,-1,85,110,86,-1,86,110,111,-1,86,111,88,-1,88,111,112,-1,88,112,90,-1,90,112,113,-1,90,113,92,-1,92,113,114,-1,92,114,93,-1,93,114,115,-1,93,115,77,-1,77,115,116,-1,77,116,79,-1,79,116,117,-1,79,117,81,-1,81,117,118,-1,81,118,83,-1,83,118,119,-1,83,119,84,-1,84,119,120,-1,84,120,43,-1,121,71,49,-1,43,120,122,-1,43,122,45,-1,45,122,123,-1,45,123,47,-1,47,123,124,-1,47,124,49,-1,49,124,125,-1,49,125,121,-1,71,121,126,-1,71,126,72,-1,72,126,127,-1,72,127,74,-1,74,127,128,-1,74,128,75,-1,75,128,129,-1,75,129,36,-1,36,129,130,-1,36,130,34,-1,26,34,131,-1,131,34,130,-1,24,26,132,-1,132,26,131,-1,25,24,133,-1,133,24,132,-1,27,25,134,-1,134,25,133,-1,27,134,135,-1,27,135,52,-1,52,135,136,-1,52,136,54,-1,54,136,137,-1,54,137,56,-1,56,137,138,-1,56,138,58,-1,58,138,139,-1,58,139,60,-1,60,139,140,-1,60,140,62,-1,62,140,94,-1,62,94,64,-1,87,141,142,-1,87,142,29,-1,29,142,143,-1,29,143,30,-1,30,143,144,-1,30,144,31,-1,78,145,146,-1,78,146,76,-1,76,146,147,-1,76,147,91,-1,91,147,148,-1,91,148,89,-1,89,148,141,-1,89,141,87,-1,44,149,150,-1,44,150,42,-1,42,150,151,-1,42,151,82,-1,82,151,152,-1,82,152,80,-1,80,152,145,-1,80,145,78,-1,50,153,154,-1,50,154,48,-1,48,154,155,-1,48,155,46,-1,46,155,149,-1,46,149,44,-1,41,156,157,-1,41,157,35,-1,35,157,158,-1,35,158,37,-1,37,158,159,-1,37,159,73,-1,73,159,153,-1,73,153,50,-1,33,160,161,-1,33,161,38,-1,38,161,162,-1,38,162,39,-1,39,162,163,-1,39,163,40,-1,40,163,156,-1,40,156,41,-1,33,32,160,-1,160,32,164,-1,32,31,164,-1,164,31,144,-1,
		]
	}
}
Shape{
	appearance Appearance {
		material  Material 	{ 
			diffuseColor 0.2235294117647059 0.2235294117647059 0.2235294117647059 
			specularColor 0.11372549019607843 0.11372549019607843 0.11372549019607843
			ambientIntensity 0.2
			transparency 0.0
			shininess 0.5
		}
	}
	geometry IndexedFaceSet {
		ccw TRUE 
		solid FALSE
		coord DEF co Coordinate {
			point [
				-0.1079 -0.3274 0.3543, -0.1141 -0.3282 0.3543, -0.1079 -0.3299 0.3543, -0.1168 -0.3289 0.3543, -0.1179 -0.3294 0.3543, -0.1186 -0.3299 0.3543, -0.1079 -0.3305 0.3543, -0.1082 -0.3324 0.3543, -0.1191 -0.3305 0.3543, -0.1089 -0.3341 0.3543, -0.1188 -0.3359 0.3543, -0.1185 -0.3363 0.3543, -0.1105 -0.336 0.3543, -0.1194 -0.3351 0.3543, -0.1118 -0.3368 0.3543, -0.1133 -0.3373 0.3543, -0.1149 -0.3375 0.3543, -0.1195 -0.3314 0.3543, -0.1198 -0.3325 0.3543, -0.1099 -0.3353 0.3543, -0.1198 -0.3332 0.3543, -0.1197 -0.3343 0.3543, -0.1175 -0.3369 0.3543, -0.1165 -0.3373 0.3543, -0.1165 -0.3373 0.3543
			]
		}
		coordIndex [
			0,1,2,-1,2,1,3,-1,3,4,2,-1,2,4,5,-1,2,5,6,-1,6,5,7,-1,7,5,8,-1,7,8,9,-1,10,11,12,-1,10,12,13,-1,14,12,15,-1,15,12,16,-1,8,17,9,-1,9,17,18,-1,9,18,19,-1,19,18,20,-1,19,20,12,-1,12,20,21,-1,12,21,13,-1,11,22,12,-1,12,22,23,-1,12,23,16,-1,
		]
	}
}
Shape{
	appearance Appearance {
		material  Material 	{ 
			diffuseColor 1.0 1.0 1.0 
			specularColor 0.5019607843137255 0.5019607843137255 0.5019607843137255
			ambientIntensity 0.2
			transparency 0.0
			shininess 0.5
		}
	}
	geometry IndexedFaceSet {
		ccw TRUE 
		solid FALSE
		coord DEF co Coordinate {
			point [
				-0.0969 -0.335 0.3543, -0.0969 -0.335 0.3583, -0.0953 -0.336 0.3583, -0.0893 -0.3375 0.3583, -0.0893 -0.3375 0.3543, -0.0924 -0.3371 0.3543, -0.0924 -0.3371 0.3583, -0.0948 -0.3362 0.3543, -0.0953 -0.336 0.3543, -0.0969 -0.3397 0.3583, -0.0969 -0.3397 0.3543, -0.0948 -0.3405 0.3543, -0.0937 -0.3409 0.3583, -0.0898 -0.3413 0.3543, -0.0898 -0.3413 0.3583, -0.0927 -0.341 0.3543, -0.0937 -0.3409 0.3543, -0.0868 -0.341 0.3543, -0.0859 -0.3409 0.3583, -0.0859 -0.3409 0.3543, -0.0834 -0.34 0.3543, -0.0834 -0.34 0.3583, -0.082 -0.3392 0.3543, -0.082 -0.3392 0.3583, -0.0808 -0.3381 0.3543, -0.0808 -0.3381 0.3583, -0.0799 -0.3369 0.3543, -0.0799 -0.3369 0.3583, -0.0793 -0.3354 0.3543, -0.0793 -0.3354 0.3583, -0.0791 -0.3335 0.3543, -0.0791 -0.3335 0.3583, -0.0792 -0.3318 0.3543, -0.0792 -0.3318 0.3583, -0.0797 -0.3304 0.3543, -0.0797 -0.3304 0.3583, -0.0805 -0.3292 0.3543, -0.0805 -0.3292 0.3583, -0.0806 -0.3291 0.3543, -0.0806 -0.3291 0.3583, -0.0817 -0.3281 0.3543, -0.0817 -0.3281 0.3583, -0.0848 -0.3264 0.3543, -0.0848 -0.3264 0.3583, -0.0866 -0.3257 0.3543, -0.0866 -0.3257 0.3583, -0.0895 -0.3244 0.3543, -0.0895 -0.3244 0.3583, -0.0911 -0.3234 0.3543, -0.0911 -0.3234 0.3583, -0.0916 -0.3229 0.3543, -0.0916 -0.3229 0.3583, -0.0919 -0.3223 0.3543, -0.0919 -0.3223 0.3583, -0.0921 -0.3215 0.3543, -0.0921 -0.3215 0.3583, -0.0921 -0.3209 0.3543, -0.0921 -0.3209 0.3583, -0.092 -0.3202 0.3543, -0.092 -0.3202 0.3583, -0.0918 -0.3196 0.3543, -0.0918 -0.3196 0.3583, -0.0914 -0.319 0.3543, -0.0914 -0.319 0.3583, -0.0907 -0.3184 0.3543, -0.0907 -0.3184 0.3583, -0.0897 -0.3178 0.3543, -0.0897 -0.3178 0.3583, -0.0884 -0.3175 0.3543, -0.0884 -0.3175 0.3583, -0.0871 -0.3174 0.3543, -0.0871 -0.3174 0.3583, -0.0838 -0.3178 0.3543, -0.0838 -0.3178 0.3583, -0.0812 -0.3188 0.3543, -0.0812 -0.3188 0.3583, -0.0803 -0.3193 0.3543, -0.0803 -0.3193 0.3583, -0.0803 -0.3148 0.3583, -0.0803 -0.3148 0.3543, -0.0833 -0.3139 0.3543, -0.0833 -0.3139 0.3583, -0.0866 -0.3136 0.3543, -0.0866 -0.3136 0.3583, -0.0904 -0.3141 0.3543, -0.0904 -0.3141 0.3583, -0.0928 -0.315 0.3543, -0.0928 -0.315 0.3583, -0.0939 -0.3157 0.3543, -0.0939 -0.3157 0.3583, -0.0948 -0.3165 0.3543, -0.0952 -0.3168 0.3583, -0.0952 -0.3168 0.3543, -0.0961 -0.3181 0.3543, -0.0961 -0.3181 0.3583, -0.0967 -0.3196 0.3543, -0.0967 -0.3196 0.3583, -0.0969 -0.3213 0.3543, -0.0969 -0.3213 0.3583, -0.0967 -0.323 0.3543, -0.0967 -0.323 0.3583, -0.0962 -0.3245 0.3543, -0.0962 -0.3245 0.3583, -0.0956 -0.3255 0.3543, -0.0956 -0.3255 0.3583, -0.0899 -0.329 0.3543, -0.0899 -0.329 0.3583, -0.0927 -0.3278 0.3583, -0.0948 -0.3263 0.3543, -0.0948 -0.3263 0.3583, -0.0948 -0.3264 0.3543, -0.0927 -0.3278 0.3543, -0.0868 -0.3303 0.3543, -0.0868 -0.3303 0.3583, -0.085 -0.3314 0.3543, -0.085 -0.3314 0.3583, -0.0844 -0.332 0.3543, -0.0844 -0.332 0.3583, -0.0841 -0.3326 0.3543, -0.0841 -0.3326 0.3583, -0.0839 -0.3334 0.3543, -0.0839 -0.3334 0.3583, -0.0838 -0.3339 0.3543, -0.0838 -0.3339 0.3583, -0.0839 -0.3348 0.3543, -0.0839 -0.3348 0.3583, -0.0842 -0.3355 0.3543, -0.0842 -0.3355 0.3583, -0.0846 -0.3361 0.3543, -0.0846 -0.3361 0.3583, -0.0851 -0.3365 0.3543, -0.0851 -0.3365 0.3583, -0.0855 -0.3368 0.3543, -0.0855 -0.3368 0.3583, -0.0867 -0.3372 0.3543, -0.0867 -0.3372 0.3583, -0.0891 -0.3375 0.3543, -0.0891 -0.3375 0.3583, -0.056 -0.3142 0.3583, -0.0512 -0.3142 0.3583, -0.056 -0.3142 0.3543, -0.0512 -0.3142 0.3543, -0.0633 -0.3341 0.3583, -0.0633 -0.3341 0.3543, -0.0636 -0.3354 0.3543, -0.0636 -0.3354 0.3583, -0.0638 -0.3363 0.3543, -0.0638 -0.3363 0.3583, -0.064 -0.3363 0.3583, -0.064 -0.3363 0.3543, -0.0645 -0.3341 0.3583, -0.0645 -0.3341 0.3543, -0.0715 -0.3142 0.3583, -0.0692 -0.3206 0.3543, -0.0715 -0.3142 0.3543, -0.0766 -0.3142 0.3583, -0.0766 -0.3142 0.3543, -0.0663 -0.3406 0.3583, -0.0692 -0.3331 0.3543, -0.0663 -0.3406 0.3543, -0.0683 -0.3454 0.3543, -0.0683 -0.3454 0.3583, -0.0664 -0.341 0.3543, -0.0692 -0.347 0.3543, -0.0692 -0.347 0.3583, -0.0692 -0.3471 0.3543, -0.07 -0.348 0.3583, -0.07 -0.348 0.3543, -0.071 -0.3487 0.3543, -0.071 -0.3487 0.3583, -0.072 -0.3491 0.3543, -0.072 -0.3491 0.3583, -0.0731 -0.3492 0.3543, -0.0731 -0.3492 0.3583, -0.0746 -0.349 0.3543, -0.0746 -0.349 0.3583, -0.0757 -0.3486 0.3543, -0.0757 -0.3486 0.3583, -0.0757 -0.3528 0.3583, -0.0757 -0.3528 0.3543, -0.0743 -0.3531 0.3543, -0.0743 -0.3531 0.3583, -0.0727 -0.3531 0.3543, -0.0727 -0.3531 0.3583, -0.071 -0.353 0.3543, -0.071 -0.353 0.3583, -0.0692 -0.3523 0.3543, -0.0692 -0.3523 0.3583, -0.0692 -0.3523 0.3543, -0.0675 -0.3512 0.3543, -0.0675 -0.3512 0.3583, -0.0666 -0.3504 0.3543, -0.0666 -0.3504 0.3583, -0.0646 -0.3475 0.3543, -0.0646 -0.3475 0.3583, -0.0632 -0.3447 0.3543, -0.0632 -0.3447 0.3583, -0.0618 -0.341 0.3543, -0.0263 -0.3365 0.3583, -0.0263 -0.3407 0.3583, -0.0263 -0.3365 0.3543, -0.0263 -0.3407 0.3543, -0.0414 -0.3365 0.3583, -0.0345 -0.3365 0.3543, -0.0414 -0.3365 0.3543, -0.0414 -0.324 0.3583, -0.0414 -0.324 0.3543, -0.0282 -0.324 0.3583, -0.0345 -0.324 0.3543, -0.0282 -0.324 0.3543, -0.0282 -0.3197 0.3583, -0.0282 -0.3197 0.3543, -0.0414 -0.3197 0.3543, -0.0414 -0.3197 0.3583, -0.0345 -0.3197 0.3543, -0.0414 -0.3079 0.3583, -0.0414 -0.3079 0.3543, -0.0271 -0.3079 0.3543, -0.0271 -0.3079 0.3583, -0.0345 -0.3079 0.3543, -0.0271 -0.3036 0.3583, -0.0271 -0.3036 0.3543, -0.0462 -0.3036 0.3543, -0.0462 -0.3036 0.3583, -0.0345 -0.3036 0.3543, -0.0462 -0.3407 0.3583, -0.0462 -0.3407 0.3543, -0.0345 -0.3407 0.3543, -0.0091 -0.3365 0.3583, -0.0091 -0.3407 0.3583, -0.0044 -0.3359 0.3583, -0.003 -0.34 0.3583, -0.0012 -0.3348 0.3583, 0.0013 -0.3383 0.3583, 0.0012 -0.3332 0.3583, 0.0049 -0.3359 0.3583, 0.0019 -0.3326 0.3583, 0.0053 -0.3355 0.3583, 0.0037 -0.3303 0.3583, 0.0081 -0.3322 0.3583, 0.005 -0.3275 0.3583, 0.0099 -0.3283 0.3583, 0.0057 -0.3242 0.3583, 0.0108 -0.324 0.3583, 0.0059 -0.3218 0.3583, 0.0109 -0.3217 0.3583, 0.0054 -0.3175 0.3583, 0.0102 -0.3165 0.3583, 0.0044 -0.3147 0.3583, 0.0089 -0.313 0.3583, 0.003 -0.3126 0.3583, 0.0066 -0.3097 0.3583, 0.0018 -0.3114 0.3583, 0.0053 -0.3085 0.3583, -0.0009 -0.3096 0.3583, 0.0014 -0.3059 0.3583, -0.0041 -0.3084 0.3583, -0.0031 -0.3042 0.3583, -0.0089 -0.3079 0.3583, -0.0087 -0.3036 0.3583, -0.0145 -0.3079 0.3583, -0.0193 -0.3036 0.3583, -0.0145 -0.3365 0.3583, -0.0193 -0.3407 0.3583, -0.0091 -0.3407 0.3543, -0.0193 -0.3407 0.3543, -0.003 -0.34 0.3543, 0.0013 -0.3383 0.3543, 0.0049 -0.3359 0.3543, 0.0053 -0.3355 0.3543, 0.0081 -0.3322 0.3543, 0.0099 -0.3283 0.3543, 0.0108 -0.324 0.3543, 0.0109 -0.3217 0.3543, 0.0102 -0.3165 0.3543, 0.0089 -0.313 0.3543, 0.0066 -0.3097 0.3543, 0.0053 -0.3085 0.3543, 0.0014 -0.3059 0.3543, -0.0031 -0.3042 0.3543, -0.0087 -0.3036 0.3543, -0.0193 -0.3036 0.3543, -0.0089 -0.3079 0.3543, -0.0145 -0.3079 0.3543, -0.0145 -0.3365 0.3543, -0.0091 -0.3365 0.3543, 0.0019 -0.3326 0.3543, 0.0012 -0.3332 0.3543, -0.0012 -0.3348 0.3543, -0.0044 -0.3359 0.3543, 0.0059 -0.3218 0.3543, 0.0057 -0.3242 0.3543, 0.005 -0.3275 0.3543, 0.0037 -0.3303 0.3543, 0.0018 -0.3114 0.3543, 0.003 -0.3126 0.3543, 0.0044 -0.3147 0.3543, 0.0054 -0.3175 0.3543, -0.0041 -0.3084 0.3543, -0.0009 -0.3096 0.3543, -0.0009 -0.3096 0.3543
			]
		}
		coordIndex [
			0,1,2,-1,3,4,5,-1,3,5,6,-1,6,5,7,-1,6,7,2,-1,2,7,8,-1,2,8,0,-1,9,1,10,-1,10,1,0,-1,10,11,9,-1,9,11,12,-1,13,14,15,-1,15,14,12,-1,15,12,16,-1,16,12,11,-1,13,17,14,-1,14,17,18,-1,17,19,18,-1,18,19,20,-1,18,20,21,-1,21,20,22,-1,21,22,23,-1,23,22,24,-1,23,24,25,-1,25,24,26,-1,25,26,27,-1,27,26,28,-1,27,28,29,-1,29,28,30,-1,29,30,31,-1,31,30,32,-1,31,32,33,-1,33,32,34,-1,33,34,35,-1,35,34,36,-1,35,36,37,-1,37,36,38,-1,37,38,39,-1,39,38,40,-1,39,40,41,-1,41,40,42,-1,41,42,43,-1,43,42,44,-1,43,44,45,-1,45,44,46,-1,45,46,47,-1,47,46,48,-1,47,48,49,-1,49,48,50,-1,49,50,51,-1,51,50,52,-1,51,52,53,-1,53,52,54,-1,53,54,55,-1,55,54,56,-1,55,56,57,-1,57,56,58,-1,57,58,59,-1,59,58,60,-1,59,60,61,-1,61,60,62,-1,61,62,63,-1,63,62,64,-1,63,64,65,-1,65,64,66,-1,65,66,67,-1,67,66,68,-1,67,68,69,-1,69,68,70,-1,69,70,71,-1,71,70,72,-1,71,72,73,-1,73,72,74,-1,73,74,75,-1,75,74,76,-1,75,76,77,-1,78,77,79,-1,79,77,76,-1,78,79,80,-1,78,80,81,-1,81,80,82,-1,81,82,83,-1,83,82,84,-1,83,84,85,-1,85,84,86,-1,85,86,87,-1,87,86,88,-1,87,88,89,-1,88,90,89,-1,89,90,91,-1,90,92,91,-1,91,92,93,-1,91,93,94,-1,94,93,95,-1,94,95,96,-1,96,95,97,-1,96,97,98,-1,98,97,99,-1,98,99,100,-1,100,99,101,-1,100,101,102,-1,102,101,103,-1,102,103,104,-1,105,106,107,-1,104,103,108,-1,104,108,109,-1,109,108,110,-1,109,110,107,-1,107,110,111,-1,107,111,105,-1,106,105,112,-1,106,112,113,-1,113,112,114,-1,113,114,115,-1,115,114,116,-1,115,116,117,-1,117,116,118,-1,117,118,119,-1,119,118,120,-1,119,120,121,-1,121,120,122,-1,121,122,123,-1,123,122,124,-1,123,124,125,-1,125,124,126,-1,125,126,127,-1,127,126,128,-1,127,128,129,-1,129,128,130,-1,129,130,131,-1,131,130,132,-1,131,132,133,-1,133,132,134,-1,133,134,135,-1,135,134,136,-1,135,136,137,-1,137,136,4,-1,137,4,3,-1,63,65,87,-1,87,65,85,-1,119,37,117,-1,117,37,39,-1,117,39,115,-1,115,39,41,-1,115,41,113,-1,41,43,113,-1,113,43,45,-1,113,45,106,-1,106,45,47,-1,21,23,129,-1,129,23,25,-1,129,25,127,-1,127,25,27,-1,127,27,125,-1,125,27,29,-1,125,29,123,-1,123,29,31,-1,123,31,121,-1,121,31,33,-1,121,33,119,-1,119,33,35,-1,119,35,37,-1,14,3,12,-1,12,3,6,-1,12,6,9,-1,9,6,2,-1,9,2,1,-1,65,67,85,-1,85,67,69,-1,85,69,83,-1,83,69,71,-1,83,71,81,-1,81,71,73,-1,81,73,78,-1,78,73,75,-1,78,75,77,-1,129,131,21,-1,21,131,133,-1,21,133,18,-1,18,133,135,-1,18,135,14,-1,14,135,137,-1,14,137,3,-1,87,89,63,-1,63,89,91,-1,63,91,61,-1,61,91,94,-1,61,94,59,-1,59,94,96,-1,59,96,57,-1,57,96,98,-1,57,98,55,-1,55,98,100,-1,55,100,53,-1,53,100,102,-1,53,102,51,-1,51,102,104,-1,51,104,49,-1,49,104,109,-1,49,109,47,-1,47,109,107,-1,47,107,106,-1,138,139,140,-1,140,139,141,-1,142,138,143,-1,143,138,140,-1,142,143,144,-1,142,144,145,-1,145,144,146,-1,145,146,147,-1,148,147,149,-1,149,147,146,-1,150,148,151,-1,151,148,149,-1,150,151,152,-1,152,151,153,-1,152,153,154,-1,155,152,156,-1,156,152,154,-1,155,156,157,-1,157,156,158,-1,157,158,159,-1,160,161,162,-1,162,161,157,-1,162,157,159,-1,161,160,163,-1,161,163,164,-1,164,163,165,-1,164,165,166,-1,165,167,166,-1,166,167,168,-1,166,168,169,-1,169,168,170,-1,169,170,171,-1,171,170,172,-1,171,172,173,-1,173,172,174,-1,173,174,175,-1,175,174,176,-1,175,176,177,-1,178,177,179,-1,179,177,176,-1,178,179,180,-1,178,180,181,-1,181,180,182,-1,181,182,183,-1,183,182,184,-1,183,184,185,-1,185,184,186,-1,185,186,187,-1,186,188,187,-1,187,188,189,-1,187,189,190,-1,190,189,191,-1,190,191,192,-1,192,191,193,-1,192,193,194,-1,194,193,195,-1,194,195,196,-1,141,139,197,-1,197,139,196,-1,197,196,195,-1,145,147,196,-1,139,138,196,-1,196,138,142,-1,196,142,145,-1,152,155,150,-1,150,155,157,-1,150,157,148,-1,177,178,175,-1,175,178,181,-1,175,181,173,-1,173,181,183,-1,173,183,171,-1,171,183,185,-1,171,185,169,-1,169,185,187,-1,169,187,166,-1,166,187,190,-1,166,190,164,-1,164,190,192,-1,164,192,161,-1,161,192,194,-1,161,194,157,-1,157,194,196,-1,157,196,148,-1,148,196,147,-1,198,199,200,-1,200,199,201,-1,198,200,202,-1,202,200,203,-1,202,203,204,-1,205,202,206,-1,206,202,204,-1,205,206,207,-1,207,206,208,-1,207,208,209,-1,210,207,211,-1,211,207,209,-1,212,213,214,-1,214,213,210,-1,214,210,211,-1,215,213,216,-1,216,213,212,-1,217,218,219,-1,219,218,215,-1,219,215,216,-1,220,218,221,-1,221,218,217,-1,222,223,224,-1,224,223,220,-1,224,220,221,-1,225,223,226,-1,226,223,222,-1,225,226,199,-1,199,226,227,-1,199,227,201,-1,225,199,198,-1,198,202,225,-1,225,202,205,-1,225,205,223,-1,218,220,215,-1,215,220,223,-1,215,223,213,-1,213,223,205,-1,213,205,210,-1,210,205,207,-1,228,229,230,-1,230,229,231,-1,230,231,232,-1,232,231,233,-1,232,233,234,-1,234,233,235,-1,234,235,236,-1,236,235,237,-1,236,237,238,-1,238,237,239,-1,238,239,240,-1,240,239,241,-1,240,241,242,-1,242,241,243,-1,242,243,244,-1,244,243,245,-1,244,245,246,-1,246,245,247,-1,246,247,248,-1,248,247,249,-1,248,249,250,-1,250,249,251,-1,250,251,252,-1,252,251,253,-1,252,253,254,-1,254,253,255,-1,254,255,256,-1,256,255,257,-1,256,257,258,-1,258,257,259,-1,258,259,260,-1,260,259,261,-1,260,261,262,-1,262,261,263,-1,262,263,228,-1,228,263,229,-1,229,263,264,-1,264,263,265,-1,229,264,266,-1,229,266,231,-1,231,266,267,-1,231,267,233,-1,233,267,268,-1,233,268,235,-1,235,268,269,-1,235,269,237,-1,237,269,270,-1,237,270,239,-1,239,270,271,-1,239,271,241,-1,241,271,272,-1,241,272,243,-1,243,272,273,-1,243,273,245,-1,245,273,274,-1,245,274,247,-1,247,274,275,-1,247,275,249,-1,249,275,276,-1,249,276,251,-1,251,276,277,-1,251,277,253,-1,253,277,278,-1,253,278,255,-1,255,278,279,-1,255,279,257,-1,257,279,280,-1,257,280,259,-1,261,259,281,-1,281,259,280,-1,263,261,265,-1,265,261,281,-1,258,260,282,-1,282,260,283,-1,260,262,283,-1,283,262,284,-1,262,228,284,-1,284,228,285,-1,236,286,287,-1,236,287,234,-1,234,287,288,-1,234,288,232,-1,232,288,289,-1,232,289,230,-1,230,289,285,-1,230,285,228,-1,244,290,291,-1,244,291,242,-1,242,291,292,-1,242,292,240,-1,240,292,293,-1,240,293,238,-1,238,293,286,-1,238,286,236,-1,252,294,295,-1,252,295,250,-1,250,295,296,-1,250,296,248,-1,248,296,297,-1,248,297,246,-1,246,297,290,-1,246,290,244,-1,258,282,298,-1,258,298,256,-1,256,298,299,-1,256,299,254,-1,254,299,294,-1,254,294,252,-1,
		]
	}
}
Shape{
	appearance Appearance {
		material  Material 	{ 
			diffuseColor 0.2235294117647059 0.2235294117647059 0.2235294117647059 
			specularColor 0.11372549019607843 0.11372549019607843 0.11372549019607843
			ambientIntensity 0.2
			transparency 0.0
			shininess 0.5
		}
	}
	geometry IndexedFaceSet {
		ccw TRUE 
		solid FALSE
		coord DEF co Coordinate {
			point [
				-0.0145 -0.3079 0.3543, -0.0145 -0.3365 0.3543, -0.0089 -0.3079 0.3543, -0.0091 -0.3365 0.3543, -0.0044 -0.3359 0.3543, -0.0012 -0.3348 0.3543, 0.0012 -0.3332 0.3543, 0.0019 -0.3326 0.3543, 0.0037 -0.3303 0.3543, 0.005 -0.3275 0.3543, 0.0057 -0.3242 0.3543, 0.0059 -0.3218 0.3543, 0.0054 -0.3175 0.3543, 0.0044 -0.3147 0.3543, 0.003 -0.3126 0.3543, 0.0018 -0.3114 0.3543, -0.0041 -0.3084 0.3543, -0.0009 -0.3096 0.3543, -0.0009 -0.3096 0.3543
			]
		}
		coordIndex [
			0,1,2,-1,2,1,3,-1,2,3,4,-1,4,5,2,-1,2,5,6,-1,2,6,7,-1,7,8,2,-1,2,8,9,-1,2,9,10,-1,10,11,2,-1,2,11,12,-1,2,12,13,-1,13,14,2,-1,2,14,15,-1,2,15,16,-1,16,15,17,-1,
		]
	}
}
Shape{
	appearance Appearance {
		material  Material 	{ 
			diffuseColor 1.0 1.0 1.0 
			specularColor 0.5019607843137255 0.5019607843137255 0.5019607843137255
			ambientIntensity 0.2
			transparency 0.0
			shininess 0.5
		}
	}
	geometry IndexedFaceSet {
		ccw TRUE 
		solid FALSE
		coord DEF co Coordinate {
			point [
				0.0233 -0.3264 0.3583, 0.0218 -0.3305 0.3583, 0.0358 -0.3264 0.3583, 0.0372 -0.3305 0.3583, 0.0289 -0.3109 0.3583, 0.0271 -0.3036 0.3583, 0.0129 -0.3407 0.3583, 0.0182 -0.3407 0.3583, 0.0292 -0.3098 0.3583, 0.0295 -0.3083 0.3583, 0.0322 -0.3036 0.3583, 0.0296 -0.3083 0.3583, 0.0299 -0.3099 0.3583, 0.0302 -0.3109 0.3583, 0.0463 -0.3407 0.3583, 0.041 -0.3407 0.3583, 0.0322 -0.3036 0.3543, 0.0463 -0.3407 0.3543, 0.0271 -0.3036 0.3543, 0.0129 -0.3407 0.3543, 0.0182 -0.3407 0.3543, 0.0218 -0.3305 0.3543, 0.0372 -0.3305 0.3543, 0.041 -0.3407 0.3543, 0.0233 -0.3264 0.3543, 0.0358 -0.3264 0.3543, 0.0302 -0.3109 0.3543, 0.0296 -0.3083 0.3543, 0.0299 -0.3099 0.3543, 0.0295 -0.3083 0.3543, 0.0289 -0.3109 0.3543, 0.0292 -0.3098 0.3543, 0.0292 -0.3098 0.3543
			]
		}
		coordIndex [
			0,1,2,-1,2,1,3,-1,4,5,0,-1,0,5,6,-1,0,6,1,-1,1,6,7,-1,4,8,5,-1,5,8,9,-1,5,9,10,-1,10,9,11,-1,10,11,12,-1,12,13,10,-1,10,13,2,-1,10,2,14,-1,14,2,3,-1,14,3,15,-1,10,14,16,-1,16,14,17,-1,5,10,18,-1,18,10,16,-1,6,5,19,-1,19,5,18,-1,7,6,20,-1,20,6,19,-1,1,7,21,-1,21,7,20,-1,3,1,22,-1,22,1,21,-1,15,3,23,-1,23,3,22,-1,14,15,17,-1,17,15,23,-1,0,2,24,-1,24,2,25,-1,2,13,25,-1,25,13,26,-1,11,27,28,-1,11,28,12,-1,12,28,26,-1,12,26,13,-1,11,9,27,-1,27,9,29,-1,4,30,31,-1,4,31,8,-1,8,31,29,-1,8,29,9,-1,4,0,30,-1,30,0,24,-1,
		]
	}
}
Shape{
	appearance Appearance {
		material  Material 	{ 
			diffuseColor 0.2235294117647059 0.2235294117647059 0.2235294117647059 
			specularColor 0.11372549019607843 0.11372549019607843 0.11372549019607843
			ambientIntensity 0.2
			transparency 0.0
			shininess 0.5
		}
	}
	geometry IndexedFaceSet {
		ccw TRUE 
		solid FALSE
		coord DEF co Coordinate {
			point [
				0.0296 -0.3083 0.3543, 0.0295 -0.3083 0.3543, 0.0299 -0.3099 0.3543, 0.0292 -0.3098 0.3543, 0.0302 -0.3109 0.3543, 0.0289 -0.3109 0.3543, 0.0358 -0.3264 0.3543, 0.0233 -0.3264 0.3543, 0.0233 -0.3264 0.3543
			]
		}
		coordIndex [
			0,1,2,-1,2,1,3,-1,2,3,4,-1,4,3,5,-1,4,5,6,-1,6,5,7,-1,
		]
	}
}
Shape{
	appearance Appearance {
		material  Material 	{ 
			diffuseColor 1.0 1.0 1.0 
			specularColor 0.5019607843137255 0.5019607843137255 0.5019607843137255
			ambientIntensity 0.2
			transparency 0.0
			shininess 0.5
		}
	}
	geometry IndexedFaceSet {
		ccw TRUE 
		solid FALSE
		coord DEF co Coordinate {
			point [
				-0.3128 -0.3457 0.3583, -0.3089 -0.3506 0.3583, -0.315 -0.3226 0.3583, -0.3195 -0.2768 0.3583, -0.3136 -0.2737 0.3583, -0.3151 -0.2575 0.3583, -0.2986 -0.2567 0.3583, -0.2905 -0.276 0.3583, -0.2864 -0.2676 0.3583, -0.2638 -0.3318 0.3583, -0.2638 -0.3292 0.3583, -0.2862 -0.3228 0.3583, -0.2887 -0.322 0.3583, -0.3047 -0.2562 0.3583, -0.2823 -0.3259 0.3583, -0.281 -0.3281 0.3583, -0.264 -0.3345 0.3583, -0.227 -0.3097 0.3583, -0.2351 -0.2957 0.3583, -0.2704 -0.3142 0.3583, -0.2905 -0.3218 0.3583, -0.293 -0.3221 0.3583, -0.2961 -0.3059 0.3583, -0.2953 -0.323 0.3583, -0.302 -0.3081 0.3583, -0.2973 -0.3245 0.3583, -0.3074 -0.3117 0.3583, -0.2986 -0.3259 0.3583, -0.3118 -0.3166 0.3583, -0.2999 -0.3281 0.3583, -0.3006 -0.3306 0.3583, -0.2804 -0.3071 0.3583, -0.2867 -0.3054 0.3583, -0.2902 -0.3052 0.3583, -0.284 -0.3241 0.3583, -0.2974 -0.3397 0.3583, -0.2953 -0.3412 0.3583, -0.3038 -0.3545 0.3583, -0.2929 -0.3421 0.3583, -0.2183 -0.2836 0.3583, -0.2161 -0.2836 0.3583, -0.2053 -0.2694 0.3583, -0.2112 -0.2842 0.3583, -0.2041 -0.2698 0.3583, -0.2066 -0.286 0.3583, -0.1963 -0.2737 0.3583, -0.1891 -0.2797 0.3583, -0.2932 -0.2504 0.3583, -0.2805 -0.2605 0.3583, -0.287 -0.2451 0.3583, -0.2735 -0.2554 0.3583, -0.2806 -0.2412 0.3583, -0.3203 -0.3194 0.3583, -0.3186 -0.3393 0.3583, -0.3152 -0.3403 0.3583, -0.3071 -0.2722 0.3583, -0.3044 -0.272 0.3583, -0.3017 -0.2564 0.3583, -0.2987 -0.2727 0.3583, -0.2927 -0.2747 0.3583, -0.2748 -0.3101 0.3583, -0.2025 -0.2888 0.3583, -0.1994 -0.2923 0.3583, -0.1837 -0.2872 0.3583, -0.1969 -0.2969 0.3583, -0.1805 -0.2952 0.3583, -0.1792 -0.3039 0.3583, -0.1957 -0.3019 0.3583, -0.1956 -0.3042 0.3583, -0.1804 -0.3133 0.3583, -0.1962 -0.3093 0.3583, -0.1837 -0.3216 0.3583, -0.198 -0.314 0.3583, -0.189 -0.3289 0.3583, -0.3249 -0.2613 0.3583, -0.3333 -0.2672 0.3583, -0.3244 -0.2812 0.3583, -0.335 -0.2689 0.3583, -0.3279 -0.2865 0.3583, -0.3414 -0.277 0.3583, -0.3301 -0.2924 0.3583, -0.299 -0.3378 0.3583, -0.3001 -0.3356 0.3583, -0.3007 -0.3332 0.3583, -0.2009 -0.3181 0.3583, -0.2013 -0.3185 0.3583, -0.1961 -0.335 0.3583, -0.2052 -0.3217 0.3583, -0.2042 -0.3389 0.3583, -0.2099 -0.3238 0.3583, -0.213 -0.3408 0.3583, -0.2146 -0.3247 0.3583, -0.2285 -0.3408 0.3583, -0.2264 -0.3247 0.3583, -0.2299 -0.3406 0.3583, -0.2196 -0.2486 0.3583, -0.23 -0.2606 0.3583, -0.2109 -0.2586 0.3583, -0.224 -0.2676 0.3583, -0.2199 -0.2761 0.3583, -0.2803 -0.3305 0.3583, -0.2802 -0.333 0.3583, -0.2655 -0.341 0.3583, -0.2808 -0.3356 0.3583, -0.2686 -0.3469 0.3583, -0.282 -0.3379 0.3583, -0.273 -0.3518 0.3583, -0.2836 -0.3398 0.3583, -0.2783 -0.3553 0.3583, -0.2856 -0.3412 0.3583, -0.2842 -0.3575 0.3583, -0.2879 -0.3421 0.3583, -0.2902 -0.3582 0.3583, -0.2905 -0.3424 0.3583, -0.2915 -0.3582 0.3583, -0.2977 -0.3571 0.3583, -0.2685 -0.2365 0.3583, -0.2649 -0.2519 0.3583, -0.2554 -0.2349 0.3583, -0.2552 -0.2507 0.3583, -0.2446 -0.236 0.3583, -0.2462 -0.2518 0.3583, -0.2313 -0.2407 0.3583, -0.2379 -0.255 0.3583, -0.2305 -0.2601 0.3583, -0.3456 -0.2865 0.3583, -0.3473 -0.2964 0.3583, -0.3308 -0.2984 0.3583, -0.3474 -0.2989 0.3583, -0.3305 -0.3025 0.3583, -0.3461 -0.3093 0.3583, -0.3285 -0.309 0.3583, -0.3423 -0.3191 0.3583, -0.3251 -0.3147 0.3583, -0.3363 -0.3276 0.3583, -0.3281 -0.3346 0.3583, -0.2277 -0.3245 0.3583, -0.2341 -0.338 0.3583, -0.2334 -0.3388 0.3583, -0.2362 -0.3326 0.3583, -0.2359 -0.3346 0.3583, -0.2353 -0.3363 0.3583, -0.227 -0.3247 0.3583, -0.2316 -0.34 0.3583, -0.23 -0.3247 0.3583, -0.2318 -0.3254 0.3583, -0.2361 -0.3318 0.3583, -0.2334 -0.3265 0.3583, -0.2347 -0.328 0.3583, -0.2357 -0.3298 0.3583, -0.228 -0.3245 0.3583, -0.1873 -0.2822 0.3543, -0.1837 -0.2872 0.3543, -0.1814 -0.2931 0.3543, -0.1805 -0.2952 0.3543, -0.1792 -0.3039 0.3543, -0.1891 -0.2797 0.3543, -0.1963 -0.2737 0.3543, -0.2041 -0.2698 0.3543, -0.2053 -0.2694 0.3543, -0.2109 -0.2586 0.3543, -0.2196 -0.2486 0.3543, -0.2256 -0.2445 0.3543, -0.2313 -0.2407 0.3543, -0.2446 -0.236 0.3543, -0.2554 -0.2349 0.3543, -0.287 -0.2451 0.3543, -0.286 -0.2445 0.3543, -0.2806 -0.2412 0.3543, -0.2685 -0.2365 0.3543, -0.2932 -0.2504 0.3543, -0.2986 -0.2567 0.3543, -0.3017 -0.2564 0.3543, -0.3047 -0.2562 0.3543, -0.3151 -0.2575 0.3543, -0.3249 -0.2613 0.3543, -0.3333 -0.2672 0.3543, -0.335 -0.2689 0.3543, -0.3414 -0.277 0.3543, -0.3437 -0.2822 0.3543, -0.3445 -0.284 0.3543, -0.3456 -0.2865 0.3543, -0.3467 -0.2931 0.3543, -0.3473 -0.2964 0.3543, -0.3474 -0.2989 0.3543, -0.3363 -0.3276 0.3543, -0.3461 -0.3093 0.3543, -0.3445 -0.3135 0.3543, -0.3423 -0.3191 0.3543, -0.3281 -0.3346 0.3543, -0.3186 -0.3393 0.3543, -0.3152 -0.3403 0.3543, -0.3149 -0.341 0.3543, -0.3128 -0.3457 0.3543, -0.3089 -0.3506 0.3543, -0.3038 -0.3545 0.3543, -0.3011 -0.3557 0.3543, -0.2977 -0.3571 0.3543, -0.2915 -0.3582 0.3543, -0.2902 -0.3582 0.3543, -0.2842 -0.3575 0.3543, -0.2792 -0.3557 0.3543, -0.2783 -0.3553 0.3543, -0.273 -0.3518 0.3543, -0.2686 -0.3469 0.3543, -0.2655 -0.341 0.3543, -0.2655 -0.341 0.3543, -0.264 -0.3345 0.3543, -0.2638 -0.3318 0.3543, -0.2638 -0.3292 0.3543, -0.227 -0.3097 0.3543, -0.2351 -0.2957 0.3543, -0.2704 -0.3142 0.3543, -0.2748 -0.3101 0.3543, -0.2804 -0.3071 0.3543, -0.2867 -0.3054 0.3543, -0.2902 -0.3052 0.3543, -0.2961 -0.3059 0.3543, -0.302 -0.3081 0.3543, -0.3074 -0.3117 0.3543, -0.3118 -0.3166 0.3543, -0.315 -0.3226 0.3543, -0.3203 -0.3194 0.3543, -0.3251 -0.3147 0.3543, -0.3285 -0.309 0.3543, -0.3305 -0.3025 0.3543, -0.3308 -0.2984 0.3543, -0.3302 -0.2931 0.3543, -0.3301 -0.2924 0.3543, -0.3279 -0.2865 0.3543, -0.325 -0.2822 0.3543, -0.3244 -0.2812 0.3543, -0.3195 -0.2768 0.3543, -0.3136 -0.2737 0.3543, -0.3071 -0.2722 0.3543, -0.3044 -0.272 0.3543, -0.2987 -0.2727 0.3543, -0.2927 -0.2747 0.3543, -0.2905 -0.276 0.3543, -0.2864 -0.2676 0.3543, -0.2805 -0.2605 0.3543, -0.2735 -0.2554 0.3543, -0.2649 -0.2519 0.3543, -0.2552 -0.2507 0.3543, -0.2183 -0.2836 0.3543, -0.2186 -0.2822 0.3543, -0.2199 -0.2761 0.3543, -0.224 -0.2676 0.3543, -0.23 -0.2606 0.3543, -0.2305 -0.2601 0.3543, -0.2379 -0.255 0.3543, -0.2462 -0.2518 0.3543, -0.2161 -0.2836 0.3543, -0.2112 -0.2842 0.3543, -0.2066 -0.286 0.3543, -0.2025 -0.2888 0.3543, -0.1994 -0.2923 0.3543, -0.199 -0.2931 0.3543, -0.1969 -0.2969 0.3543, -0.1957 -0.3019 0.3543, -0.1956 -0.3042 0.3543, -0.1962 -0.3093 0.3543, -0.198 -0.314 0.3543, -0.2009 -0.3181 0.3543, -0.2013 -0.3185 0.3543, -0.2052 -0.3217 0.3543, -0.2099 -0.3238 0.3543, -0.2146 -0.3247 0.3543, -0.2264 -0.3247 0.3543, -0.227 -0.3247 0.3543, -0.2277 -0.3245 0.3543, -0.228 -0.3245 0.3543, -0.23 -0.3247 0.3543, -0.2318 -0.3254 0.3543, -0.2334 -0.3265 0.3543, -0.2347 -0.328 0.3543, -0.2357 -0.3298 0.3543, -0.2361 -0.3318 0.3543, -0.2362 -0.3326 0.3543, -0.2359 -0.3346 0.3543, -0.2353 -0.3363 0.3543, -0.2341 -0.338 0.3543, -0.2334 -0.3388 0.3543, -0.2316 -0.34 0.3543, -0.2299 -0.3406 0.3543, -0.2285 -0.3408 0.3543, -0.213 -0.3408 0.3543, -0.2042 -0.3389 0.3543, -0.1961 -0.335 0.3543, -0.189 -0.3289 0.3543, -0.1837 -0.3216 0.3543, -0.1804 -0.3133 0.3543, -0.2905 -0.3218 0.3543, -0.2887 -0.322 0.3543, -0.2862 -0.3228 0.3543, -0.284 -0.3241 0.3543, -0.2823 -0.3259 0.3543, -0.281 -0.3281 0.3543, -0.2803 -0.3305 0.3543, -0.2802 -0.333 0.3543, -0.2808 -0.3356 0.3543, -0.282 -0.3379 0.3543, -0.2836 -0.3398 0.3543, -0.2856 -0.3412 0.3543, -0.2879 -0.3421 0.3543, -0.2905 -0.3424 0.3543, -0.2929 -0.3421 0.3543, -0.2953 -0.3412 0.3543, -0.2974 -0.3397 0.3543, -0.299 -0.3378 0.3543, -0.3001 -0.3356 0.3543, -0.3007 -0.3332 0.3543, -0.3006 -0.3306 0.3543, -0.2999 -0.3281 0.3543, -0.2986 -0.3259 0.3543, -0.2973 -0.3245 0.3543, -0.2953 -0.323 0.3543, -0.293 -0.3221 0.3543, -0.293 -0.3221 0.3543
			]
		}
		coordIndex [
			0,1,2,-1,3,4,5,-1,6,7,8,-1,9,10,11,-1,11,10,12,-1,5,4,13,-1,14,15,16,-1,17,18,10,-1,10,18,19,-1,10,19,12,-1,12,19,20,-1,21,22,23,-1,23,22,24,-1,23,24,25,-1,25,24,26,-1,25,26,27,-1,27,26,28,-1,27,28,29,-1,29,28,2,-1,29,2,30,-1,31,32,21,-1,21,32,33,-1,21,33,22,-1,9,11,16,-1,16,11,34,-1,16,34,14,-1,35,1,36,-1,36,1,37,-1,36,37,38,-1,39,40,41,-1,41,40,42,-1,41,42,43,-1,43,42,44,-1,43,44,45,-1,45,44,46,-1,6,8,47,-1,47,8,48,-1,47,48,49,-1,49,48,50,-1,49,50,51,-1,52,53,2,-1,2,53,54,-1,2,54,0,-1,4,55,13,-1,13,55,56,-1,13,56,57,-1,57,56,58,-1,57,58,6,-1,6,58,59,-1,6,59,7,-1,20,19,21,-1,21,19,60,-1,21,60,31,-1,44,61,46,-1,46,61,62,-1,46,62,63,-1,63,62,64,-1,63,64,65,-1,65,64,66,-1,64,67,66,-1,66,67,68,-1,66,68,69,-1,69,68,70,-1,69,70,71,-1,71,70,72,-1,71,72,73,-1,5,74,3,-1,3,74,75,-1,3,75,76,-1,76,75,77,-1,76,77,78,-1,78,77,79,-1,78,79,80,-1,35,81,1,-1,1,81,82,-1,1,82,2,-1,2,82,83,-1,2,83,30,-1,72,84,73,-1,73,84,85,-1,73,85,86,-1,86,85,87,-1,86,87,88,-1,88,87,89,-1,88,89,90,-1,90,89,91,-1,90,91,92,-1,92,91,93,-1,92,93,94,-1,95,96,97,-1,97,96,98,-1,97,98,41,-1,41,98,99,-1,41,99,39,-1,15,100,16,-1,16,100,101,-1,16,101,102,-1,102,101,103,-1,102,103,104,-1,104,103,105,-1,104,105,106,-1,106,105,107,-1,106,107,108,-1,108,107,109,-1,108,109,110,-1,110,109,111,-1,110,111,112,-1,112,111,113,-1,112,113,114,-1,114,113,38,-1,114,38,115,-1,115,38,37,-1,51,50,116,-1,116,50,117,-1,116,117,118,-1,118,117,119,-1,118,119,120,-1,120,119,121,-1,120,121,122,-1,122,121,123,-1,122,123,95,-1,95,123,124,-1,95,124,96,-1,79,125,80,-1,80,125,126,-1,80,126,127,-1,127,126,128,-1,127,128,129,-1,129,128,130,-1,129,130,131,-1,131,130,132,-1,131,132,133,-1,133,132,134,-1,133,134,52,-1,52,134,135,-1,52,135,53,-1,136,137,138,-1,139,140,136,-1,136,140,141,-1,136,141,137,-1,93,142,94,-1,94,142,136,-1,94,136,143,-1,143,136,138,-1,144,145,146,-1,145,147,146,-1,146,147,148,-1,146,148,149,-1,139,136,146,-1,146,136,150,-1,146,150,144,-1,151,46,152,-1,152,46,63,-1,152,63,153,-1,153,63,65,-1,153,65,154,-1,154,65,66,-1,154,66,155,-1,151,156,46,-1,46,156,157,-1,46,157,45,-1,45,157,158,-1,45,158,43,-1,43,158,159,-1,43,159,41,-1,41,159,160,-1,41,160,97,-1,97,160,161,-1,97,161,95,-1,95,161,122,-1,122,161,162,-1,162,163,122,-1,122,163,164,-1,122,164,120,-1,120,164,165,-1,120,165,118,-1,166,49,167,-1,167,49,51,-1,167,51,168,-1,168,51,116,-1,168,116,169,-1,169,116,118,-1,169,118,165,-1,49,166,170,-1,49,170,47,-1,47,170,171,-1,47,171,6,-1,6,171,172,-1,6,172,57,-1,57,172,173,-1,57,173,13,-1,13,173,174,-1,13,174,5,-1,5,174,175,-1,5,175,74,-1,74,175,176,-1,74,176,75,-1,75,176,177,-1,75,177,77,-1,77,177,178,-1,179,125,178,-1,178,125,79,-1,178,79,77,-1,179,180,125,-1,125,180,181,-1,125,181,126,-1,126,181,182,-1,182,183,126,-1,126,183,184,-1,126,184,128,-1,185,134,132,-1,128,184,186,-1,128,186,130,-1,130,186,187,-1,130,187,132,-1,132,187,188,-1,132,188,185,-1,134,185,189,-1,134,189,135,-1,135,189,190,-1,135,190,53,-1,53,190,191,-1,53,191,54,-1,54,191,192,-1,54,192,0,-1,192,193,0,-1,0,193,194,-1,0,194,1,-1,1,194,195,-1,1,195,37,-1,37,195,196,-1,37,196,115,-1,196,197,115,-1,115,197,198,-1,115,198,114,-1,114,198,199,-1,114,199,112,-1,112,199,200,-1,112,200,110,-1,110,200,201,-1,110,201,108,-1,201,202,108,-1,108,202,203,-1,108,203,106,-1,106,203,204,-1,106,204,104,-1,104,204,205,-1,206,16,205,-1,205,16,102,-1,205,102,104,-1,206,207,16,-1,16,207,208,-1,16,208,9,-1,10,9,209,-1,209,9,208,-1,17,10,210,-1,210,10,209,-1,18,17,211,-1,211,17,210,-1,19,18,212,-1,212,18,211,-1,19,212,213,-1,19,213,60,-1,60,213,214,-1,60,214,31,-1,31,214,215,-1,31,215,32,-1,32,215,216,-1,32,216,33,-1,33,216,217,-1,33,217,22,-1,22,217,218,-1,22,218,24,-1,24,218,219,-1,24,219,26,-1,26,219,220,-1,26,220,28,-1,28,220,221,-1,28,221,2,-1,2,221,222,-1,2,222,52,-1,52,222,223,-1,52,223,133,-1,133,223,224,-1,133,224,131,-1,131,224,225,-1,131,225,129,-1,129,225,226,-1,129,226,127,-1,226,227,127,-1,127,227,80,-1,227,228,80,-1,80,228,229,-1,80,229,78,-1,78,229,230,-1,78,230,76,-1,230,231,76,-1,76,231,232,-1,76,232,3,-1,3,232,233,-1,3,233,4,-1,4,233,234,-1,4,234,55,-1,55,234,235,-1,55,235,56,-1,56,235,236,-1,56,236,58,-1,58,236,237,-1,58,237,59,-1,59,237,238,-1,59,238,7,-1,7,238,239,-1,7,239,8,-1,8,239,240,-1,8,240,48,-1,48,240,241,-1,48,241,50,-1,50,241,242,-1,50,242,117,-1,117,242,243,-1,117,243,119,-1,244,39,245,-1,245,39,99,-1,245,99,246,-1,246,99,98,-1,246,98,247,-1,247,98,96,-1,247,96,248,-1,248,96,124,-1,248,124,249,-1,249,124,123,-1,249,123,250,-1,250,123,121,-1,250,121,251,-1,251,121,119,-1,251,119,243,-1,40,39,252,-1,252,39,244,-1,40,252,253,-1,40,253,42,-1,42,253,254,-1,42,254,44,-1,44,254,255,-1,44,255,61,-1,61,255,256,-1,61,256,62,-1,62,256,257,-1,62,257,64,-1,257,258,64,-1,64,258,259,-1,64,259,67,-1,67,259,260,-1,67,260,68,-1,68,260,261,-1,68,261,70,-1,70,261,262,-1,70,262,72,-1,72,262,263,-1,72,263,84,-1,84,263,264,-1,84,264,85,-1,85,264,265,-1,85,265,87,-1,87,265,266,-1,87,266,89,-1,89,266,267,-1,89,267,91,-1,93,91,268,-1,268,91,267,-1,93,268,269,-1,93,269,142,-1,142,269,270,-1,142,270,136,-1,136,270,271,-1,136,271,150,-1,150,271,272,-1,150,272,144,-1,144,272,273,-1,144,273,145,-1,145,273,274,-1,145,274,147,-1,147,274,275,-1,147,275,148,-1,148,275,276,-1,148,276,149,-1,149,276,277,-1,149,277,146,-1,146,277,278,-1,146,278,139,-1,139,278,279,-1,139,279,140,-1,140,279,280,-1,140,280,141,-1,141,280,281,-1,141,281,137,-1,137,281,282,-1,137,282,138,-1,138,282,283,-1,138,283,143,-1,143,283,284,-1,143,284,94,-1,94,284,285,-1,94,285,92,-1,90,92,286,-1,286,92,285,-1,90,286,287,-1,90,287,88,-1,88,287,288,-1,88,288,86,-1,86,288,289,-1,86,289,73,-1,73,289,290,-1,73,290,71,-1,71,290,291,-1,71,291,69,-1,69,291,155,-1,69,155,66,-1,20,292,293,-1,20,293,12,-1,12,293,294,-1,12,294,11,-1,11,294,295,-1,11,295,34,-1,34,295,296,-1,34,296,14,-1,14,296,297,-1,14,297,15,-1,15,297,298,-1,15,298,100,-1,100,298,299,-1,100,299,101,-1,101,299,300,-1,101,300,103,-1,103,300,301,-1,103,301,105,-1,105,301,302,-1,105,302,107,-1,107,302,303,-1,107,303,109,-1,109,303,304,-1,109,304,111,-1,111,304,305,-1,111,305,113,-1,113,305,306,-1,113,306,38,-1,38,306,307,-1,38,307,36,-1,36,307,308,-1,36,308,35,-1,35,308,309,-1,35,309,81,-1,81,309,310,-1,81,310,82,-1,82,310,311,-1,82,311,83,-1,83,311,312,-1,83,312,30,-1,30,312,313,-1,30,313,29,-1,29,313,314,-1,29,314,27,-1,27,314,315,-1,27,315,25,-1,25,315,316,-1,25,316,23,-1,23,316,317,-1,23,317,21,-1,21,317,292,-1,21,292,20,-1,
		]
	}
}
Shape{
	appearance Appearance {
		material  Material 	{ 
			diffuseColor 0.2235294117647059 0.2235294117647059 0.2235294117647059 
			specularColor 0.11372549019607843 0.11372549019607843 0.11372549019607843
			ambientIntensity 0.2
			transparency 0.0
			shininess 0.5
		}
	}
	geometry IndexedFaceSet {
		ccw TRUE 
		solid FALSE
		coord DEF co Coordinate {
			point [
				-0.2905 -0.3424 0.3543, -0.2973 -0.3245 0.3543, -0.2986 -0.3259 0.3543, -0.2905 -0.3218 0.3543, -0.2887 -0.322 0.3543, -0.2879 -0.3421 0.3543, -0.293 -0.3221 0.3543, -0.2953 -0.323 0.3543, -0.2836 -0.3398 0.3543, -0.2823 -0.3259 0.3543, -0.284 -0.3241 0.3543, -0.3001 -0.3356 0.3543, -0.299 -0.3378 0.3543, -0.2974 -0.3397 0.3543, -0.2856 -0.3412 0.3543, -0.2862 -0.3228 0.3543, -0.2999 -0.3281 0.3543, -0.3006 -0.3306 0.3543, -0.3007 -0.3332 0.3543, -0.2953 -0.3412 0.3543, -0.2929 -0.3421 0.3543, -0.2808 -0.3356 0.3543, -0.2802 -0.333 0.3543, -0.282 -0.3379 0.3543, -0.2803 -0.3305 0.3543, -0.281 -0.3281 0.3543, -0.281 -0.3281 0.3543
			]
		}
		coordIndex [
			0,1,2,-1,3,0,4,-1,4,0,5,-1,3,6,0,-1,0,6,7,-1,0,7,1,-1,8,9,10,-1,11,12,2,-1,2,12,13,-1,5,14,4,-1,4,14,8,-1,4,8,15,-1,15,8,10,-1,16,17,2,-1,2,17,18,-1,2,18,11,-1,13,19,2,-1,2,19,20,-1,2,20,0,-1,21,22,23,-1,23,22,24,-1,23,24,8,-1,8,24,25,-1,8,25,9,-1,
		]
	}
}