(footprint "SENSOR-TH_MQ-2" (version 20221018) (generator pcbnew)
  (layer "F.Cu")
  (descr "SENSOR-TH_MQ-2 footprint")
  (tags "SENSOR-TH_MQ-2 footprint")
  (attr smd)
  (fp_text reference "REF**" (at 0 -5.289307) (layer "F.SilkS")
      (effects (font (size 1 1) (thickness 0.15)))
    (tstamp ce7e29f1-c6f9-425d-971a-7e3c1e1922a3)
  )
  (fp_text value "SENSOR-TH_MQ-2" (at 0 5.289307) (layer "F.Fab")
      (effects (font (size 1 1) (thickness 0.15)))
    (tstamp 9df22a59-4428-4cd5-bdd0-574f0eeabe3a)
  )
  (fp_text user "REF**" (at 0 7.289307) (layer "F.Fab")
      (effects (font (size 1 1) (thickness 0.15)))
    (tstamp 02740688-821c-4e56-b3eb-17074e030a22)
  )
  (fp_line (start -2.910897 -0.561265) (end 0.64511 2.994742)
    (stroke (width 0.254001) (type solid)) (layer "F.SilkS") (tstamp 0a637c02-3a05-44ab-9225-590b1cca3475))
  (fp_line (start -2.910897 0.200737) (end -0.116891 2.994742)
    (stroke (width 0.254001) (type solid)) (layer "F.SilkS") (tstamp 982bfb56-1e4e-472a-871a-cdbce7a74f11))
  (fp_line (start -2.656896 -1.069266) (end 1.153112 2.740742)
    (stroke (width 0.254001) (type solid)) (layer "F.SilkS") (tstamp 9c0a996d-d346-4aec-ab73-998e733dbbce))
  (fp_line (start -2.402896 -1.577267) (end 1.661113 2.486741)
    (stroke (width 0.254001) (type solid)) (layer "F.SilkS") (tstamp 44ca1a67-d818-4483-883f-f88132ed5f27))
  (fp_line (start -1.894895 -2.085268) (end 2.169114 1.97874)
    (stroke (width 0.254001) (type solid)) (layer "F.SilkS") (tstamp dd6d50c2-0624-43c4-b54b-9348b93cff54))
  (fp_line (start -1.386894 -2.593269) (end 2.677115 1.470739)
    (stroke (width 0.254001) (type solid)) (layer "F.SilkS") (tstamp 5db370cf-4f68-4e81-afbd-2243c3d8ca71))
  (fp_line (start -0.624892 -2.847269) (end -2.910897 -0.561265)
    (stroke (width 0.254001) (type solid)) (layer "F.SilkS") (tstamp 4aff96fe-cdde-4fc2-98a8-877d02605bb1))
  (fp_line (start -0.624892 -2.847269) (end 2.931115 0.708738)
    (stroke (width 0.254001) (type solid)) (layer "F.SilkS") (tstamp 2f60b756-a08b-4bac-b83d-7b77e6d0f675))
  (fp_line (start -0.116891 2.740742) (end -0.370892 2.740742)
    (stroke (width 0.254001) (type solid)) (layer "F.SilkS") (tstamp a783f3fe-49fc-4cfc-8c47-5354c435a17d))
  (fp_line (start -0.116891 2.994742) (end 0.137109 2.994742)
    (stroke (width 0.254001) (type solid)) (layer "F.SilkS") (tstamp 3de8c7ba-51b4-4c4f-955c-bb793ccc3b61))
  (fp_line (start 0.137109 -2.847269) (end -2.910897 0.200737)
    (stroke (width 0.254001) (type solid)) (layer "F.SilkS") (tstamp 93a9e08f-ede0-4f5c-98ee-b158d4c4de95))
  (fp_line (start 0.137109 -2.847269) (end 2.931115 -0.053264)
    (stroke (width 0.254001) (type solid)) (layer "F.SilkS") (tstamp 1e770734-90a2-4ae6-9b3e-1311dc1faa41))
  (fp_line (start 0.64511 2.740742) (end 0.39111 2.740742)
    (stroke (width 0.254001) (type solid)) (layer "F.SilkS") (tstamp 3ec69684-002f-4f28-b6f9-c746f91d50cd))
  (fp_line (start 0.899111 -2.847269) (end -2.910897 0.962738)
    (stroke (width 0.254001) (type solid)) (layer "F.SilkS") (tstamp 958b5bc3-2276-405c-851e-41a1cdc27316))
  (fp_line (start 1.153112 -2.593269) (end 2.677115 -1.069266)
    (stroke (width 0.254001) (type solid)) (layer "F.SilkS") (tstamp bd282652-4198-4551-bc21-eb8472312ea8))
  (fp_line (start 1.153112 2.740742) (end 1.407112 2.740742)
    (stroke (width 0.254001) (type solid)) (layer "F.SilkS") (tstamp 85060547-5425-4941-b9db-e96ab2788424))
  (fp_line (start 1.407112 -2.593269) (end -2.656896 1.470739)
    (stroke (width 0.254001) (type solid)) (layer "F.SilkS") (tstamp 4512d7f7-fc86-4bc8-a3de-e0414ae35886))
  (fp_line (start 1.915113 -2.339268) (end -2.148895 1.72474)
    (stroke (width 0.254001) (type solid)) (layer "F.SilkS") (tstamp 03ebdcf1-a60d-4bbb-be48-021c1a093612))
  (fp_line (start 2.169114 -1.831267) (end -1.894895 2.232741)
    (stroke (width 0.254001) (type solid)) (layer "F.SilkS") (tstamp cfc222d7-266e-4626-b429-3f1fc9819052))
  (fp_line (start 2.423114 -1.577267) (end -1.640894 2.486741)
    (stroke (width 0.254001) (type solid)) (layer "F.SilkS") (tstamp 7ac49e49-e37d-4175-8699-b19338f4c28e))
  (fp_line (start 2.677115 -1.069266) (end -1.132893 2.740742)
    (stroke (width 0.254001) (type solid)) (layer "F.SilkS") (tstamp c474073e-2ac3-4135-a766-ebeb061682c3))
  (fp_line (start 2.931115 -0.307264) (end -0.116891 2.740742)
    (stroke (width 0.254001) (type solid)) (layer "F.SilkS") (tstamp a56bdfca-c495-4403-9981-12042998f219))
  (fp_line (start 2.931115 0.454737) (end 0.64511 2.740742)
    (stroke (width 0.254001) (type solid)) (layer "F.SilkS") (tstamp d026bda4-2dea-4ea1-97c2-a35a21f9ba76))
  (fp_arc (start -4.543967 -1.267412) (mid -4.309407 -1.898119) (end -3.987807 -2.489205)
    (stroke (width 0.254001) (type solid)) (layer "F.SilkS") (tstamp 627f362f-eb1f-4ad7-9bbc-549cf16c3d82))
  (fp_arc (start -4.234849 2.269164) (mid -4.496333 1.670329) (end -4.673609 1.041402)
    (stroke (width 0.254001) (type solid)) (layer "F.SilkS") (tstamp 42b98298-71a0-4ab2-914d-56322ec6f700))
  (fp_arc (start -2.276403 -4.092659) (mid 0.153063 -4.672771) (end 2.540005 -3.937008)
    (stroke (width 0.254001) (type solid)) (layer "F.SilkS") (tstamp 7798f2e7-1072-477d-a304-4424f2b402cc))
  (fp_arc (start 2.57399 4.074448) (mid -0.055682 4.829001) (end -2.667005 4.013208)
    (stroke (width 0.254001) (type solid)) (layer "F.SilkS") (tstamp 5345a644-f33a-4897-bf7d-bf145686b103))
  (fp_arc (start 4.161163 -2.297155) (mid 4.428099 -1.747548) (end 4.622809 -1.168402)
    (stroke (width 0.254001) (type solid)) (layer "F.SilkS") (tstamp 6feaa09d-6526-4d6f-924f-7126d7ce5c13))
  (fp_arc (start 4.673178 1.169647) (mid 4.484611 1.781177) (end 4.216409 2.362205)
    (stroke (width 0.254001) (type solid)) (layer "F.SilkS") (tstamp c166b320-621b-49ad-9b8d-2479124ba90a))
  (fp_circle (center -9.500127 -9.515621) (end -9.470155 -9.515621)
    (stroke (width 0.059995) (type solid)) (fill none) (layer "F.SilkS") (tstamp 488b4d79-d4a1-42c3-8a69-04015a57bcf5))
  (fp_circle (center -5.20701 -4.025908) (end -4.699009 -4.025908)
    (stroke (width 0.254001) (type solid)) (fill none) (layer "F.SilkS") (tstamp 5a69575c-5ad8-4d6e-ac79-5a681e67e8f7))
  (fp_circle (center 0 0.0635) (end 2.999746 0.0635)
    (stroke (width 0.254001) (type solid)) (fill none) (layer "F.SilkS") (tstamp d637b49d-6eae-4723-83df-efaeb902c9c4))
  (fp_circle (center 0 0.0635) (end 9.500127 0.0635)
    (stroke (width 0.254001) (type solid)) (fill none) (layer "F.SilkS") (tstamp 1087ff39-93c9-446b-8adc-7da387adb01d))
  (fp_circle (center 0.04064 0.05334) (end 7.840996 0.05334)
    (stroke (width 0.254001) (type solid)) (fill none) (layer "F.SilkS") (tstamp 11fdbf87-441e-4504-bb47-ba4687d1aca0))
  (fp_rect (start -10.414 -10.16) (end 10.414 10.414)
    (stroke (width 0.05) (type default)) (fill none) (layer "F.CrtYd") (tstamp 8575d28f-cc7d-47dc-9a36-051f73de6453))
  (pad "1" thru_hole circle (at -3.276607 -3.289307) (size 2 2) (drill 1.300025) (layers "*.Cu" "*.Mask") (tstamp 70876dd9-0460-4223-9e80-98c41ee8c941))
  (pad "2" thru_hole circle (at -4.699009 -0.0635) (size 2 2) (drill 1.300025) (layers "*.Cu" "*.Mask") (tstamp 3a0ed51b-2048-4844-8f33-ed674b6f7c2a))
  (pad "3" thru_hole circle (at -3.530607 3.289307) (size 2 2) (drill 1.300025) (layers "*.Cu" "*.Mask") (tstamp 9ff1003e-a39c-4519-bd2c-5ed0b6e5e0dc))
  (pad "4" thru_hole circle (at 3.429007 3.289307) (size 2 2) (drill 1.300025) (layers "*.Cu" "*.Mask") (tstamp c24afa41-d40c-4353-9b7e-035ee1f8bf32))
  (pad "5" thru_hole circle (at 4.699009 -0.0381) (size 2 2) (drill 1.300025) (layers "*.Cu" "*.Mask") (tstamp 645fc83c-8709-47c5-bebb-83e466b3b8e9))
  (pad "6" thru_hole circle (at 3.479807 -3.289307) (size 2 2) (drill 1.300025) (layers "*.Cu" "*.Mask") (tstamp d415516e-9097-45bb-bfe9-c25bb215b555))
  (model "C:/Users/dylan/OneDrive - University of Cape Town/UNIVERSITY FILES/Third Year/Semester 1/EEE3088F/group-34-hat/PCB/main/JLC2KiCad_lib/footprint/packages3d/SENSOR-TH_MQ-2.wrl"
    (offset (xyz 0.005587999916 0 -0.0000507999992371))
    (scale (xyz 1 1 1))
    (rotate (xyz 0 0 0))
  )
)
