%TF.GenerationSoftware,KiCad,Pcbnew,(7.0.0)*%
%TF.CreationDate,2023-04-19T21:35:45+02:00*%
%TF.ProjectId,main,6d61696e-2e6b-4696-9361-645f70636258,V1.0*%
%TF.SameCoordinates,Original*%
%TF.FileFunction,Legend,Bot*%
%TF.FilePolarity,Positive*%
%FSLAX46Y46*%
G04 Gerber Fmt 4.6, Leading zero omitted, Abs format (unit mm)*
G04 Created by KiCad (PCBNEW (7.0.0)) date 2023-04-19 21:35:45*
%MOMM*%
%LPD*%
G01*
G04 APERTURE LIST*
%ADD10C,2.500000*%
%ADD11R,1.700000X1.700000*%
%ADD12C,1.700000*%
%ADD13C,2.000000*%
%ADD14C,2.400000*%
%ADD15C,1.300000*%
%ADD16O,2.200000X1.300000*%
G04 APERTURE END LIST*
%LPC*%
D10*
%TO.C,TP1*%
X110700000Y-106600000D03*
%TD*%
%TO.C,TP10*%
X112200000Y-77200000D03*
%TD*%
%TO.C,TP8*%
X129150000Y-87600000D03*
%TD*%
D11*
%TO.C,J7*%
X184658085Y-133049996D03*
D12*
X182118081Y-133049997D03*
X179578076Y-133049997D03*
X177038071Y-133049997D03*
X174498066Y-133049997D03*
X171958061Y-133049997D03*
X169418056Y-133049997D03*
X166878051Y-133049997D03*
X164338045Y-133049997D03*
X161798040Y-133049997D03*
X159258035Y-133049997D03*
X156718030Y-133049997D03*
X154178025Y-133049997D03*
X151638020Y-133049997D03*
X149098015Y-133049997D03*
X146558010Y-133049997D03*
X144018005Y-133049997D03*
X141478000Y-133049997D03*
X138937995Y-133049997D03*
X136397990Y-133049997D03*
X133857984Y-133049997D03*
X131317979Y-133049997D03*
X128777974Y-133049997D03*
X126237969Y-133049997D03*
X126237964Y-148590000D03*
X128777969Y-148590000D03*
X131317974Y-148590000D03*
X133857979Y-148590000D03*
X136397985Y-148590000D03*
X138937990Y-148590000D03*
X141477995Y-148590000D03*
X144018000Y-148590000D03*
X146558005Y-148590000D03*
X149098010Y-148590000D03*
X151638015Y-148590000D03*
X154178020Y-148590000D03*
X156718025Y-148590000D03*
X159258030Y-148590000D03*
X161798035Y-148590000D03*
X164338040Y-148590000D03*
X166878046Y-148590000D03*
X169418051Y-148590000D03*
X171958056Y-148590000D03*
X174498061Y-148590000D03*
X177038066Y-148590000D03*
X179578071Y-148590000D03*
X182118076Y-148590000D03*
D11*
X184658080Y-148589999D03*
%TD*%
D13*
%TO.C,U6*%
X185521586Y-89154000D03*
X184099184Y-92379807D03*
X185267586Y-95732614D03*
X192227200Y-95732614D03*
X193497202Y-92405207D03*
X192278000Y-89154000D03*
%TD*%
D10*
%TO.C,TP2*%
X112776000Y-134842000D03*
%TD*%
%TO.C,TP4*%
X131334000Y-129950000D03*
%TD*%
D14*
%TO.C,U9*%
X188479980Y-75190000D03*
%TD*%
D15*
%TO.C,J10*%
X106061554Y-89890443D03*
D16*
X103391500Y-91065448D03*
X103391500Y-83865550D03*
D15*
X106061554Y-85040557D03*
%TD*%
D10*
%TO.C,TP14*%
X115100000Y-96600000D03*
%TD*%
%TO.C,TP6*%
X136922000Y-152654000D03*
%TD*%
%TO.C,TP5*%
X131350000Y-126238000D03*
%TD*%
%TO.C,TP7*%
X196850000Y-133750000D03*
%TD*%
%TO.C,TP3*%
X118618000Y-132842000D03*
%TD*%
M02*
