(footprint "SOT-23-5_L3.0-W1.7-P0.95-LS2.8-BL" (version 20221018) (generator pcbnew)
  (layer "F.Cu")
  (descr "SOT-23-5_L3.0-W1.7-P0.95-LS2.8-BL footprint")
  (tags "SOT-23-5_L3.0-W1.7-P0.95-LS2.8-BL footprint")
  (attr smd)
  (fp_text reference "REF**" (at 0 -3.15367) (layer "F.SilkS")
      (effects (font (size 1 1) (thickness 0.15)))
    (tstamp e437865c-cc10-44a7-89b4-2e5142ab52c0)
  )
  (fp_text value "SOT-23-5_L3.0-W1.7-P0.95-LS2.8-BL" (at 0 3.15367) (layer "F.Fab")
      (effects (font (size 1 1) (thickness 0.15)))
    (tstamp 1ad29646-1945-426f-9a6f-656acc951a70)
  )
  (fp_text user "REF**" (at 0 5.15367) (layer "F.Fab")
      (effects (font (size 1 1) (thickness 0.15)))
    (tstamp 5754c0f9-ac87-4dcf-b9e2-4c92353358c6)
  )
  (fp_line (start -1.526213 0.851207) (end -1.526213 -0.851207)
    (stroke (width 0.1524) (type solid)) (layer "F.SilkS") (tstamp 92f32652-e153-4e4e-a22f-cb3fbbc6bcd2))
  (fp_line (start 0.476403 -0.851207) (end -0.476403 -0.851207)
    (stroke (width 0.1524) (type solid)) (layer "F.SilkS") (tstamp 58dc307c-d14b-4e31-a2bd-840e4c2ffb2f))
  (fp_line (start 1.526213 0.851207) (end 1.526213 -0.851207)
    (stroke (width 0.1524) (type solid)) (layer "F.SilkS") (tstamp 8650c85d-72a3-4d3c-a02c-4f4549499722))
  (fp_circle (center -1.651003 1.143002) (end -1.500889 1.143002)
    (stroke (width 0.3) (type solid)) (fill none) (layer "F.SilkS") (tstamp 3817cd10-f4a7-4089-be09-f470a1d5ddf4))
  (fp_circle (center -1.420117 1.369977) (end -1.390145 1.369977)
    (stroke (width 0.059995) (type solid)) (fill none) (layer "F.SilkS") (tstamp 1185fe7b-baad-4e79-8c8f-42ef4817a2cf))
  (fp_rect (start -2.032 -1.778) (end 1.778 2.032)
    (stroke (width 0.05) (type default)) (fill none) (layer "F.CrtYd") (tstamp 8289c395-3744-4223-ba0b-dd356c1f2ab5))
  (fp_circle (center -0.949962 1.76251) (end -0.849886 1.76251)
    (stroke (width 0.2) (type solid)) (fill none) (layer "F.Fab") (tstamp 8856e739-8940-4d12-b0a0-1ae62ec20e32))
  (pad "1" smd rect (at -0.949962 1.15367) (size 0.489992 1.156998) (layers "F.Cu" "F.Paste" "F.Mask") (tstamp 6ce20b0c-2fcf-4443-b3a5-2080045d06c3))
  (pad "2" smd rect (at 0 1.15367) (size 0.489992 1.156998) (layers "F.Cu" "F.Paste" "F.Mask") (tstamp aae3db08-8760-47ad-a9bc-a438f1161968))
  (pad "3" smd rect (at 0.949962 1.15367) (size 0.489992 1.156998) (layers "F.Cu" "F.Paste" "F.Mask") (tstamp 0d8f22f9-b8e7-4cf6-9750-5dac815f82a6))
  (pad "4" smd rect (at 0.949962 -1.15367) (size 0.489992 1.175006) (layers "F.Cu" "F.Paste" "F.Mask") (tstamp b2f96978-cf2a-488d-8457-7ec1d5e88e5f))
  (pad "5" smd rect (at -0.949962 -1.15367) (size 0.489992 1.175006) (layers "F.Cu" "F.Paste" "F.Mask") (tstamp 5b082c56-42df-421b-b669-566f1f3608db))
  (model "C:/Users/dylan/OneDrive - University of Cape Town/UNIVERSITY FILES/Third Year/Semester 1/EEE3088F/group-34-hat/PCB/main/JLC2KiCad_lib/footprint/packages3d/SOT-23-5_L3.0-W1.7-P0.95-LS2.8-BL.wrl"
    (offset (xyz -5.410199919 1.473199978 0.04902199926))
    (scale (xyz 1 1 1))
    (rotate (xyz 0 0 -90))
  )
)
