%TF.GenerationSoftware,KiCad,Pcbnew,(7.0.0)*%
%TF.CreationDate,2023-04-19T21:35:45+02:00*%
%TF.ProjectId,main,6d61696e-2e6b-4696-9361-645f70636258,V1.0*%
%TF.SameCoordinates,Original*%
%TF.FileFunction,Legend,Top*%
%TF.FilePolarity,Positive*%
%FSLAX46Y46*%
G04 Gerber Fmt 4.6, Leading zero omitted, Abs format (unit mm)*
G04 Created by KiCad (PCBNEW (7.0.0)) date 2023-04-19 21:35:45*
%MOMM*%
%LPD*%
G01*
G04 APERTURE LIST*
G04 Aperture macros list*
%AMRoundRect*
0 Rectangle with rounded corners*
0 $1 Rounding radius*
0 $2 $3 $4 $5 $6 $7 $8 $9 X,Y pos of 4 corners*
0 Add a 4 corners polygon primitive as box body*
4,1,4,$2,$3,$4,$5,$6,$7,$8,$9,$2,$3,0*
0 Add four circle primitives for the rounded corners*
1,1,$1+$1,$2,$3*
1,1,$1+$1,$4,$5*
1,1,$1+$1,$6,$7*
1,1,$1+$1,$8,$9*
0 Add four rect primitives between the rounded corners*
20,1,$1+$1,$2,$3,$4,$5,0*
20,1,$1+$1,$4,$5,$6,$7,0*
20,1,$1+$1,$6,$7,$8,$9,0*
20,1,$1+$1,$8,$9,$2,$3,0*%
%AMFreePoly0*
4,1,20,0.152400,0.263965,0.179471,0.241250,0.304674,0.241250,0.304674,0.000715,0.304800,0.000000,0.304674,-0.000715,0.304674,-0.241351,0.179350,-0.241351,0.152400,-0.263965,0.052928,-0.300169,-0.052928,-0.300169,-0.152400,-0.263965,-0.179350,-0.241351,-0.304928,-0.241351,-0.304928,0.241250,-0.179471,0.241250,-0.152400,0.263965,-0.052928,0.300169,0.052928,0.300169,0.152400,0.263965,
0.152400,0.263965,$1*%
%AMFreePoly1*
4,1,20,0.152400,0.263965,0.179289,0.241402,0.304674,0.241402,0.304674,0.000715,0.304800,0.000000,0.304674,-0.000715,0.304674,-0.241199,0.179531,-0.241199,0.152400,-0.263965,0.052928,-0.300169,-0.052928,-0.300169,-0.152400,-0.263965,-0.179531,-0.241199,-0.304928,-0.241199,-0.304928,0.241402,-0.179289,0.241402,-0.152400,0.263965,-0.052928,0.300169,0.052928,0.300169,0.152400,0.263965,
0.152400,0.263965,$1*%
G04 Aperture macros list end*
%ADD10C,0.150000*%
%ADD11C,0.120000*%
%ADD12C,0.254000*%
%ADD13C,0.059995*%
%ADD14C,0.152400*%
%ADD15C,0.100000*%
%ADD16C,0.300000*%
%ADD17C,0.127000*%
%ADD18RoundRect,0.243750X-0.456250X0.243750X-0.456250X-0.243750X0.456250X-0.243750X0.456250X0.243750X0*%
%ADD19C,2.500000*%
%ADD20RoundRect,0.250000X0.450000X-0.262500X0.450000X0.262500X-0.450000X0.262500X-0.450000X-0.262500X0*%
%ADD21RoundRect,0.250000X-0.262500X-0.450000X0.262500X-0.450000X0.262500X0.450000X-0.262500X0.450000X0*%
%ADD22R,1.200000X0.950013*%
%ADD23R,1.700000X1.700000*%
%ADD24C,1.700000*%
%ADD25C,2.000000*%
%ADD26RoundRect,0.250000X0.262500X0.450000X-0.262500X0.450000X-0.262500X-0.450000X0.262500X-0.450000X0*%
%ADD27RoundRect,0.250000X0.475000X-0.250000X0.475000X0.250000X-0.475000X0.250000X-0.475000X-0.250000X0*%
%ADD28R,1.250013X0.700000*%
%ADD29RoundRect,0.250000X-0.450000X0.262500X-0.450000X-0.262500X0.450000X-0.262500X0.450000X0.262500X0*%
%ADD30R,0.900000X0.400000*%
%ADD31RoundRect,0.243750X0.456250X-0.243750X0.456250X0.243750X-0.456250X0.243750X-0.456250X-0.243750X0*%
%ADD32RoundRect,0.250000X0.250000X0.475000X-0.250000X0.475000X-0.250000X-0.475000X0.250000X-0.475000X0*%
%ADD33FreePoly0,90.000000*%
%ADD34FreePoly1,90.000000*%
%ADD35RoundRect,0.250000X-0.250000X-0.475000X0.250000X-0.475000X0.250000X0.475000X-0.250000X0.475000X0*%
%ADD36R,1.000000X0.600000*%
%ADD37O,1.970993X0.602007*%
%ADD38RoundRect,0.250000X-0.475000X0.250000X-0.475000X-0.250000X0.475000X-0.250000X0.475000X0.250000X0*%
%ADD39C,2.400000*%
%ADD40R,5.080010X7.620015*%
%ADD41R,1.400000X0.400000*%
%ADD42C,1.300000*%
%ADD43O,2.200000X1.300000*%
%ADD44R,2.500000X2.500000*%
%ADD45R,0.280000X0.750000*%
%ADD46R,0.800000X0.350013*%
%ADD47O,2.045009X0.588011*%
G04 APERTURE END LIST*
D10*
%TO.C,D6*%
X139099905Y-122877880D02*
X139099905Y-121877880D01*
X139099905Y-121877880D02*
X139338000Y-121877880D01*
X139338000Y-121877880D02*
X139480857Y-121925500D01*
X139480857Y-121925500D02*
X139576095Y-122020738D01*
X139576095Y-122020738D02*
X139623714Y-122115976D01*
X139623714Y-122115976D02*
X139671333Y-122306452D01*
X139671333Y-122306452D02*
X139671333Y-122449309D01*
X139671333Y-122449309D02*
X139623714Y-122639785D01*
X139623714Y-122639785D02*
X139576095Y-122735023D01*
X139576095Y-122735023D02*
X139480857Y-122830261D01*
X139480857Y-122830261D02*
X139338000Y-122877880D01*
X139338000Y-122877880D02*
X139099905Y-122877880D01*
X140528476Y-121877880D02*
X140338000Y-121877880D01*
X140338000Y-121877880D02*
X140242762Y-121925500D01*
X140242762Y-121925500D02*
X140195143Y-121973119D01*
X140195143Y-121973119D02*
X140099905Y-122115976D01*
X140099905Y-122115976D02*
X140052286Y-122306452D01*
X140052286Y-122306452D02*
X140052286Y-122687404D01*
X140052286Y-122687404D02*
X140099905Y-122782642D01*
X140099905Y-122782642D02*
X140147524Y-122830261D01*
X140147524Y-122830261D02*
X140242762Y-122877880D01*
X140242762Y-122877880D02*
X140433238Y-122877880D01*
X140433238Y-122877880D02*
X140528476Y-122830261D01*
X140528476Y-122830261D02*
X140576095Y-122782642D01*
X140576095Y-122782642D02*
X140623714Y-122687404D01*
X140623714Y-122687404D02*
X140623714Y-122449309D01*
X140623714Y-122449309D02*
X140576095Y-122354071D01*
X140576095Y-122354071D02*
X140528476Y-122306452D01*
X140528476Y-122306452D02*
X140433238Y-122258833D01*
X140433238Y-122258833D02*
X140242762Y-122258833D01*
X140242762Y-122258833D02*
X140147524Y-122306452D01*
X140147524Y-122306452D02*
X140099905Y-122354071D01*
X140099905Y-122354071D02*
X140052286Y-122449309D01*
%TO.C,TP1*%
X109438095Y-103819380D02*
X110009523Y-103819380D01*
X109723809Y-104819380D02*
X109723809Y-103819380D01*
X110342857Y-104819380D02*
X110342857Y-103819380D01*
X110342857Y-103819380D02*
X110723809Y-103819380D01*
X110723809Y-103819380D02*
X110819047Y-103867000D01*
X110819047Y-103867000D02*
X110866666Y-103914619D01*
X110866666Y-103914619D02*
X110914285Y-104009857D01*
X110914285Y-104009857D02*
X110914285Y-104152714D01*
X110914285Y-104152714D02*
X110866666Y-104247952D01*
X110866666Y-104247952D02*
X110819047Y-104295571D01*
X110819047Y-104295571D02*
X110723809Y-104343190D01*
X110723809Y-104343190D02*
X110342857Y-104343190D01*
X111866666Y-104819380D02*
X111295238Y-104819380D01*
X111580952Y-104819380D02*
X111580952Y-103819380D01*
X111580952Y-103819380D02*
X111485714Y-103962238D01*
X111485714Y-103962238D02*
X111390476Y-104057476D01*
X111390476Y-104057476D02*
X111295238Y-104105095D01*
%TO.C,R4*%
X142607380Y-129452666D02*
X142131190Y-129785999D01*
X142607380Y-130024094D02*
X141607380Y-130024094D01*
X141607380Y-130024094D02*
X141607380Y-129643142D01*
X141607380Y-129643142D02*
X141655000Y-129547904D01*
X141655000Y-129547904D02*
X141702619Y-129500285D01*
X141702619Y-129500285D02*
X141797857Y-129452666D01*
X141797857Y-129452666D02*
X141940714Y-129452666D01*
X141940714Y-129452666D02*
X142035952Y-129500285D01*
X142035952Y-129500285D02*
X142083571Y-129547904D01*
X142083571Y-129547904D02*
X142131190Y-129643142D01*
X142131190Y-129643142D02*
X142131190Y-130024094D01*
X141940714Y-128595523D02*
X142607380Y-128595523D01*
X141559761Y-128833618D02*
X142274047Y-129071713D01*
X142274047Y-129071713D02*
X142274047Y-128452666D01*
%TO.C,TP10*%
X110461905Y-78715380D02*
X111033333Y-78715380D01*
X110747619Y-79715380D02*
X110747619Y-78715380D01*
X111366667Y-79715380D02*
X111366667Y-78715380D01*
X111366667Y-78715380D02*
X111747619Y-78715380D01*
X111747619Y-78715380D02*
X111842857Y-78763000D01*
X111842857Y-78763000D02*
X111890476Y-78810619D01*
X111890476Y-78810619D02*
X111938095Y-78905857D01*
X111938095Y-78905857D02*
X111938095Y-79048714D01*
X111938095Y-79048714D02*
X111890476Y-79143952D01*
X111890476Y-79143952D02*
X111842857Y-79191571D01*
X111842857Y-79191571D02*
X111747619Y-79239190D01*
X111747619Y-79239190D02*
X111366667Y-79239190D01*
X112890476Y-79715380D02*
X112319048Y-79715380D01*
X112604762Y-79715380D02*
X112604762Y-78715380D01*
X112604762Y-78715380D02*
X112509524Y-78858238D01*
X112509524Y-78858238D02*
X112414286Y-78953476D01*
X112414286Y-78953476D02*
X112319048Y-79001095D01*
X113509524Y-78715380D02*
X113604762Y-78715380D01*
X113604762Y-78715380D02*
X113700000Y-78763000D01*
X113700000Y-78763000D02*
X113747619Y-78810619D01*
X113747619Y-78810619D02*
X113795238Y-78905857D01*
X113795238Y-78905857D02*
X113842857Y-79096333D01*
X113842857Y-79096333D02*
X113842857Y-79334428D01*
X113842857Y-79334428D02*
X113795238Y-79524904D01*
X113795238Y-79524904D02*
X113747619Y-79620142D01*
X113747619Y-79620142D02*
X113700000Y-79667761D01*
X113700000Y-79667761D02*
X113604762Y-79715380D01*
X113604762Y-79715380D02*
X113509524Y-79715380D01*
X113509524Y-79715380D02*
X113414286Y-79667761D01*
X113414286Y-79667761D02*
X113366667Y-79620142D01*
X113366667Y-79620142D02*
X113319048Y-79524904D01*
X113319048Y-79524904D02*
X113271429Y-79334428D01*
X113271429Y-79334428D02*
X113271429Y-79096333D01*
X113271429Y-79096333D02*
X113319048Y-78905857D01*
X113319048Y-78905857D02*
X113366667Y-78810619D01*
X113366667Y-78810619D02*
X113414286Y-78763000D01*
X113414286Y-78763000D02*
X113509524Y-78715380D01*
%TO.C,R11*%
X196909142Y-108667380D02*
X196575809Y-108191190D01*
X196337714Y-108667380D02*
X196337714Y-107667380D01*
X196337714Y-107667380D02*
X196718666Y-107667380D01*
X196718666Y-107667380D02*
X196813904Y-107715000D01*
X196813904Y-107715000D02*
X196861523Y-107762619D01*
X196861523Y-107762619D02*
X196909142Y-107857857D01*
X196909142Y-107857857D02*
X196909142Y-108000714D01*
X196909142Y-108000714D02*
X196861523Y-108095952D01*
X196861523Y-108095952D02*
X196813904Y-108143571D01*
X196813904Y-108143571D02*
X196718666Y-108191190D01*
X196718666Y-108191190D02*
X196337714Y-108191190D01*
X197861523Y-108667380D02*
X197290095Y-108667380D01*
X197575809Y-108667380D02*
X197575809Y-107667380D01*
X197575809Y-107667380D02*
X197480571Y-107810238D01*
X197480571Y-107810238D02*
X197385333Y-107905476D01*
X197385333Y-107905476D02*
X197290095Y-107953095D01*
X198813904Y-108667380D02*
X198242476Y-108667380D01*
X198528190Y-108667380D02*
X198528190Y-107667380D01*
X198528190Y-107667380D02*
X198432952Y-107810238D01*
X198432952Y-107810238D02*
X198337714Y-107905476D01*
X198337714Y-107905476D02*
X198242476Y-107953095D01*
%TO.C,D3*%
X110411905Y-99417367D02*
X110411905Y-98417367D01*
X110411905Y-98417367D02*
X110650000Y-98417367D01*
X110650000Y-98417367D02*
X110792857Y-98464987D01*
X110792857Y-98464987D02*
X110888095Y-98560225D01*
X110888095Y-98560225D02*
X110935714Y-98655463D01*
X110935714Y-98655463D02*
X110983333Y-98845939D01*
X110983333Y-98845939D02*
X110983333Y-98988796D01*
X110983333Y-98988796D02*
X110935714Y-99179272D01*
X110935714Y-99179272D02*
X110888095Y-99274510D01*
X110888095Y-99274510D02*
X110792857Y-99369748D01*
X110792857Y-99369748D02*
X110650000Y-99417367D01*
X110650000Y-99417367D02*
X110411905Y-99417367D01*
X111316667Y-98417367D02*
X111935714Y-98417367D01*
X111935714Y-98417367D02*
X111602381Y-98798320D01*
X111602381Y-98798320D02*
X111745238Y-98798320D01*
X111745238Y-98798320D02*
X111840476Y-98845939D01*
X111840476Y-98845939D02*
X111888095Y-98893558D01*
X111888095Y-98893558D02*
X111935714Y-98988796D01*
X111935714Y-98988796D02*
X111935714Y-99226891D01*
X111935714Y-99226891D02*
X111888095Y-99322129D01*
X111888095Y-99322129D02*
X111840476Y-99369748D01*
X111840476Y-99369748D02*
X111745238Y-99417367D01*
X111745238Y-99417367D02*
X111459524Y-99417367D01*
X111459524Y-99417367D02*
X111364286Y-99369748D01*
X111364286Y-99369748D02*
X111316667Y-99322129D01*
%TO.C,TP8*%
X127888095Y-84819380D02*
X128459523Y-84819380D01*
X128173809Y-85819380D02*
X128173809Y-84819380D01*
X128792857Y-85819380D02*
X128792857Y-84819380D01*
X128792857Y-84819380D02*
X129173809Y-84819380D01*
X129173809Y-84819380D02*
X129269047Y-84867000D01*
X129269047Y-84867000D02*
X129316666Y-84914619D01*
X129316666Y-84914619D02*
X129364285Y-85009857D01*
X129364285Y-85009857D02*
X129364285Y-85152714D01*
X129364285Y-85152714D02*
X129316666Y-85247952D01*
X129316666Y-85247952D02*
X129269047Y-85295571D01*
X129269047Y-85295571D02*
X129173809Y-85343190D01*
X129173809Y-85343190D02*
X128792857Y-85343190D01*
X129935714Y-85247952D02*
X129840476Y-85200333D01*
X129840476Y-85200333D02*
X129792857Y-85152714D01*
X129792857Y-85152714D02*
X129745238Y-85057476D01*
X129745238Y-85057476D02*
X129745238Y-85009857D01*
X129745238Y-85009857D02*
X129792857Y-84914619D01*
X129792857Y-84914619D02*
X129840476Y-84867000D01*
X129840476Y-84867000D02*
X129935714Y-84819380D01*
X129935714Y-84819380D02*
X130126190Y-84819380D01*
X130126190Y-84819380D02*
X130221428Y-84867000D01*
X130221428Y-84867000D02*
X130269047Y-84914619D01*
X130269047Y-84914619D02*
X130316666Y-85009857D01*
X130316666Y-85009857D02*
X130316666Y-85057476D01*
X130316666Y-85057476D02*
X130269047Y-85152714D01*
X130269047Y-85152714D02*
X130221428Y-85200333D01*
X130221428Y-85200333D02*
X130126190Y-85247952D01*
X130126190Y-85247952D02*
X129935714Y-85247952D01*
X129935714Y-85247952D02*
X129840476Y-85295571D01*
X129840476Y-85295571D02*
X129792857Y-85343190D01*
X129792857Y-85343190D02*
X129745238Y-85438428D01*
X129745238Y-85438428D02*
X129745238Y-85628904D01*
X129745238Y-85628904D02*
X129792857Y-85724142D01*
X129792857Y-85724142D02*
X129840476Y-85771761D01*
X129840476Y-85771761D02*
X129935714Y-85819380D01*
X129935714Y-85819380D02*
X130126190Y-85819380D01*
X130126190Y-85819380D02*
X130221428Y-85771761D01*
X130221428Y-85771761D02*
X130269047Y-85724142D01*
X130269047Y-85724142D02*
X130316666Y-85628904D01*
X130316666Y-85628904D02*
X130316666Y-85438428D01*
X130316666Y-85438428D02*
X130269047Y-85343190D01*
X130269047Y-85343190D02*
X130221428Y-85295571D01*
X130221428Y-85295571D02*
X130126190Y-85247952D01*
%TO.C,U6*%
X188288095Y-80942380D02*
X188288095Y-81751904D01*
X188288095Y-81751904D02*
X188335714Y-81847142D01*
X188335714Y-81847142D02*
X188383333Y-81894761D01*
X188383333Y-81894761D02*
X188478571Y-81942380D01*
X188478571Y-81942380D02*
X188669047Y-81942380D01*
X188669047Y-81942380D02*
X188764285Y-81894761D01*
X188764285Y-81894761D02*
X188811904Y-81847142D01*
X188811904Y-81847142D02*
X188859523Y-81751904D01*
X188859523Y-81751904D02*
X188859523Y-80942380D01*
X189764285Y-80942380D02*
X189573809Y-80942380D01*
X189573809Y-80942380D02*
X189478571Y-80990000D01*
X189478571Y-80990000D02*
X189430952Y-81037619D01*
X189430952Y-81037619D02*
X189335714Y-81180476D01*
X189335714Y-81180476D02*
X189288095Y-81370952D01*
X189288095Y-81370952D02*
X189288095Y-81751904D01*
X189288095Y-81751904D02*
X189335714Y-81847142D01*
X189335714Y-81847142D02*
X189383333Y-81894761D01*
X189383333Y-81894761D02*
X189478571Y-81942380D01*
X189478571Y-81942380D02*
X189669047Y-81942380D01*
X189669047Y-81942380D02*
X189764285Y-81894761D01*
X189764285Y-81894761D02*
X189811904Y-81847142D01*
X189811904Y-81847142D02*
X189859523Y-81751904D01*
X189859523Y-81751904D02*
X189859523Y-81513809D01*
X189859523Y-81513809D02*
X189811904Y-81418571D01*
X189811904Y-81418571D02*
X189764285Y-81370952D01*
X189764285Y-81370952D02*
X189669047Y-81323333D01*
X189669047Y-81323333D02*
X189478571Y-81323333D01*
X189478571Y-81323333D02*
X189383333Y-81370952D01*
X189383333Y-81370952D02*
X189335714Y-81418571D01*
X189335714Y-81418571D02*
X189288095Y-81513809D01*
%TO.C,R13*%
X196758642Y-111467380D02*
X196425309Y-110991190D01*
X196187214Y-111467380D02*
X196187214Y-110467380D01*
X196187214Y-110467380D02*
X196568166Y-110467380D01*
X196568166Y-110467380D02*
X196663404Y-110515000D01*
X196663404Y-110515000D02*
X196711023Y-110562619D01*
X196711023Y-110562619D02*
X196758642Y-110657857D01*
X196758642Y-110657857D02*
X196758642Y-110800714D01*
X196758642Y-110800714D02*
X196711023Y-110895952D01*
X196711023Y-110895952D02*
X196663404Y-110943571D01*
X196663404Y-110943571D02*
X196568166Y-110991190D01*
X196568166Y-110991190D02*
X196187214Y-110991190D01*
X197711023Y-111467380D02*
X197139595Y-111467380D01*
X197425309Y-111467380D02*
X197425309Y-110467380D01*
X197425309Y-110467380D02*
X197330071Y-110610238D01*
X197330071Y-110610238D02*
X197234833Y-110705476D01*
X197234833Y-110705476D02*
X197139595Y-110753095D01*
X198044357Y-110467380D02*
X198663404Y-110467380D01*
X198663404Y-110467380D02*
X198330071Y-110848333D01*
X198330071Y-110848333D02*
X198472928Y-110848333D01*
X198472928Y-110848333D02*
X198568166Y-110895952D01*
X198568166Y-110895952D02*
X198615785Y-110943571D01*
X198615785Y-110943571D02*
X198663404Y-111038809D01*
X198663404Y-111038809D02*
X198663404Y-111276904D01*
X198663404Y-111276904D02*
X198615785Y-111372142D01*
X198615785Y-111372142D02*
X198568166Y-111419761D01*
X198568166Y-111419761D02*
X198472928Y-111467380D01*
X198472928Y-111467380D02*
X198187214Y-111467380D01*
X198187214Y-111467380D02*
X198091976Y-111419761D01*
X198091976Y-111419761D02*
X198044357Y-111372142D01*
%TO.C,R17*%
X144294642Y-144417380D02*
X143961309Y-143941190D01*
X143723214Y-144417380D02*
X143723214Y-143417380D01*
X143723214Y-143417380D02*
X144104166Y-143417380D01*
X144104166Y-143417380D02*
X144199404Y-143465000D01*
X144199404Y-143465000D02*
X144247023Y-143512619D01*
X144247023Y-143512619D02*
X144294642Y-143607857D01*
X144294642Y-143607857D02*
X144294642Y-143750714D01*
X144294642Y-143750714D02*
X144247023Y-143845952D01*
X144247023Y-143845952D02*
X144199404Y-143893571D01*
X144199404Y-143893571D02*
X144104166Y-143941190D01*
X144104166Y-143941190D02*
X143723214Y-143941190D01*
X145247023Y-144417380D02*
X144675595Y-144417380D01*
X144961309Y-144417380D02*
X144961309Y-143417380D01*
X144961309Y-143417380D02*
X144866071Y-143560238D01*
X144866071Y-143560238D02*
X144770833Y-143655476D01*
X144770833Y-143655476D02*
X144675595Y-143703095D01*
X145580357Y-143417380D02*
X146247023Y-143417380D01*
X146247023Y-143417380D02*
X145818452Y-144417380D01*
%TO.C,C9*%
X168358333Y-102997142D02*
X168310714Y-103044761D01*
X168310714Y-103044761D02*
X168167857Y-103092380D01*
X168167857Y-103092380D02*
X168072619Y-103092380D01*
X168072619Y-103092380D02*
X167929762Y-103044761D01*
X167929762Y-103044761D02*
X167834524Y-102949523D01*
X167834524Y-102949523D02*
X167786905Y-102854285D01*
X167786905Y-102854285D02*
X167739286Y-102663809D01*
X167739286Y-102663809D02*
X167739286Y-102520952D01*
X167739286Y-102520952D02*
X167786905Y-102330476D01*
X167786905Y-102330476D02*
X167834524Y-102235238D01*
X167834524Y-102235238D02*
X167929762Y-102140000D01*
X167929762Y-102140000D02*
X168072619Y-102092380D01*
X168072619Y-102092380D02*
X168167857Y-102092380D01*
X168167857Y-102092380D02*
X168310714Y-102140000D01*
X168310714Y-102140000D02*
X168358333Y-102187619D01*
X168834524Y-103092380D02*
X169025000Y-103092380D01*
X169025000Y-103092380D02*
X169120238Y-103044761D01*
X169120238Y-103044761D02*
X169167857Y-102997142D01*
X169167857Y-102997142D02*
X169263095Y-102854285D01*
X169263095Y-102854285D02*
X169310714Y-102663809D01*
X169310714Y-102663809D02*
X169310714Y-102282857D01*
X169310714Y-102282857D02*
X169263095Y-102187619D01*
X169263095Y-102187619D02*
X169215476Y-102140000D01*
X169215476Y-102140000D02*
X169120238Y-102092380D01*
X169120238Y-102092380D02*
X168929762Y-102092380D01*
X168929762Y-102092380D02*
X168834524Y-102140000D01*
X168834524Y-102140000D02*
X168786905Y-102187619D01*
X168786905Y-102187619D02*
X168739286Y-102282857D01*
X168739286Y-102282857D02*
X168739286Y-102520952D01*
X168739286Y-102520952D02*
X168786905Y-102616190D01*
X168786905Y-102616190D02*
X168834524Y-102663809D01*
X168834524Y-102663809D02*
X168929762Y-102711428D01*
X168929762Y-102711428D02*
X169120238Y-102711428D01*
X169120238Y-102711428D02*
X169215476Y-102663809D01*
X169215476Y-102663809D02*
X169263095Y-102616190D01*
X169263095Y-102616190D02*
X169310714Y-102520952D01*
%TO.C,Q3*%
X122279761Y-83236444D02*
X122184523Y-83188825D01*
X122184523Y-83188825D02*
X122089285Y-83093586D01*
X122089285Y-83093586D02*
X121946428Y-82950729D01*
X121946428Y-82950729D02*
X121851190Y-82903110D01*
X121851190Y-82903110D02*
X121755952Y-82903110D01*
X121803571Y-83141205D02*
X121708333Y-83093586D01*
X121708333Y-83093586D02*
X121613095Y-82998348D01*
X121613095Y-82998348D02*
X121565476Y-82807872D01*
X121565476Y-82807872D02*
X121565476Y-82474539D01*
X121565476Y-82474539D02*
X121613095Y-82284063D01*
X121613095Y-82284063D02*
X121708333Y-82188825D01*
X121708333Y-82188825D02*
X121803571Y-82141205D01*
X121803571Y-82141205D02*
X121994047Y-82141205D01*
X121994047Y-82141205D02*
X122089285Y-82188825D01*
X122089285Y-82188825D02*
X122184523Y-82284063D01*
X122184523Y-82284063D02*
X122232142Y-82474539D01*
X122232142Y-82474539D02*
X122232142Y-82807872D01*
X122232142Y-82807872D02*
X122184523Y-82998348D01*
X122184523Y-82998348D02*
X122089285Y-83093586D01*
X122089285Y-83093586D02*
X121994047Y-83141205D01*
X121994047Y-83141205D02*
X121803571Y-83141205D01*
X122565476Y-82141205D02*
X123184523Y-82141205D01*
X123184523Y-82141205D02*
X122851190Y-82522158D01*
X122851190Y-82522158D02*
X122994047Y-82522158D01*
X122994047Y-82522158D02*
X123089285Y-82569777D01*
X123089285Y-82569777D02*
X123136904Y-82617396D01*
X123136904Y-82617396D02*
X123184523Y-82712634D01*
X123184523Y-82712634D02*
X123184523Y-82950729D01*
X123184523Y-82950729D02*
X123136904Y-83045967D01*
X123136904Y-83045967D02*
X123089285Y-83093586D01*
X123089285Y-83093586D02*
X122994047Y-83141205D01*
X122994047Y-83141205D02*
X122708333Y-83141205D01*
X122708333Y-83141205D02*
X122613095Y-83093586D01*
X122613095Y-83093586D02*
X122565476Y-83045967D01*
%TO.C,R9*%
X112078333Y-84934880D02*
X111745000Y-84458690D01*
X111506905Y-84934880D02*
X111506905Y-83934880D01*
X111506905Y-83934880D02*
X111887857Y-83934880D01*
X111887857Y-83934880D02*
X111983095Y-83982500D01*
X111983095Y-83982500D02*
X112030714Y-84030119D01*
X112030714Y-84030119D02*
X112078333Y-84125357D01*
X112078333Y-84125357D02*
X112078333Y-84268214D01*
X112078333Y-84268214D02*
X112030714Y-84363452D01*
X112030714Y-84363452D02*
X111983095Y-84411071D01*
X111983095Y-84411071D02*
X111887857Y-84458690D01*
X111887857Y-84458690D02*
X111506905Y-84458690D01*
X112554524Y-84934880D02*
X112745000Y-84934880D01*
X112745000Y-84934880D02*
X112840238Y-84887261D01*
X112840238Y-84887261D02*
X112887857Y-84839642D01*
X112887857Y-84839642D02*
X112983095Y-84696785D01*
X112983095Y-84696785D02*
X113030714Y-84506309D01*
X113030714Y-84506309D02*
X113030714Y-84125357D01*
X113030714Y-84125357D02*
X112983095Y-84030119D01*
X112983095Y-84030119D02*
X112935476Y-83982500D01*
X112935476Y-83982500D02*
X112840238Y-83934880D01*
X112840238Y-83934880D02*
X112649762Y-83934880D01*
X112649762Y-83934880D02*
X112554524Y-83982500D01*
X112554524Y-83982500D02*
X112506905Y-84030119D01*
X112506905Y-84030119D02*
X112459286Y-84125357D01*
X112459286Y-84125357D02*
X112459286Y-84363452D01*
X112459286Y-84363452D02*
X112506905Y-84458690D01*
X112506905Y-84458690D02*
X112554524Y-84506309D01*
X112554524Y-84506309D02*
X112649762Y-84553928D01*
X112649762Y-84553928D02*
X112840238Y-84553928D01*
X112840238Y-84553928D02*
X112935476Y-84506309D01*
X112935476Y-84506309D02*
X112983095Y-84458690D01*
X112983095Y-84458690D02*
X113030714Y-84363452D01*
%TO.C,R6*%
X178514333Y-117592380D02*
X178181000Y-117116190D01*
X177942905Y-117592380D02*
X177942905Y-116592380D01*
X177942905Y-116592380D02*
X178323857Y-116592380D01*
X178323857Y-116592380D02*
X178419095Y-116640000D01*
X178419095Y-116640000D02*
X178466714Y-116687619D01*
X178466714Y-116687619D02*
X178514333Y-116782857D01*
X178514333Y-116782857D02*
X178514333Y-116925714D01*
X178514333Y-116925714D02*
X178466714Y-117020952D01*
X178466714Y-117020952D02*
X178419095Y-117068571D01*
X178419095Y-117068571D02*
X178323857Y-117116190D01*
X178323857Y-117116190D02*
X177942905Y-117116190D01*
X179371476Y-116592380D02*
X179181000Y-116592380D01*
X179181000Y-116592380D02*
X179085762Y-116640000D01*
X179085762Y-116640000D02*
X179038143Y-116687619D01*
X179038143Y-116687619D02*
X178942905Y-116830476D01*
X178942905Y-116830476D02*
X178895286Y-117020952D01*
X178895286Y-117020952D02*
X178895286Y-117401904D01*
X178895286Y-117401904D02*
X178942905Y-117497142D01*
X178942905Y-117497142D02*
X178990524Y-117544761D01*
X178990524Y-117544761D02*
X179085762Y-117592380D01*
X179085762Y-117592380D02*
X179276238Y-117592380D01*
X179276238Y-117592380D02*
X179371476Y-117544761D01*
X179371476Y-117544761D02*
X179419095Y-117497142D01*
X179419095Y-117497142D02*
X179466714Y-117401904D01*
X179466714Y-117401904D02*
X179466714Y-117163809D01*
X179466714Y-117163809D02*
X179419095Y-117068571D01*
X179419095Y-117068571D02*
X179371476Y-117020952D01*
X179371476Y-117020952D02*
X179276238Y-116973333D01*
X179276238Y-116973333D02*
X179085762Y-116973333D01*
X179085762Y-116973333D02*
X178990524Y-117020952D01*
X178990524Y-117020952D02*
X178942905Y-117068571D01*
X178942905Y-117068571D02*
X178895286Y-117163809D01*
%TO.C,TRIGGER1*%
X168422619Y-107667380D02*
X168994047Y-107667380D01*
X168708333Y-108667380D02*
X168708333Y-107667380D01*
X169898809Y-108667380D02*
X169565476Y-108191190D01*
X169327381Y-108667380D02*
X169327381Y-107667380D01*
X169327381Y-107667380D02*
X169708333Y-107667380D01*
X169708333Y-107667380D02*
X169803571Y-107715000D01*
X169803571Y-107715000D02*
X169851190Y-107762619D01*
X169851190Y-107762619D02*
X169898809Y-107857857D01*
X169898809Y-107857857D02*
X169898809Y-108000714D01*
X169898809Y-108000714D02*
X169851190Y-108095952D01*
X169851190Y-108095952D02*
X169803571Y-108143571D01*
X169803571Y-108143571D02*
X169708333Y-108191190D01*
X169708333Y-108191190D02*
X169327381Y-108191190D01*
X170327381Y-108667380D02*
X170327381Y-107667380D01*
X171327380Y-107715000D02*
X171232142Y-107667380D01*
X171232142Y-107667380D02*
X171089285Y-107667380D01*
X171089285Y-107667380D02*
X170946428Y-107715000D01*
X170946428Y-107715000D02*
X170851190Y-107810238D01*
X170851190Y-107810238D02*
X170803571Y-107905476D01*
X170803571Y-107905476D02*
X170755952Y-108095952D01*
X170755952Y-108095952D02*
X170755952Y-108238809D01*
X170755952Y-108238809D02*
X170803571Y-108429285D01*
X170803571Y-108429285D02*
X170851190Y-108524523D01*
X170851190Y-108524523D02*
X170946428Y-108619761D01*
X170946428Y-108619761D02*
X171089285Y-108667380D01*
X171089285Y-108667380D02*
X171184523Y-108667380D01*
X171184523Y-108667380D02*
X171327380Y-108619761D01*
X171327380Y-108619761D02*
X171374999Y-108572142D01*
X171374999Y-108572142D02*
X171374999Y-108238809D01*
X171374999Y-108238809D02*
X171184523Y-108238809D01*
X172327380Y-107715000D02*
X172232142Y-107667380D01*
X172232142Y-107667380D02*
X172089285Y-107667380D01*
X172089285Y-107667380D02*
X171946428Y-107715000D01*
X171946428Y-107715000D02*
X171851190Y-107810238D01*
X171851190Y-107810238D02*
X171803571Y-107905476D01*
X171803571Y-107905476D02*
X171755952Y-108095952D01*
X171755952Y-108095952D02*
X171755952Y-108238809D01*
X171755952Y-108238809D02*
X171803571Y-108429285D01*
X171803571Y-108429285D02*
X171851190Y-108524523D01*
X171851190Y-108524523D02*
X171946428Y-108619761D01*
X171946428Y-108619761D02*
X172089285Y-108667380D01*
X172089285Y-108667380D02*
X172184523Y-108667380D01*
X172184523Y-108667380D02*
X172327380Y-108619761D01*
X172327380Y-108619761D02*
X172374999Y-108572142D01*
X172374999Y-108572142D02*
X172374999Y-108238809D01*
X172374999Y-108238809D02*
X172184523Y-108238809D01*
X172803571Y-108143571D02*
X173136904Y-108143571D01*
X173279761Y-108667380D02*
X172803571Y-108667380D01*
X172803571Y-108667380D02*
X172803571Y-107667380D01*
X172803571Y-107667380D02*
X173279761Y-107667380D01*
X174279761Y-108667380D02*
X173946428Y-108191190D01*
X173708333Y-108667380D02*
X173708333Y-107667380D01*
X173708333Y-107667380D02*
X174089285Y-107667380D01*
X174089285Y-107667380D02*
X174184523Y-107715000D01*
X174184523Y-107715000D02*
X174232142Y-107762619D01*
X174232142Y-107762619D02*
X174279761Y-107857857D01*
X174279761Y-107857857D02*
X174279761Y-108000714D01*
X174279761Y-108000714D02*
X174232142Y-108095952D01*
X174232142Y-108095952D02*
X174184523Y-108143571D01*
X174184523Y-108143571D02*
X174089285Y-108191190D01*
X174089285Y-108191190D02*
X173708333Y-108191190D01*
X175232142Y-108667380D02*
X174660714Y-108667380D01*
X174946428Y-108667380D02*
X174946428Y-107667380D01*
X174946428Y-107667380D02*
X174851190Y-107810238D01*
X174851190Y-107810238D02*
X174755952Y-107905476D01*
X174755952Y-107905476D02*
X174660714Y-107953095D01*
%TO.C,U2*%
X120088095Y-93842380D02*
X120088095Y-94651904D01*
X120088095Y-94651904D02*
X120135714Y-94747142D01*
X120135714Y-94747142D02*
X120183333Y-94794761D01*
X120183333Y-94794761D02*
X120278571Y-94842380D01*
X120278571Y-94842380D02*
X120469047Y-94842380D01*
X120469047Y-94842380D02*
X120564285Y-94794761D01*
X120564285Y-94794761D02*
X120611904Y-94747142D01*
X120611904Y-94747142D02*
X120659523Y-94651904D01*
X120659523Y-94651904D02*
X120659523Y-93842380D01*
X121088095Y-93937619D02*
X121135714Y-93890000D01*
X121135714Y-93890000D02*
X121230952Y-93842380D01*
X121230952Y-93842380D02*
X121469047Y-93842380D01*
X121469047Y-93842380D02*
X121564285Y-93890000D01*
X121564285Y-93890000D02*
X121611904Y-93937619D01*
X121611904Y-93937619D02*
X121659523Y-94032857D01*
X121659523Y-94032857D02*
X121659523Y-94128095D01*
X121659523Y-94128095D02*
X121611904Y-94270952D01*
X121611904Y-94270952D02*
X121040476Y-94842380D01*
X121040476Y-94842380D02*
X121659523Y-94842380D01*
%TO.C,POWER1*%
X179814286Y-107742380D02*
X179814286Y-106742380D01*
X179814286Y-106742380D02*
X180195238Y-106742380D01*
X180195238Y-106742380D02*
X180290476Y-106790000D01*
X180290476Y-106790000D02*
X180338095Y-106837619D01*
X180338095Y-106837619D02*
X180385714Y-106932857D01*
X180385714Y-106932857D02*
X180385714Y-107075714D01*
X180385714Y-107075714D02*
X180338095Y-107170952D01*
X180338095Y-107170952D02*
X180290476Y-107218571D01*
X180290476Y-107218571D02*
X180195238Y-107266190D01*
X180195238Y-107266190D02*
X179814286Y-107266190D01*
X181004762Y-106742380D02*
X181195238Y-106742380D01*
X181195238Y-106742380D02*
X181290476Y-106790000D01*
X181290476Y-106790000D02*
X181385714Y-106885238D01*
X181385714Y-106885238D02*
X181433333Y-107075714D01*
X181433333Y-107075714D02*
X181433333Y-107409047D01*
X181433333Y-107409047D02*
X181385714Y-107599523D01*
X181385714Y-107599523D02*
X181290476Y-107694761D01*
X181290476Y-107694761D02*
X181195238Y-107742380D01*
X181195238Y-107742380D02*
X181004762Y-107742380D01*
X181004762Y-107742380D02*
X180909524Y-107694761D01*
X180909524Y-107694761D02*
X180814286Y-107599523D01*
X180814286Y-107599523D02*
X180766667Y-107409047D01*
X180766667Y-107409047D02*
X180766667Y-107075714D01*
X180766667Y-107075714D02*
X180814286Y-106885238D01*
X180814286Y-106885238D02*
X180909524Y-106790000D01*
X180909524Y-106790000D02*
X181004762Y-106742380D01*
X181766667Y-106742380D02*
X182004762Y-107742380D01*
X182004762Y-107742380D02*
X182195238Y-107028095D01*
X182195238Y-107028095D02*
X182385714Y-107742380D01*
X182385714Y-107742380D02*
X182623810Y-106742380D01*
X183004762Y-107218571D02*
X183338095Y-107218571D01*
X183480952Y-107742380D02*
X183004762Y-107742380D01*
X183004762Y-107742380D02*
X183004762Y-106742380D01*
X183004762Y-106742380D02*
X183480952Y-106742380D01*
X184480952Y-107742380D02*
X184147619Y-107266190D01*
X183909524Y-107742380D02*
X183909524Y-106742380D01*
X183909524Y-106742380D02*
X184290476Y-106742380D01*
X184290476Y-106742380D02*
X184385714Y-106790000D01*
X184385714Y-106790000D02*
X184433333Y-106837619D01*
X184433333Y-106837619D02*
X184480952Y-106932857D01*
X184480952Y-106932857D02*
X184480952Y-107075714D01*
X184480952Y-107075714D02*
X184433333Y-107170952D01*
X184433333Y-107170952D02*
X184385714Y-107218571D01*
X184385714Y-107218571D02*
X184290476Y-107266190D01*
X184290476Y-107266190D02*
X183909524Y-107266190D01*
X185433333Y-107742380D02*
X184861905Y-107742380D01*
X185147619Y-107742380D02*
X185147619Y-106742380D01*
X185147619Y-106742380D02*
X185052381Y-106885238D01*
X185052381Y-106885238D02*
X184957143Y-106980476D01*
X184957143Y-106980476D02*
X184861905Y-107028095D01*
%TO.C,C10*%
X110732142Y-95297142D02*
X110684523Y-95344761D01*
X110684523Y-95344761D02*
X110541666Y-95392380D01*
X110541666Y-95392380D02*
X110446428Y-95392380D01*
X110446428Y-95392380D02*
X110303571Y-95344761D01*
X110303571Y-95344761D02*
X110208333Y-95249523D01*
X110208333Y-95249523D02*
X110160714Y-95154285D01*
X110160714Y-95154285D02*
X110113095Y-94963809D01*
X110113095Y-94963809D02*
X110113095Y-94820952D01*
X110113095Y-94820952D02*
X110160714Y-94630476D01*
X110160714Y-94630476D02*
X110208333Y-94535238D01*
X110208333Y-94535238D02*
X110303571Y-94440000D01*
X110303571Y-94440000D02*
X110446428Y-94392380D01*
X110446428Y-94392380D02*
X110541666Y-94392380D01*
X110541666Y-94392380D02*
X110684523Y-94440000D01*
X110684523Y-94440000D02*
X110732142Y-94487619D01*
X111684523Y-95392380D02*
X111113095Y-95392380D01*
X111398809Y-95392380D02*
X111398809Y-94392380D01*
X111398809Y-94392380D02*
X111303571Y-94535238D01*
X111303571Y-94535238D02*
X111208333Y-94630476D01*
X111208333Y-94630476D02*
X111113095Y-94678095D01*
X112303571Y-94392380D02*
X112398809Y-94392380D01*
X112398809Y-94392380D02*
X112494047Y-94440000D01*
X112494047Y-94440000D02*
X112541666Y-94487619D01*
X112541666Y-94487619D02*
X112589285Y-94582857D01*
X112589285Y-94582857D02*
X112636904Y-94773333D01*
X112636904Y-94773333D02*
X112636904Y-95011428D01*
X112636904Y-95011428D02*
X112589285Y-95201904D01*
X112589285Y-95201904D02*
X112541666Y-95297142D01*
X112541666Y-95297142D02*
X112494047Y-95344761D01*
X112494047Y-95344761D02*
X112398809Y-95392380D01*
X112398809Y-95392380D02*
X112303571Y-95392380D01*
X112303571Y-95392380D02*
X112208333Y-95344761D01*
X112208333Y-95344761D02*
X112160714Y-95297142D01*
X112160714Y-95297142D02*
X112113095Y-95201904D01*
X112113095Y-95201904D02*
X112065476Y-95011428D01*
X112065476Y-95011428D02*
X112065476Y-94773333D01*
X112065476Y-94773333D02*
X112113095Y-94582857D01*
X112113095Y-94582857D02*
X112160714Y-94487619D01*
X112160714Y-94487619D02*
X112208333Y-94440000D01*
X112208333Y-94440000D02*
X112303571Y-94392380D01*
%TO.C,TP2*%
X109995380Y-136103904D02*
X109995380Y-135532476D01*
X110995380Y-135818190D02*
X109995380Y-135818190D01*
X110995380Y-135199142D02*
X109995380Y-135199142D01*
X109995380Y-135199142D02*
X109995380Y-134818190D01*
X109995380Y-134818190D02*
X110043000Y-134722952D01*
X110043000Y-134722952D02*
X110090619Y-134675333D01*
X110090619Y-134675333D02*
X110185857Y-134627714D01*
X110185857Y-134627714D02*
X110328714Y-134627714D01*
X110328714Y-134627714D02*
X110423952Y-134675333D01*
X110423952Y-134675333D02*
X110471571Y-134722952D01*
X110471571Y-134722952D02*
X110519190Y-134818190D01*
X110519190Y-134818190D02*
X110519190Y-135199142D01*
X110090619Y-134246761D02*
X110043000Y-134199142D01*
X110043000Y-134199142D02*
X109995380Y-134103904D01*
X109995380Y-134103904D02*
X109995380Y-133865809D01*
X109995380Y-133865809D02*
X110043000Y-133770571D01*
X110043000Y-133770571D02*
X110090619Y-133722952D01*
X110090619Y-133722952D02*
X110185857Y-133675333D01*
X110185857Y-133675333D02*
X110281095Y-133675333D01*
X110281095Y-133675333D02*
X110423952Y-133722952D01*
X110423952Y-133722952D02*
X110995380Y-134294380D01*
X110995380Y-134294380D02*
X110995380Y-133675333D01*
%TO.C,R8*%
X141971380Y-142135166D02*
X141495190Y-142468499D01*
X141971380Y-142706594D02*
X140971380Y-142706594D01*
X140971380Y-142706594D02*
X140971380Y-142325642D01*
X140971380Y-142325642D02*
X141019000Y-142230404D01*
X141019000Y-142230404D02*
X141066619Y-142182785D01*
X141066619Y-142182785D02*
X141161857Y-142135166D01*
X141161857Y-142135166D02*
X141304714Y-142135166D01*
X141304714Y-142135166D02*
X141399952Y-142182785D01*
X141399952Y-142182785D02*
X141447571Y-142230404D01*
X141447571Y-142230404D02*
X141495190Y-142325642D01*
X141495190Y-142325642D02*
X141495190Y-142706594D01*
X141399952Y-141563737D02*
X141352333Y-141658975D01*
X141352333Y-141658975D02*
X141304714Y-141706594D01*
X141304714Y-141706594D02*
X141209476Y-141754213D01*
X141209476Y-141754213D02*
X141161857Y-141754213D01*
X141161857Y-141754213D02*
X141066619Y-141706594D01*
X141066619Y-141706594D02*
X141019000Y-141658975D01*
X141019000Y-141658975D02*
X140971380Y-141563737D01*
X140971380Y-141563737D02*
X140971380Y-141373261D01*
X140971380Y-141373261D02*
X141019000Y-141278023D01*
X141019000Y-141278023D02*
X141066619Y-141230404D01*
X141066619Y-141230404D02*
X141161857Y-141182785D01*
X141161857Y-141182785D02*
X141209476Y-141182785D01*
X141209476Y-141182785D02*
X141304714Y-141230404D01*
X141304714Y-141230404D02*
X141352333Y-141278023D01*
X141352333Y-141278023D02*
X141399952Y-141373261D01*
X141399952Y-141373261D02*
X141399952Y-141563737D01*
X141399952Y-141563737D02*
X141447571Y-141658975D01*
X141447571Y-141658975D02*
X141495190Y-141706594D01*
X141495190Y-141706594D02*
X141590428Y-141754213D01*
X141590428Y-141754213D02*
X141780904Y-141754213D01*
X141780904Y-141754213D02*
X141876142Y-141706594D01*
X141876142Y-141706594D02*
X141923761Y-141658975D01*
X141923761Y-141658975D02*
X141971380Y-141563737D01*
X141971380Y-141563737D02*
X141971380Y-141373261D01*
X141971380Y-141373261D02*
X141923761Y-141278023D01*
X141923761Y-141278023D02*
X141876142Y-141230404D01*
X141876142Y-141230404D02*
X141780904Y-141182785D01*
X141780904Y-141182785D02*
X141590428Y-141182785D01*
X141590428Y-141182785D02*
X141495190Y-141230404D01*
X141495190Y-141230404D02*
X141447571Y-141278023D01*
X141447571Y-141278023D02*
X141399952Y-141373261D01*
%TO.C,R2*%
X174408333Y-103292380D02*
X174075000Y-102816190D01*
X173836905Y-103292380D02*
X173836905Y-102292380D01*
X173836905Y-102292380D02*
X174217857Y-102292380D01*
X174217857Y-102292380D02*
X174313095Y-102340000D01*
X174313095Y-102340000D02*
X174360714Y-102387619D01*
X174360714Y-102387619D02*
X174408333Y-102482857D01*
X174408333Y-102482857D02*
X174408333Y-102625714D01*
X174408333Y-102625714D02*
X174360714Y-102720952D01*
X174360714Y-102720952D02*
X174313095Y-102768571D01*
X174313095Y-102768571D02*
X174217857Y-102816190D01*
X174217857Y-102816190D02*
X173836905Y-102816190D01*
X174789286Y-102387619D02*
X174836905Y-102340000D01*
X174836905Y-102340000D02*
X174932143Y-102292380D01*
X174932143Y-102292380D02*
X175170238Y-102292380D01*
X175170238Y-102292380D02*
X175265476Y-102340000D01*
X175265476Y-102340000D02*
X175313095Y-102387619D01*
X175313095Y-102387619D02*
X175360714Y-102482857D01*
X175360714Y-102482857D02*
X175360714Y-102578095D01*
X175360714Y-102578095D02*
X175313095Y-102720952D01*
X175313095Y-102720952D02*
X174741667Y-103292380D01*
X174741667Y-103292380D02*
X175360714Y-103292380D01*
%TO.C,R3*%
X186792333Y-107042380D02*
X186459000Y-106566190D01*
X186220905Y-107042380D02*
X186220905Y-106042380D01*
X186220905Y-106042380D02*
X186601857Y-106042380D01*
X186601857Y-106042380D02*
X186697095Y-106090000D01*
X186697095Y-106090000D02*
X186744714Y-106137619D01*
X186744714Y-106137619D02*
X186792333Y-106232857D01*
X186792333Y-106232857D02*
X186792333Y-106375714D01*
X186792333Y-106375714D02*
X186744714Y-106470952D01*
X186744714Y-106470952D02*
X186697095Y-106518571D01*
X186697095Y-106518571D02*
X186601857Y-106566190D01*
X186601857Y-106566190D02*
X186220905Y-106566190D01*
X187125667Y-106042380D02*
X187744714Y-106042380D01*
X187744714Y-106042380D02*
X187411381Y-106423333D01*
X187411381Y-106423333D02*
X187554238Y-106423333D01*
X187554238Y-106423333D02*
X187649476Y-106470952D01*
X187649476Y-106470952D02*
X187697095Y-106518571D01*
X187697095Y-106518571D02*
X187744714Y-106613809D01*
X187744714Y-106613809D02*
X187744714Y-106851904D01*
X187744714Y-106851904D02*
X187697095Y-106947142D01*
X187697095Y-106947142D02*
X187649476Y-106994761D01*
X187649476Y-106994761D02*
X187554238Y-107042380D01*
X187554238Y-107042380D02*
X187268524Y-107042380D01*
X187268524Y-107042380D02*
X187173286Y-106994761D01*
X187173286Y-106994761D02*
X187125667Y-106947142D01*
%TO.C,D4*%
X103730474Y-101374295D02*
X102730474Y-101374295D01*
X102730474Y-101374295D02*
X102730474Y-101136200D01*
X102730474Y-101136200D02*
X102778094Y-100993343D01*
X102778094Y-100993343D02*
X102873332Y-100898105D01*
X102873332Y-100898105D02*
X102968570Y-100850486D01*
X102968570Y-100850486D02*
X103159046Y-100802867D01*
X103159046Y-100802867D02*
X103301903Y-100802867D01*
X103301903Y-100802867D02*
X103492379Y-100850486D01*
X103492379Y-100850486D02*
X103587617Y-100898105D01*
X103587617Y-100898105D02*
X103682855Y-100993343D01*
X103682855Y-100993343D02*
X103730474Y-101136200D01*
X103730474Y-101136200D02*
X103730474Y-101374295D01*
X103063808Y-99945724D02*
X103730474Y-99945724D01*
X102682855Y-100183819D02*
X103397141Y-100421914D01*
X103397141Y-100421914D02*
X103397141Y-99802867D01*
%TO.C,R7*%
X130167380Y-92116666D02*
X129691190Y-92449999D01*
X130167380Y-92688094D02*
X129167380Y-92688094D01*
X129167380Y-92688094D02*
X129167380Y-92307142D01*
X129167380Y-92307142D02*
X129215000Y-92211904D01*
X129215000Y-92211904D02*
X129262619Y-92164285D01*
X129262619Y-92164285D02*
X129357857Y-92116666D01*
X129357857Y-92116666D02*
X129500714Y-92116666D01*
X129500714Y-92116666D02*
X129595952Y-92164285D01*
X129595952Y-92164285D02*
X129643571Y-92211904D01*
X129643571Y-92211904D02*
X129691190Y-92307142D01*
X129691190Y-92307142D02*
X129691190Y-92688094D01*
X129167380Y-91783332D02*
X129167380Y-91116666D01*
X129167380Y-91116666D02*
X130167380Y-91545237D01*
%TO.C,C6*%
X104397333Y-96926142D02*
X104349714Y-96973761D01*
X104349714Y-96973761D02*
X104206857Y-97021380D01*
X104206857Y-97021380D02*
X104111619Y-97021380D01*
X104111619Y-97021380D02*
X103968762Y-96973761D01*
X103968762Y-96973761D02*
X103873524Y-96878523D01*
X103873524Y-96878523D02*
X103825905Y-96783285D01*
X103825905Y-96783285D02*
X103778286Y-96592809D01*
X103778286Y-96592809D02*
X103778286Y-96449952D01*
X103778286Y-96449952D02*
X103825905Y-96259476D01*
X103825905Y-96259476D02*
X103873524Y-96164238D01*
X103873524Y-96164238D02*
X103968762Y-96069000D01*
X103968762Y-96069000D02*
X104111619Y-96021380D01*
X104111619Y-96021380D02*
X104206857Y-96021380D01*
X104206857Y-96021380D02*
X104349714Y-96069000D01*
X104349714Y-96069000D02*
X104397333Y-96116619D01*
X105254476Y-96021380D02*
X105064000Y-96021380D01*
X105064000Y-96021380D02*
X104968762Y-96069000D01*
X104968762Y-96069000D02*
X104921143Y-96116619D01*
X104921143Y-96116619D02*
X104825905Y-96259476D01*
X104825905Y-96259476D02*
X104778286Y-96449952D01*
X104778286Y-96449952D02*
X104778286Y-96830904D01*
X104778286Y-96830904D02*
X104825905Y-96926142D01*
X104825905Y-96926142D02*
X104873524Y-96973761D01*
X104873524Y-96973761D02*
X104968762Y-97021380D01*
X104968762Y-97021380D02*
X105159238Y-97021380D01*
X105159238Y-97021380D02*
X105254476Y-96973761D01*
X105254476Y-96973761D02*
X105302095Y-96926142D01*
X105302095Y-96926142D02*
X105349714Y-96830904D01*
X105349714Y-96830904D02*
X105349714Y-96592809D01*
X105349714Y-96592809D02*
X105302095Y-96497571D01*
X105302095Y-96497571D02*
X105254476Y-96449952D01*
X105254476Y-96449952D02*
X105159238Y-96402333D01*
X105159238Y-96402333D02*
X104968762Y-96402333D01*
X104968762Y-96402333D02*
X104873524Y-96449952D01*
X104873524Y-96449952D02*
X104825905Y-96497571D01*
X104825905Y-96497571D02*
X104778286Y-96592809D01*
%TO.C,RL1*%
X197130571Y-103117380D02*
X196797238Y-102641190D01*
X196559143Y-103117380D02*
X196559143Y-102117380D01*
X196559143Y-102117380D02*
X196940095Y-102117380D01*
X196940095Y-102117380D02*
X197035333Y-102165000D01*
X197035333Y-102165000D02*
X197082952Y-102212619D01*
X197082952Y-102212619D02*
X197130571Y-102307857D01*
X197130571Y-102307857D02*
X197130571Y-102450714D01*
X197130571Y-102450714D02*
X197082952Y-102545952D01*
X197082952Y-102545952D02*
X197035333Y-102593571D01*
X197035333Y-102593571D02*
X196940095Y-102641190D01*
X196940095Y-102641190D02*
X196559143Y-102641190D01*
X198035333Y-103117380D02*
X197559143Y-103117380D01*
X197559143Y-103117380D02*
X197559143Y-102117380D01*
X198892476Y-103117380D02*
X198321048Y-103117380D01*
X198606762Y-103117380D02*
X198606762Y-102117380D01*
X198606762Y-102117380D02*
X198511524Y-102260238D01*
X198511524Y-102260238D02*
X198416286Y-102355476D01*
X198416286Y-102355476D02*
X198321048Y-102403095D01*
%TO.C,C8*%
X197143333Y-105922142D02*
X197095714Y-105969761D01*
X197095714Y-105969761D02*
X196952857Y-106017380D01*
X196952857Y-106017380D02*
X196857619Y-106017380D01*
X196857619Y-106017380D02*
X196714762Y-105969761D01*
X196714762Y-105969761D02*
X196619524Y-105874523D01*
X196619524Y-105874523D02*
X196571905Y-105779285D01*
X196571905Y-105779285D02*
X196524286Y-105588809D01*
X196524286Y-105588809D02*
X196524286Y-105445952D01*
X196524286Y-105445952D02*
X196571905Y-105255476D01*
X196571905Y-105255476D02*
X196619524Y-105160238D01*
X196619524Y-105160238D02*
X196714762Y-105065000D01*
X196714762Y-105065000D02*
X196857619Y-105017380D01*
X196857619Y-105017380D02*
X196952857Y-105017380D01*
X196952857Y-105017380D02*
X197095714Y-105065000D01*
X197095714Y-105065000D02*
X197143333Y-105112619D01*
X197714762Y-105445952D02*
X197619524Y-105398333D01*
X197619524Y-105398333D02*
X197571905Y-105350714D01*
X197571905Y-105350714D02*
X197524286Y-105255476D01*
X197524286Y-105255476D02*
X197524286Y-105207857D01*
X197524286Y-105207857D02*
X197571905Y-105112619D01*
X197571905Y-105112619D02*
X197619524Y-105065000D01*
X197619524Y-105065000D02*
X197714762Y-105017380D01*
X197714762Y-105017380D02*
X197905238Y-105017380D01*
X197905238Y-105017380D02*
X198000476Y-105065000D01*
X198000476Y-105065000D02*
X198048095Y-105112619D01*
X198048095Y-105112619D02*
X198095714Y-105207857D01*
X198095714Y-105207857D02*
X198095714Y-105255476D01*
X198095714Y-105255476D02*
X198048095Y-105350714D01*
X198048095Y-105350714D02*
X198000476Y-105398333D01*
X198000476Y-105398333D02*
X197905238Y-105445952D01*
X197905238Y-105445952D02*
X197714762Y-105445952D01*
X197714762Y-105445952D02*
X197619524Y-105493571D01*
X197619524Y-105493571D02*
X197571905Y-105541190D01*
X197571905Y-105541190D02*
X197524286Y-105636428D01*
X197524286Y-105636428D02*
X197524286Y-105826904D01*
X197524286Y-105826904D02*
X197571905Y-105922142D01*
X197571905Y-105922142D02*
X197619524Y-105969761D01*
X197619524Y-105969761D02*
X197714762Y-106017380D01*
X197714762Y-106017380D02*
X197905238Y-106017380D01*
X197905238Y-106017380D02*
X198000476Y-105969761D01*
X198000476Y-105969761D02*
X198048095Y-105922142D01*
X198048095Y-105922142D02*
X198095714Y-105826904D01*
X198095714Y-105826904D02*
X198095714Y-105636428D01*
X198095714Y-105636428D02*
X198048095Y-105541190D01*
X198048095Y-105541190D02*
X198000476Y-105493571D01*
X198000476Y-105493571D02*
X197905238Y-105445952D01*
%TO.C,U1*%
X115338095Y-82092380D02*
X115338095Y-82901904D01*
X115338095Y-82901904D02*
X115385714Y-82997142D01*
X115385714Y-82997142D02*
X115433333Y-83044761D01*
X115433333Y-83044761D02*
X115528571Y-83092380D01*
X115528571Y-83092380D02*
X115719047Y-83092380D01*
X115719047Y-83092380D02*
X115814285Y-83044761D01*
X115814285Y-83044761D02*
X115861904Y-82997142D01*
X115861904Y-82997142D02*
X115909523Y-82901904D01*
X115909523Y-82901904D02*
X115909523Y-82092380D01*
X116909523Y-83092380D02*
X116338095Y-83092380D01*
X116623809Y-83092380D02*
X116623809Y-82092380D01*
X116623809Y-82092380D02*
X116528571Y-82235238D01*
X116528571Y-82235238D02*
X116433333Y-82330476D01*
X116433333Y-82330476D02*
X116338095Y-82378095D01*
%TO.C,D2*%
X149195905Y-122899380D02*
X149195905Y-121899380D01*
X149195905Y-121899380D02*
X149434000Y-121899380D01*
X149434000Y-121899380D02*
X149576857Y-121947000D01*
X149576857Y-121947000D02*
X149672095Y-122042238D01*
X149672095Y-122042238D02*
X149719714Y-122137476D01*
X149719714Y-122137476D02*
X149767333Y-122327952D01*
X149767333Y-122327952D02*
X149767333Y-122470809D01*
X149767333Y-122470809D02*
X149719714Y-122661285D01*
X149719714Y-122661285D02*
X149672095Y-122756523D01*
X149672095Y-122756523D02*
X149576857Y-122851761D01*
X149576857Y-122851761D02*
X149434000Y-122899380D01*
X149434000Y-122899380D02*
X149195905Y-122899380D01*
X150148286Y-121994619D02*
X150195905Y-121947000D01*
X150195905Y-121947000D02*
X150291143Y-121899380D01*
X150291143Y-121899380D02*
X150529238Y-121899380D01*
X150529238Y-121899380D02*
X150624476Y-121947000D01*
X150624476Y-121947000D02*
X150672095Y-121994619D01*
X150672095Y-121994619D02*
X150719714Y-122089857D01*
X150719714Y-122089857D02*
X150719714Y-122185095D01*
X150719714Y-122185095D02*
X150672095Y-122327952D01*
X150672095Y-122327952D02*
X150100667Y-122899380D01*
X150100667Y-122899380D02*
X150719714Y-122899380D01*
%TO.C,U8*%
X115713095Y-150467380D02*
X115713095Y-151276904D01*
X115713095Y-151276904D02*
X115760714Y-151372142D01*
X115760714Y-151372142D02*
X115808333Y-151419761D01*
X115808333Y-151419761D02*
X115903571Y-151467380D01*
X115903571Y-151467380D02*
X116094047Y-151467380D01*
X116094047Y-151467380D02*
X116189285Y-151419761D01*
X116189285Y-151419761D02*
X116236904Y-151372142D01*
X116236904Y-151372142D02*
X116284523Y-151276904D01*
X116284523Y-151276904D02*
X116284523Y-150467380D01*
X116903571Y-150895952D02*
X116808333Y-150848333D01*
X116808333Y-150848333D02*
X116760714Y-150800714D01*
X116760714Y-150800714D02*
X116713095Y-150705476D01*
X116713095Y-150705476D02*
X116713095Y-150657857D01*
X116713095Y-150657857D02*
X116760714Y-150562619D01*
X116760714Y-150562619D02*
X116808333Y-150515000D01*
X116808333Y-150515000D02*
X116903571Y-150467380D01*
X116903571Y-150467380D02*
X117094047Y-150467380D01*
X117094047Y-150467380D02*
X117189285Y-150515000D01*
X117189285Y-150515000D02*
X117236904Y-150562619D01*
X117236904Y-150562619D02*
X117284523Y-150657857D01*
X117284523Y-150657857D02*
X117284523Y-150705476D01*
X117284523Y-150705476D02*
X117236904Y-150800714D01*
X117236904Y-150800714D02*
X117189285Y-150848333D01*
X117189285Y-150848333D02*
X117094047Y-150895952D01*
X117094047Y-150895952D02*
X116903571Y-150895952D01*
X116903571Y-150895952D02*
X116808333Y-150943571D01*
X116808333Y-150943571D02*
X116760714Y-150991190D01*
X116760714Y-150991190D02*
X116713095Y-151086428D01*
X116713095Y-151086428D02*
X116713095Y-151276904D01*
X116713095Y-151276904D02*
X116760714Y-151372142D01*
X116760714Y-151372142D02*
X116808333Y-151419761D01*
X116808333Y-151419761D02*
X116903571Y-151467380D01*
X116903571Y-151467380D02*
X117094047Y-151467380D01*
X117094047Y-151467380D02*
X117189285Y-151419761D01*
X117189285Y-151419761D02*
X117236904Y-151372142D01*
X117236904Y-151372142D02*
X117284523Y-151276904D01*
X117284523Y-151276904D02*
X117284523Y-151086428D01*
X117284523Y-151086428D02*
X117236904Y-150991190D01*
X117236904Y-150991190D02*
X117189285Y-150943571D01*
X117189285Y-150943571D02*
X117094047Y-150895952D01*
%TO.C,U7*%
X111088095Y-88942380D02*
X111088095Y-89751904D01*
X111088095Y-89751904D02*
X111135714Y-89847142D01*
X111135714Y-89847142D02*
X111183333Y-89894761D01*
X111183333Y-89894761D02*
X111278571Y-89942380D01*
X111278571Y-89942380D02*
X111469047Y-89942380D01*
X111469047Y-89942380D02*
X111564285Y-89894761D01*
X111564285Y-89894761D02*
X111611904Y-89847142D01*
X111611904Y-89847142D02*
X111659523Y-89751904D01*
X111659523Y-89751904D02*
X111659523Y-88942380D01*
X112040476Y-88942380D02*
X112707142Y-88942380D01*
X112707142Y-88942380D02*
X112278571Y-89942380D01*
%TO.C,C2*%
X116823333Y-94464642D02*
X116775714Y-94512261D01*
X116775714Y-94512261D02*
X116632857Y-94559880D01*
X116632857Y-94559880D02*
X116537619Y-94559880D01*
X116537619Y-94559880D02*
X116394762Y-94512261D01*
X116394762Y-94512261D02*
X116299524Y-94417023D01*
X116299524Y-94417023D02*
X116251905Y-94321785D01*
X116251905Y-94321785D02*
X116204286Y-94131309D01*
X116204286Y-94131309D02*
X116204286Y-93988452D01*
X116204286Y-93988452D02*
X116251905Y-93797976D01*
X116251905Y-93797976D02*
X116299524Y-93702738D01*
X116299524Y-93702738D02*
X116394762Y-93607500D01*
X116394762Y-93607500D02*
X116537619Y-93559880D01*
X116537619Y-93559880D02*
X116632857Y-93559880D01*
X116632857Y-93559880D02*
X116775714Y-93607500D01*
X116775714Y-93607500D02*
X116823333Y-93655119D01*
X117204286Y-93655119D02*
X117251905Y-93607500D01*
X117251905Y-93607500D02*
X117347143Y-93559880D01*
X117347143Y-93559880D02*
X117585238Y-93559880D01*
X117585238Y-93559880D02*
X117680476Y-93607500D01*
X117680476Y-93607500D02*
X117728095Y-93655119D01*
X117728095Y-93655119D02*
X117775714Y-93750357D01*
X117775714Y-93750357D02*
X117775714Y-93845595D01*
X117775714Y-93845595D02*
X117728095Y-93988452D01*
X117728095Y-93988452D02*
X117156667Y-94559880D01*
X117156667Y-94559880D02*
X117775714Y-94559880D01*
%TO.C,TP4*%
X130072095Y-127169380D02*
X130643523Y-127169380D01*
X130357809Y-128169380D02*
X130357809Y-127169380D01*
X130976857Y-128169380D02*
X130976857Y-127169380D01*
X130976857Y-127169380D02*
X131357809Y-127169380D01*
X131357809Y-127169380D02*
X131453047Y-127217000D01*
X131453047Y-127217000D02*
X131500666Y-127264619D01*
X131500666Y-127264619D02*
X131548285Y-127359857D01*
X131548285Y-127359857D02*
X131548285Y-127502714D01*
X131548285Y-127502714D02*
X131500666Y-127597952D01*
X131500666Y-127597952D02*
X131453047Y-127645571D01*
X131453047Y-127645571D02*
X131357809Y-127693190D01*
X131357809Y-127693190D02*
X130976857Y-127693190D01*
X132405428Y-127502714D02*
X132405428Y-128169380D01*
X132167333Y-127121761D02*
X131929238Y-127836047D01*
X131929238Y-127836047D02*
X132548285Y-127836047D01*
%TO.C,U9*%
X195320563Y-67951904D02*
X196130087Y-67951904D01*
X196130087Y-67951904D02*
X196225325Y-67904285D01*
X196225325Y-67904285D02*
X196272944Y-67856666D01*
X196272944Y-67856666D02*
X196320563Y-67761428D01*
X196320563Y-67761428D02*
X196320563Y-67570952D01*
X196320563Y-67570952D02*
X196272944Y-67475714D01*
X196272944Y-67475714D02*
X196225325Y-67428095D01*
X196225325Y-67428095D02*
X196130087Y-67380476D01*
X196130087Y-67380476D02*
X195320563Y-67380476D01*
X196320563Y-66856666D02*
X196320563Y-66666190D01*
X196320563Y-66666190D02*
X196272944Y-66570952D01*
X196272944Y-66570952D02*
X196225325Y-66523333D01*
X196225325Y-66523333D02*
X196082468Y-66428095D01*
X196082468Y-66428095D02*
X195891992Y-66380476D01*
X195891992Y-66380476D02*
X195511040Y-66380476D01*
X195511040Y-66380476D02*
X195415802Y-66428095D01*
X195415802Y-66428095D02*
X195368183Y-66475714D01*
X195368183Y-66475714D02*
X195320563Y-66570952D01*
X195320563Y-66570952D02*
X195320563Y-66761428D01*
X195320563Y-66761428D02*
X195368183Y-66856666D01*
X195368183Y-66856666D02*
X195415802Y-66904285D01*
X195415802Y-66904285D02*
X195511040Y-66951904D01*
X195511040Y-66951904D02*
X195749135Y-66951904D01*
X195749135Y-66951904D02*
X195844373Y-66904285D01*
X195844373Y-66904285D02*
X195891992Y-66856666D01*
X195891992Y-66856666D02*
X195939611Y-66761428D01*
X195939611Y-66761428D02*
X195939611Y-66570952D01*
X195939611Y-66570952D02*
X195891992Y-66475714D01*
X195891992Y-66475714D02*
X195844373Y-66428095D01*
X195844373Y-66428095D02*
X195749135Y-66380476D01*
%TO.C,J10*%
X103050476Y-86925380D02*
X103050476Y-87639666D01*
X103050476Y-87639666D02*
X103002857Y-87782523D01*
X103002857Y-87782523D02*
X102907619Y-87877761D01*
X102907619Y-87877761D02*
X102764762Y-87925380D01*
X102764762Y-87925380D02*
X102669524Y-87925380D01*
X104050476Y-87925380D02*
X103479048Y-87925380D01*
X103764762Y-87925380D02*
X103764762Y-86925380D01*
X103764762Y-86925380D02*
X103669524Y-87068238D01*
X103669524Y-87068238D02*
X103574286Y-87163476D01*
X103574286Y-87163476D02*
X103479048Y-87211095D01*
X104669524Y-86925380D02*
X104764762Y-86925380D01*
X104764762Y-86925380D02*
X104860000Y-86973000D01*
X104860000Y-86973000D02*
X104907619Y-87020619D01*
X104907619Y-87020619D02*
X104955238Y-87115857D01*
X104955238Y-87115857D02*
X105002857Y-87306333D01*
X105002857Y-87306333D02*
X105002857Y-87544428D01*
X105002857Y-87544428D02*
X104955238Y-87734904D01*
X104955238Y-87734904D02*
X104907619Y-87830142D01*
X104907619Y-87830142D02*
X104860000Y-87877761D01*
X104860000Y-87877761D02*
X104764762Y-87925380D01*
X104764762Y-87925380D02*
X104669524Y-87925380D01*
X104669524Y-87925380D02*
X104574286Y-87877761D01*
X104574286Y-87877761D02*
X104526667Y-87830142D01*
X104526667Y-87830142D02*
X104479048Y-87734904D01*
X104479048Y-87734904D02*
X104431429Y-87544428D01*
X104431429Y-87544428D02*
X104431429Y-87306333D01*
X104431429Y-87306333D02*
X104479048Y-87115857D01*
X104479048Y-87115857D02*
X104526667Y-87020619D01*
X104526667Y-87020619D02*
X104574286Y-86973000D01*
X104574286Y-86973000D02*
X104669524Y-86925380D01*
%TO.C,R1*%
X146417380Y-129466166D02*
X145941190Y-129799499D01*
X146417380Y-130037594D02*
X145417380Y-130037594D01*
X145417380Y-130037594D02*
X145417380Y-129656642D01*
X145417380Y-129656642D02*
X145465000Y-129561404D01*
X145465000Y-129561404D02*
X145512619Y-129513785D01*
X145512619Y-129513785D02*
X145607857Y-129466166D01*
X145607857Y-129466166D02*
X145750714Y-129466166D01*
X145750714Y-129466166D02*
X145845952Y-129513785D01*
X145845952Y-129513785D02*
X145893571Y-129561404D01*
X145893571Y-129561404D02*
X145941190Y-129656642D01*
X145941190Y-129656642D02*
X145941190Y-130037594D01*
X146417380Y-128513785D02*
X146417380Y-129085213D01*
X146417380Y-128799499D02*
X145417380Y-128799499D01*
X145417380Y-128799499D02*
X145560238Y-128894737D01*
X145560238Y-128894737D02*
X145655476Y-128989975D01*
X145655476Y-128989975D02*
X145703095Y-129085213D01*
%TO.C,D1*%
X115861880Y-99442367D02*
X115861880Y-98442367D01*
X115861880Y-98442367D02*
X116099975Y-98442367D01*
X116099975Y-98442367D02*
X116242832Y-98489987D01*
X116242832Y-98489987D02*
X116338070Y-98585225D01*
X116338070Y-98585225D02*
X116385689Y-98680463D01*
X116385689Y-98680463D02*
X116433308Y-98870939D01*
X116433308Y-98870939D02*
X116433308Y-99013796D01*
X116433308Y-99013796D02*
X116385689Y-99204272D01*
X116385689Y-99204272D02*
X116338070Y-99299510D01*
X116338070Y-99299510D02*
X116242832Y-99394748D01*
X116242832Y-99394748D02*
X116099975Y-99442367D01*
X116099975Y-99442367D02*
X115861880Y-99442367D01*
X117385689Y-99442367D02*
X116814261Y-99442367D01*
X117099975Y-99442367D02*
X117099975Y-98442367D01*
X117099975Y-98442367D02*
X117004737Y-98585225D01*
X117004737Y-98585225D02*
X116909499Y-98680463D01*
X116909499Y-98680463D02*
X116814261Y-98728082D01*
%TO.C,R10*%
X177505142Y-113538380D02*
X177171809Y-113062190D01*
X176933714Y-113538380D02*
X176933714Y-112538380D01*
X176933714Y-112538380D02*
X177314666Y-112538380D01*
X177314666Y-112538380D02*
X177409904Y-112586000D01*
X177409904Y-112586000D02*
X177457523Y-112633619D01*
X177457523Y-112633619D02*
X177505142Y-112728857D01*
X177505142Y-112728857D02*
X177505142Y-112871714D01*
X177505142Y-112871714D02*
X177457523Y-112966952D01*
X177457523Y-112966952D02*
X177409904Y-113014571D01*
X177409904Y-113014571D02*
X177314666Y-113062190D01*
X177314666Y-113062190D02*
X176933714Y-113062190D01*
X178457523Y-113538380D02*
X177886095Y-113538380D01*
X178171809Y-113538380D02*
X178171809Y-112538380D01*
X178171809Y-112538380D02*
X178076571Y-112681238D01*
X178076571Y-112681238D02*
X177981333Y-112776476D01*
X177981333Y-112776476D02*
X177886095Y-112824095D01*
X179076571Y-112538380D02*
X179171809Y-112538380D01*
X179171809Y-112538380D02*
X179267047Y-112586000D01*
X179267047Y-112586000D02*
X179314666Y-112633619D01*
X179314666Y-112633619D02*
X179362285Y-112728857D01*
X179362285Y-112728857D02*
X179409904Y-112919333D01*
X179409904Y-112919333D02*
X179409904Y-113157428D01*
X179409904Y-113157428D02*
X179362285Y-113347904D01*
X179362285Y-113347904D02*
X179314666Y-113443142D01*
X179314666Y-113443142D02*
X179267047Y-113490761D01*
X179267047Y-113490761D02*
X179171809Y-113538380D01*
X179171809Y-113538380D02*
X179076571Y-113538380D01*
X179076571Y-113538380D02*
X178981333Y-113490761D01*
X178981333Y-113490761D02*
X178933714Y-113443142D01*
X178933714Y-113443142D02*
X178886095Y-113347904D01*
X178886095Y-113347904D02*
X178838476Y-113157428D01*
X178838476Y-113157428D02*
X178838476Y-112919333D01*
X178838476Y-112919333D02*
X178886095Y-112728857D01*
X178886095Y-112728857D02*
X178933714Y-112633619D01*
X178933714Y-112633619D02*
X178981333Y-112586000D01*
X178981333Y-112586000D02*
X179076571Y-112538380D01*
%TO.C,R12*%
X124032142Y-80067380D02*
X123698809Y-79591190D01*
X123460714Y-80067380D02*
X123460714Y-79067380D01*
X123460714Y-79067380D02*
X123841666Y-79067380D01*
X123841666Y-79067380D02*
X123936904Y-79115000D01*
X123936904Y-79115000D02*
X123984523Y-79162619D01*
X123984523Y-79162619D02*
X124032142Y-79257857D01*
X124032142Y-79257857D02*
X124032142Y-79400714D01*
X124032142Y-79400714D02*
X123984523Y-79495952D01*
X123984523Y-79495952D02*
X123936904Y-79543571D01*
X123936904Y-79543571D02*
X123841666Y-79591190D01*
X123841666Y-79591190D02*
X123460714Y-79591190D01*
X124984523Y-80067380D02*
X124413095Y-80067380D01*
X124698809Y-80067380D02*
X124698809Y-79067380D01*
X124698809Y-79067380D02*
X124603571Y-79210238D01*
X124603571Y-79210238D02*
X124508333Y-79305476D01*
X124508333Y-79305476D02*
X124413095Y-79353095D01*
X125365476Y-79162619D02*
X125413095Y-79115000D01*
X125413095Y-79115000D02*
X125508333Y-79067380D01*
X125508333Y-79067380D02*
X125746428Y-79067380D01*
X125746428Y-79067380D02*
X125841666Y-79115000D01*
X125841666Y-79115000D02*
X125889285Y-79162619D01*
X125889285Y-79162619D02*
X125936904Y-79257857D01*
X125936904Y-79257857D02*
X125936904Y-79353095D01*
X125936904Y-79353095D02*
X125889285Y-79495952D01*
X125889285Y-79495952D02*
X125317857Y-80067380D01*
X125317857Y-80067380D02*
X125936904Y-80067380D01*
%TO.C,TP14*%
X113361905Y-93819380D02*
X113933333Y-93819380D01*
X113647619Y-94819380D02*
X113647619Y-93819380D01*
X114266667Y-94819380D02*
X114266667Y-93819380D01*
X114266667Y-93819380D02*
X114647619Y-93819380D01*
X114647619Y-93819380D02*
X114742857Y-93867000D01*
X114742857Y-93867000D02*
X114790476Y-93914619D01*
X114790476Y-93914619D02*
X114838095Y-94009857D01*
X114838095Y-94009857D02*
X114838095Y-94152714D01*
X114838095Y-94152714D02*
X114790476Y-94247952D01*
X114790476Y-94247952D02*
X114742857Y-94295571D01*
X114742857Y-94295571D02*
X114647619Y-94343190D01*
X114647619Y-94343190D02*
X114266667Y-94343190D01*
X115790476Y-94819380D02*
X115219048Y-94819380D01*
X115504762Y-94819380D02*
X115504762Y-93819380D01*
X115504762Y-93819380D02*
X115409524Y-93962238D01*
X115409524Y-93962238D02*
X115314286Y-94057476D01*
X115314286Y-94057476D02*
X115219048Y-94105095D01*
X116647619Y-94152714D02*
X116647619Y-94819380D01*
X116409524Y-93771761D02*
X116171429Y-94486047D01*
X116171429Y-94486047D02*
X116790476Y-94486047D01*
%TO.C,TP6*%
X135660095Y-149873380D02*
X136231523Y-149873380D01*
X135945809Y-150873380D02*
X135945809Y-149873380D01*
X136564857Y-150873380D02*
X136564857Y-149873380D01*
X136564857Y-149873380D02*
X136945809Y-149873380D01*
X136945809Y-149873380D02*
X137041047Y-149921000D01*
X137041047Y-149921000D02*
X137088666Y-149968619D01*
X137088666Y-149968619D02*
X137136285Y-150063857D01*
X137136285Y-150063857D02*
X137136285Y-150206714D01*
X137136285Y-150206714D02*
X137088666Y-150301952D01*
X137088666Y-150301952D02*
X137041047Y-150349571D01*
X137041047Y-150349571D02*
X136945809Y-150397190D01*
X136945809Y-150397190D02*
X136564857Y-150397190D01*
X137993428Y-149873380D02*
X137802952Y-149873380D01*
X137802952Y-149873380D02*
X137707714Y-149921000D01*
X137707714Y-149921000D02*
X137660095Y-149968619D01*
X137660095Y-149968619D02*
X137564857Y-150111476D01*
X137564857Y-150111476D02*
X137517238Y-150301952D01*
X137517238Y-150301952D02*
X137517238Y-150682904D01*
X137517238Y-150682904D02*
X137564857Y-150778142D01*
X137564857Y-150778142D02*
X137612476Y-150825761D01*
X137612476Y-150825761D02*
X137707714Y-150873380D01*
X137707714Y-150873380D02*
X137898190Y-150873380D01*
X137898190Y-150873380D02*
X137993428Y-150825761D01*
X137993428Y-150825761D02*
X138041047Y-150778142D01*
X138041047Y-150778142D02*
X138088666Y-150682904D01*
X138088666Y-150682904D02*
X138088666Y-150444809D01*
X138088666Y-150444809D02*
X138041047Y-150349571D01*
X138041047Y-150349571D02*
X137993428Y-150301952D01*
X137993428Y-150301952D02*
X137898190Y-150254333D01*
X137898190Y-150254333D02*
X137707714Y-150254333D01*
X137707714Y-150254333D02*
X137612476Y-150301952D01*
X137612476Y-150301952D02*
X137564857Y-150349571D01*
X137564857Y-150349571D02*
X137517238Y-150444809D01*
%TO.C,TP5*%
X130088095Y-123457380D02*
X130659523Y-123457380D01*
X130373809Y-124457380D02*
X130373809Y-123457380D01*
X130992857Y-124457380D02*
X130992857Y-123457380D01*
X130992857Y-123457380D02*
X131373809Y-123457380D01*
X131373809Y-123457380D02*
X131469047Y-123505000D01*
X131469047Y-123505000D02*
X131516666Y-123552619D01*
X131516666Y-123552619D02*
X131564285Y-123647857D01*
X131564285Y-123647857D02*
X131564285Y-123790714D01*
X131564285Y-123790714D02*
X131516666Y-123885952D01*
X131516666Y-123885952D02*
X131469047Y-123933571D01*
X131469047Y-123933571D02*
X131373809Y-123981190D01*
X131373809Y-123981190D02*
X130992857Y-123981190D01*
X132469047Y-123457380D02*
X131992857Y-123457380D01*
X131992857Y-123457380D02*
X131945238Y-123933571D01*
X131945238Y-123933571D02*
X131992857Y-123885952D01*
X131992857Y-123885952D02*
X132088095Y-123838333D01*
X132088095Y-123838333D02*
X132326190Y-123838333D01*
X132326190Y-123838333D02*
X132421428Y-123885952D01*
X132421428Y-123885952D02*
X132469047Y-123933571D01*
X132469047Y-123933571D02*
X132516666Y-124028809D01*
X132516666Y-124028809D02*
X132516666Y-124266904D01*
X132516666Y-124266904D02*
X132469047Y-124362142D01*
X132469047Y-124362142D02*
X132421428Y-124409761D01*
X132421428Y-124409761D02*
X132326190Y-124457380D01*
X132326190Y-124457380D02*
X132088095Y-124457380D01*
X132088095Y-124457380D02*
X131992857Y-124409761D01*
X131992857Y-124409761D02*
X131945238Y-124362142D01*
%TO.C,C1*%
X108933333Y-84819642D02*
X108885714Y-84867261D01*
X108885714Y-84867261D02*
X108742857Y-84914880D01*
X108742857Y-84914880D02*
X108647619Y-84914880D01*
X108647619Y-84914880D02*
X108504762Y-84867261D01*
X108504762Y-84867261D02*
X108409524Y-84772023D01*
X108409524Y-84772023D02*
X108361905Y-84676785D01*
X108361905Y-84676785D02*
X108314286Y-84486309D01*
X108314286Y-84486309D02*
X108314286Y-84343452D01*
X108314286Y-84343452D02*
X108361905Y-84152976D01*
X108361905Y-84152976D02*
X108409524Y-84057738D01*
X108409524Y-84057738D02*
X108504762Y-83962500D01*
X108504762Y-83962500D02*
X108647619Y-83914880D01*
X108647619Y-83914880D02*
X108742857Y-83914880D01*
X108742857Y-83914880D02*
X108885714Y-83962500D01*
X108885714Y-83962500D02*
X108933333Y-84010119D01*
X109885714Y-84914880D02*
X109314286Y-84914880D01*
X109600000Y-84914880D02*
X109600000Y-83914880D01*
X109600000Y-83914880D02*
X109504762Y-84057738D01*
X109504762Y-84057738D02*
X109409524Y-84152976D01*
X109409524Y-84152976D02*
X109314286Y-84200595D01*
%TO.C,D5*%
X143261905Y-121342380D02*
X143261905Y-120342380D01*
X143261905Y-120342380D02*
X143500000Y-120342380D01*
X143500000Y-120342380D02*
X143642857Y-120390000D01*
X143642857Y-120390000D02*
X143738095Y-120485238D01*
X143738095Y-120485238D02*
X143785714Y-120580476D01*
X143785714Y-120580476D02*
X143833333Y-120770952D01*
X143833333Y-120770952D02*
X143833333Y-120913809D01*
X143833333Y-120913809D02*
X143785714Y-121104285D01*
X143785714Y-121104285D02*
X143738095Y-121199523D01*
X143738095Y-121199523D02*
X143642857Y-121294761D01*
X143642857Y-121294761D02*
X143500000Y-121342380D01*
X143500000Y-121342380D02*
X143261905Y-121342380D01*
X144738095Y-120342380D02*
X144261905Y-120342380D01*
X144261905Y-120342380D02*
X144214286Y-120818571D01*
X144214286Y-120818571D02*
X144261905Y-120770952D01*
X144261905Y-120770952D02*
X144357143Y-120723333D01*
X144357143Y-120723333D02*
X144595238Y-120723333D01*
X144595238Y-120723333D02*
X144690476Y-120770952D01*
X144690476Y-120770952D02*
X144738095Y-120818571D01*
X144738095Y-120818571D02*
X144785714Y-120913809D01*
X144785714Y-120913809D02*
X144785714Y-121151904D01*
X144785714Y-121151904D02*
X144738095Y-121247142D01*
X144738095Y-121247142D02*
X144690476Y-121294761D01*
X144690476Y-121294761D02*
X144595238Y-121342380D01*
X144595238Y-121342380D02*
X144357143Y-121342380D01*
X144357143Y-121342380D02*
X144261905Y-121294761D01*
X144261905Y-121294761D02*
X144214286Y-121247142D01*
%TO.C,RV1*%
X157354761Y-94671380D02*
X157021428Y-94195190D01*
X156783333Y-94671380D02*
X156783333Y-93671380D01*
X156783333Y-93671380D02*
X157164285Y-93671380D01*
X157164285Y-93671380D02*
X157259523Y-93719000D01*
X157259523Y-93719000D02*
X157307142Y-93766619D01*
X157307142Y-93766619D02*
X157354761Y-93861857D01*
X157354761Y-93861857D02*
X157354761Y-94004714D01*
X157354761Y-94004714D02*
X157307142Y-94099952D01*
X157307142Y-94099952D02*
X157259523Y-94147571D01*
X157259523Y-94147571D02*
X157164285Y-94195190D01*
X157164285Y-94195190D02*
X156783333Y-94195190D01*
X157640476Y-93671380D02*
X157973809Y-94671380D01*
X157973809Y-94671380D02*
X158307142Y-93671380D01*
X159164285Y-94671380D02*
X158592857Y-94671380D01*
X158878571Y-94671380D02*
X158878571Y-93671380D01*
X158878571Y-93671380D02*
X158783333Y-93814238D01*
X158783333Y-93814238D02*
X158688095Y-93909476D01*
X158688095Y-93909476D02*
X158592857Y-93957095D01*
%TO.C,R16*%
X144307142Y-137767380D02*
X143973809Y-137291190D01*
X143735714Y-137767380D02*
X143735714Y-136767380D01*
X143735714Y-136767380D02*
X144116666Y-136767380D01*
X144116666Y-136767380D02*
X144211904Y-136815000D01*
X144211904Y-136815000D02*
X144259523Y-136862619D01*
X144259523Y-136862619D02*
X144307142Y-136957857D01*
X144307142Y-136957857D02*
X144307142Y-137100714D01*
X144307142Y-137100714D02*
X144259523Y-137195952D01*
X144259523Y-137195952D02*
X144211904Y-137243571D01*
X144211904Y-137243571D02*
X144116666Y-137291190D01*
X144116666Y-137291190D02*
X143735714Y-137291190D01*
X145259523Y-137767380D02*
X144688095Y-137767380D01*
X144973809Y-137767380D02*
X144973809Y-136767380D01*
X144973809Y-136767380D02*
X144878571Y-136910238D01*
X144878571Y-136910238D02*
X144783333Y-137005476D01*
X144783333Y-137005476D02*
X144688095Y-137053095D01*
X146116666Y-136767380D02*
X145926190Y-136767380D01*
X145926190Y-136767380D02*
X145830952Y-136815000D01*
X145830952Y-136815000D02*
X145783333Y-136862619D01*
X145783333Y-136862619D02*
X145688095Y-137005476D01*
X145688095Y-137005476D02*
X145640476Y-137195952D01*
X145640476Y-137195952D02*
X145640476Y-137576904D01*
X145640476Y-137576904D02*
X145688095Y-137672142D01*
X145688095Y-137672142D02*
X145735714Y-137719761D01*
X145735714Y-137719761D02*
X145830952Y-137767380D01*
X145830952Y-137767380D02*
X146021428Y-137767380D01*
X146021428Y-137767380D02*
X146116666Y-137719761D01*
X146116666Y-137719761D02*
X146164285Y-137672142D01*
X146164285Y-137672142D02*
X146211904Y-137576904D01*
X146211904Y-137576904D02*
X146211904Y-137338809D01*
X146211904Y-137338809D02*
X146164285Y-137243571D01*
X146164285Y-137243571D02*
X146116666Y-137195952D01*
X146116666Y-137195952D02*
X146021428Y-137148333D01*
X146021428Y-137148333D02*
X145830952Y-137148333D01*
X145830952Y-137148333D02*
X145735714Y-137195952D01*
X145735714Y-137195952D02*
X145688095Y-137243571D01*
X145688095Y-137243571D02*
X145640476Y-137338809D01*
%TO.C,U5*%
X162113095Y-102417380D02*
X162113095Y-103226904D01*
X162113095Y-103226904D02*
X162160714Y-103322142D01*
X162160714Y-103322142D02*
X162208333Y-103369761D01*
X162208333Y-103369761D02*
X162303571Y-103417380D01*
X162303571Y-103417380D02*
X162494047Y-103417380D01*
X162494047Y-103417380D02*
X162589285Y-103369761D01*
X162589285Y-103369761D02*
X162636904Y-103322142D01*
X162636904Y-103322142D02*
X162684523Y-103226904D01*
X162684523Y-103226904D02*
X162684523Y-102417380D01*
X163636904Y-102417380D02*
X163160714Y-102417380D01*
X163160714Y-102417380D02*
X163113095Y-102893571D01*
X163113095Y-102893571D02*
X163160714Y-102845952D01*
X163160714Y-102845952D02*
X163255952Y-102798333D01*
X163255952Y-102798333D02*
X163494047Y-102798333D01*
X163494047Y-102798333D02*
X163589285Y-102845952D01*
X163589285Y-102845952D02*
X163636904Y-102893571D01*
X163636904Y-102893571D02*
X163684523Y-102988809D01*
X163684523Y-102988809D02*
X163684523Y-103226904D01*
X163684523Y-103226904D02*
X163636904Y-103322142D01*
X163636904Y-103322142D02*
X163589285Y-103369761D01*
X163589285Y-103369761D02*
X163494047Y-103417380D01*
X163494047Y-103417380D02*
X163255952Y-103417380D01*
X163255952Y-103417380D02*
X163160714Y-103369761D01*
X163160714Y-103369761D02*
X163113095Y-103322142D01*
%TO.C,TP7*%
X194069380Y-135011904D02*
X194069380Y-134440476D01*
X195069380Y-134726190D02*
X194069380Y-134726190D01*
X195069380Y-134107142D02*
X194069380Y-134107142D01*
X194069380Y-134107142D02*
X194069380Y-133726190D01*
X194069380Y-133726190D02*
X194117000Y-133630952D01*
X194117000Y-133630952D02*
X194164619Y-133583333D01*
X194164619Y-133583333D02*
X194259857Y-133535714D01*
X194259857Y-133535714D02*
X194402714Y-133535714D01*
X194402714Y-133535714D02*
X194497952Y-133583333D01*
X194497952Y-133583333D02*
X194545571Y-133630952D01*
X194545571Y-133630952D02*
X194593190Y-133726190D01*
X194593190Y-133726190D02*
X194593190Y-134107142D01*
X194069380Y-133202380D02*
X194069380Y-132535714D01*
X194069380Y-132535714D02*
X195069380Y-132964285D01*
%TO.C,C11*%
X107507142Y-99672142D02*
X107459523Y-99719761D01*
X107459523Y-99719761D02*
X107316666Y-99767380D01*
X107316666Y-99767380D02*
X107221428Y-99767380D01*
X107221428Y-99767380D02*
X107078571Y-99719761D01*
X107078571Y-99719761D02*
X106983333Y-99624523D01*
X106983333Y-99624523D02*
X106935714Y-99529285D01*
X106935714Y-99529285D02*
X106888095Y-99338809D01*
X106888095Y-99338809D02*
X106888095Y-99195952D01*
X106888095Y-99195952D02*
X106935714Y-99005476D01*
X106935714Y-99005476D02*
X106983333Y-98910238D01*
X106983333Y-98910238D02*
X107078571Y-98815000D01*
X107078571Y-98815000D02*
X107221428Y-98767380D01*
X107221428Y-98767380D02*
X107316666Y-98767380D01*
X107316666Y-98767380D02*
X107459523Y-98815000D01*
X107459523Y-98815000D02*
X107507142Y-98862619D01*
X108459523Y-99767380D02*
X107888095Y-99767380D01*
X108173809Y-99767380D02*
X108173809Y-98767380D01*
X108173809Y-98767380D02*
X108078571Y-98910238D01*
X108078571Y-98910238D02*
X107983333Y-99005476D01*
X107983333Y-99005476D02*
X107888095Y-99053095D01*
X109411904Y-99767380D02*
X108840476Y-99767380D01*
X109126190Y-99767380D02*
X109126190Y-98767380D01*
X109126190Y-98767380D02*
X109030952Y-98910238D01*
X109030952Y-98910238D02*
X108935714Y-99005476D01*
X108935714Y-99005476D02*
X108840476Y-99053095D01*
%TO.C,U4*%
X188788095Y-112567380D02*
X188788095Y-113376904D01*
X188788095Y-113376904D02*
X188835714Y-113472142D01*
X188835714Y-113472142D02*
X188883333Y-113519761D01*
X188883333Y-113519761D02*
X188978571Y-113567380D01*
X188978571Y-113567380D02*
X189169047Y-113567380D01*
X189169047Y-113567380D02*
X189264285Y-113519761D01*
X189264285Y-113519761D02*
X189311904Y-113472142D01*
X189311904Y-113472142D02*
X189359523Y-113376904D01*
X189359523Y-113376904D02*
X189359523Y-112567380D01*
X190264285Y-112900714D02*
X190264285Y-113567380D01*
X190026190Y-112519761D02*
X189788095Y-113234047D01*
X189788095Y-113234047D02*
X190407142Y-113234047D01*
%TO.C,U3*%
X151463095Y-137192380D02*
X151463095Y-138001904D01*
X151463095Y-138001904D02*
X151510714Y-138097142D01*
X151510714Y-138097142D02*
X151558333Y-138144761D01*
X151558333Y-138144761D02*
X151653571Y-138192380D01*
X151653571Y-138192380D02*
X151844047Y-138192380D01*
X151844047Y-138192380D02*
X151939285Y-138144761D01*
X151939285Y-138144761D02*
X151986904Y-138097142D01*
X151986904Y-138097142D02*
X152034523Y-138001904D01*
X152034523Y-138001904D02*
X152034523Y-137192380D01*
X152415476Y-137192380D02*
X153034523Y-137192380D01*
X153034523Y-137192380D02*
X152701190Y-137573333D01*
X152701190Y-137573333D02*
X152844047Y-137573333D01*
X152844047Y-137573333D02*
X152939285Y-137620952D01*
X152939285Y-137620952D02*
X152986904Y-137668571D01*
X152986904Y-137668571D02*
X153034523Y-137763809D01*
X153034523Y-137763809D02*
X153034523Y-138001904D01*
X153034523Y-138001904D02*
X152986904Y-138097142D01*
X152986904Y-138097142D02*
X152939285Y-138144761D01*
X152939285Y-138144761D02*
X152844047Y-138192380D01*
X152844047Y-138192380D02*
X152558333Y-138192380D01*
X152558333Y-138192380D02*
X152463095Y-138144761D01*
X152463095Y-138144761D02*
X152415476Y-138097142D01*
%TO.C,TP3*%
X120133380Y-134103904D02*
X120133380Y-133532476D01*
X121133380Y-133818190D02*
X120133380Y-133818190D01*
X121133380Y-133199142D02*
X120133380Y-133199142D01*
X120133380Y-133199142D02*
X120133380Y-132818190D01*
X120133380Y-132818190D02*
X120181000Y-132722952D01*
X120181000Y-132722952D02*
X120228619Y-132675333D01*
X120228619Y-132675333D02*
X120323857Y-132627714D01*
X120323857Y-132627714D02*
X120466714Y-132627714D01*
X120466714Y-132627714D02*
X120561952Y-132675333D01*
X120561952Y-132675333D02*
X120609571Y-132722952D01*
X120609571Y-132722952D02*
X120657190Y-132818190D01*
X120657190Y-132818190D02*
X120657190Y-133199142D01*
X120133380Y-132294380D02*
X120133380Y-131675333D01*
X120133380Y-131675333D02*
X120514333Y-132008666D01*
X120514333Y-132008666D02*
X120514333Y-131865809D01*
X120514333Y-131865809D02*
X120561952Y-131770571D01*
X120561952Y-131770571D02*
X120609571Y-131722952D01*
X120609571Y-131722952D02*
X120704809Y-131675333D01*
X120704809Y-131675333D02*
X120942904Y-131675333D01*
X120942904Y-131675333D02*
X121038142Y-131722952D01*
X121038142Y-131722952D02*
X121085761Y-131770571D01*
X121085761Y-131770571D02*
X121133380Y-131865809D01*
X121133380Y-131865809D02*
X121133380Y-132151523D01*
X121133380Y-132151523D02*
X121085761Y-132246761D01*
X121085761Y-132246761D02*
X121038142Y-132294380D01*
%TO.C,R5*%
X138797380Y-129452666D02*
X138321190Y-129785999D01*
X138797380Y-130024094D02*
X137797380Y-130024094D01*
X137797380Y-130024094D02*
X137797380Y-129643142D01*
X137797380Y-129643142D02*
X137845000Y-129547904D01*
X137845000Y-129547904D02*
X137892619Y-129500285D01*
X137892619Y-129500285D02*
X137987857Y-129452666D01*
X137987857Y-129452666D02*
X138130714Y-129452666D01*
X138130714Y-129452666D02*
X138225952Y-129500285D01*
X138225952Y-129500285D02*
X138273571Y-129547904D01*
X138273571Y-129547904D02*
X138321190Y-129643142D01*
X138321190Y-129643142D02*
X138321190Y-130024094D01*
X137797380Y-128547904D02*
X137797380Y-129024094D01*
X137797380Y-129024094D02*
X138273571Y-129071713D01*
X138273571Y-129071713D02*
X138225952Y-129024094D01*
X138225952Y-129024094D02*
X138178333Y-128928856D01*
X138178333Y-128928856D02*
X138178333Y-128690761D01*
X138178333Y-128690761D02*
X138225952Y-128595523D01*
X138225952Y-128595523D02*
X138273571Y-128547904D01*
X138273571Y-128547904D02*
X138368809Y-128500285D01*
X138368809Y-128500285D02*
X138606904Y-128500285D01*
X138606904Y-128500285D02*
X138702142Y-128547904D01*
X138702142Y-128547904D02*
X138749761Y-128595523D01*
X138749761Y-128595523D02*
X138797380Y-128690761D01*
X138797380Y-128690761D02*
X138797380Y-128928856D01*
X138797380Y-128928856D02*
X138749761Y-129024094D01*
X138749761Y-129024094D02*
X138702142Y-129071713D01*
D11*
%TO.C,D6*%
X140860000Y-123215000D02*
X138940000Y-123215000D01*
X138940000Y-123215000D02*
X138940000Y-125900000D01*
X140860000Y-125900000D02*
X140860000Y-123215000D01*
%TO.C,TP1*%
X112150000Y-106600000D02*
G75*
G03*
X112150000Y-106600000I-1450000J0D01*
G01*
%TO.C,R4*%
X143029000Y-129513064D02*
X143029000Y-129058936D01*
X144499000Y-129513064D02*
X144499000Y-129058936D01*
%TO.C,TP10*%
X113650000Y-77200000D02*
G75*
G03*
X113650000Y-77200000I-1450000J0D01*
G01*
%TO.C,R11*%
X194022936Y-107565000D02*
X194477064Y-107565000D01*
X194022936Y-109035000D02*
X194477064Y-109035000D01*
D12*
%TO.C,D3*%
X109507023Y-101049987D02*
X109506007Y-101051003D01*
X109512027Y-102750013D02*
X109511011Y-102748997D01*
X109803797Y-101049987D02*
X109507023Y-101049987D01*
X109803797Y-101049987D02*
X112496203Y-101049987D01*
X109803797Y-102750013D02*
X109512027Y-102750013D01*
X110869990Y-101900000D02*
X110539992Y-101900000D01*
X110895999Y-101391999D02*
X110895999Y-102408001D01*
X110972200Y-101900000D02*
X111556401Y-101493599D01*
X111556401Y-101493599D02*
X111556401Y-102306401D01*
X111556401Y-101899746D02*
X111870091Y-101899746D01*
X111556401Y-102306401D02*
X110972200Y-101900000D01*
X112496203Y-101049987D02*
X112496203Y-101193853D01*
X112496203Y-102606147D02*
X112496203Y-102750013D01*
X112496203Y-102750013D02*
X109803797Y-102750013D01*
D13*
X109330086Y-102700102D02*
G75*
G03*
X109330086Y-102700102I-29972J0D01*
G01*
D11*
%TO.C,TP8*%
X130600000Y-87600000D02*
G75*
G03*
X130600000Y-87600000I-1450000J0D01*
G01*
D12*
%TO.C,J7*%
X185928089Y-131779994D02*
X185928089Y-134320000D01*
X124967987Y-131779994D02*
X185928089Y-131779994D01*
X185928089Y-134320000D02*
X124967987Y-134320000D01*
X183337766Y-134320000D02*
X183337766Y-131779994D01*
X124967987Y-134320000D02*
X124967987Y-131779994D01*
X183388038Y-147319997D02*
X183388038Y-149860003D01*
X124967982Y-147319997D02*
X185928084Y-147319997D01*
X185928084Y-149860003D02*
X124967982Y-149860003D01*
X183337761Y-149860003D02*
X183337761Y-147319997D01*
X124967982Y-149860003D02*
X124967982Y-147319997D01*
D13*
X185958087Y-131779994D02*
G75*
G03*
X185958087Y-131779994I-29998J0D01*
G01*
X183418036Y-147319997D02*
G75*
G03*
X183418036Y-147319997I-29998J0D01*
G01*
D12*
%TO.C,U6*%
X185887296Y-91882042D02*
X189443303Y-95438049D01*
X185887296Y-92644044D02*
X188681302Y-95438049D01*
X186141297Y-91374041D02*
X189951305Y-95184049D01*
X186395297Y-90866040D02*
X190459306Y-94930048D01*
X186903298Y-90358039D02*
X190967307Y-94422047D01*
X187411299Y-89850038D02*
X191475308Y-93914046D01*
X188173301Y-89596038D02*
X185887296Y-91882042D01*
X188173301Y-89596038D02*
X191729308Y-93152045D01*
X188681302Y-95184049D02*
X188427301Y-95184049D01*
X188681302Y-95438049D02*
X188935302Y-95438049D01*
X188935302Y-89596038D02*
X185887296Y-92644044D01*
X188935302Y-89596038D02*
X191729308Y-92390043D01*
X189443303Y-95184049D02*
X189189303Y-95184049D01*
X189697304Y-89596038D02*
X185887296Y-93406045D01*
X189951305Y-89850038D02*
X191475308Y-91374041D01*
X189951305Y-95184049D02*
X190205305Y-95184049D01*
X190205305Y-89850038D02*
X186141297Y-93914046D01*
X190713306Y-90104039D02*
X186649298Y-94168047D01*
X190967307Y-90612040D02*
X186903298Y-94676048D01*
X191221307Y-90866040D02*
X187157299Y-94930048D01*
X191475308Y-91374041D02*
X187665300Y-95184049D01*
X191729308Y-92136043D02*
X188681302Y-95184049D01*
X191729308Y-92898044D02*
X189443303Y-95184049D01*
X184810386Y-89954102D02*
G75*
G03*
X184254226Y-91175895I3987773J-2552712D01*
G01*
X184124585Y-93484709D02*
G75*
G03*
X184563345Y-94712471I4673571J977894D01*
G01*
X191338198Y-88506299D02*
G75*
G03*
X186521790Y-88350649I-2540002J-4000498D01*
G01*
X186131188Y-96456515D02*
G75*
G03*
X191372183Y-96517755I2667007J3949720D01*
G01*
X193421001Y-91274905D02*
G75*
G03*
X192959355Y-90146152I-4622835J-1231902D01*
G01*
X193014602Y-94805512D02*
G75*
G03*
X193471370Y-93612954I-4216426J2298713D01*
G01*
D13*
X179328038Y-82927686D02*
G75*
G03*
X179328038Y-82927686I-29972J0D01*
G01*
D12*
X184099184Y-88417399D02*
G75*
G03*
X184099184Y-88417399I-508001J0D01*
G01*
X191797939Y-92506807D02*
G75*
G03*
X191797939Y-92506807I-2999746J0D01*
G01*
X198298320Y-92506807D02*
G75*
G03*
X198298320Y-92506807I-9500127J0D01*
G01*
X196639189Y-92496647D02*
G75*
G03*
X196639189Y-92496647I-7800356J0D01*
G01*
D11*
%TO.C,R13*%
X194477064Y-111835000D02*
X194022936Y-111835000D01*
X194477064Y-110365000D02*
X194022936Y-110365000D01*
%TO.C,R17*%
X144810436Y-141215000D02*
X145264564Y-141215000D01*
X144810436Y-142685000D02*
X145264564Y-142685000D01*
%TO.C,C9*%
X167690000Y-105661252D02*
X167690000Y-105138748D01*
X169160000Y-105661252D02*
X169160000Y-105138748D01*
D14*
%TO.C,Q3*%
X121648787Y-84773825D02*
X121648787Y-85805448D01*
X121648787Y-87826251D02*
X121648787Y-86794628D01*
X123101213Y-84773825D02*
X121648787Y-84773825D01*
X123101213Y-85844640D02*
X123101213Y-86755436D01*
X123101213Y-87826251D02*
X121648787Y-87826251D01*
D13*
X123604997Y-87750051D02*
G75*
G03*
X123604997Y-87750051I-29997J0D01*
G01*
D11*
%TO.C,R9*%
X113010000Y-86647936D02*
X113010000Y-87102064D01*
X111540000Y-86647936D02*
X111540000Y-87102064D01*
%TO.C,R6*%
X181247936Y-116490000D02*
X181702064Y-116490000D01*
X181247936Y-117960000D02*
X181702064Y-117960000D01*
%TO.C,TRIGGER1*%
X172535000Y-103702500D02*
X170615000Y-103702500D01*
X170615000Y-103702500D02*
X170615000Y-106387500D01*
X172535000Y-106387500D02*
X172535000Y-103702500D01*
D12*
%TO.C,U2*%
X121750051Y-93000076D02*
X120350076Y-93000076D01*
X121750051Y-92908103D02*
X121750051Y-93000076D01*
X121750051Y-91608103D02*
X121750051Y-92091973D01*
X121750051Y-90700051D02*
X121750051Y-90791948D01*
X121750051Y-90700051D02*
X120350076Y-90700051D01*
X120350076Y-92908179D02*
X120350076Y-93000076D01*
X120350076Y-90700051D02*
X120350076Y-90791897D01*
D13*
X120026962Y-90797917D02*
G75*
G03*
X120026962Y-90797917I-29972J0D01*
G01*
D12*
X120034075Y-90579985D02*
G75*
G03*
X120034075Y-90579985I-127001J0D01*
G01*
D11*
%TO.C,POWER1*%
X180904000Y-105785000D02*
X182824000Y-105785000D01*
X182824000Y-105785000D02*
X182824000Y-103100000D01*
X180904000Y-103100000D02*
X180904000Y-105785000D01*
%TO.C,C10*%
X111511252Y-97285000D02*
X110988748Y-97285000D01*
X111511252Y-95815000D02*
X110988748Y-95815000D01*
%TO.C,TP2*%
X114226000Y-134842000D02*
G75*
G03*
X114226000Y-134842000I-1450000J0D01*
G01*
%TO.C,R8*%
X142085000Y-144535436D02*
X142085000Y-144989564D01*
X140615000Y-144535436D02*
X140615000Y-144989564D01*
%TO.C,R2*%
X175285000Y-105172936D02*
X175285000Y-105627064D01*
X173815000Y-105172936D02*
X173815000Y-105627064D01*
%TO.C,R3*%
X186240000Y-104202064D02*
X186240000Y-103747936D01*
X187710000Y-104202064D02*
X187710000Y-103747936D01*
D15*
%TO.C,D4*%
X106226746Y-101296856D02*
X106226695Y-101296729D01*
X105363094Y-101296729D02*
X105363094Y-101296729D01*
X105363094Y-101296729D02*
X105363094Y-99975927D01*
X106121057Y-99976054D02*
X106226746Y-99976054D01*
X106226746Y-99976054D02*
X106226746Y-101296856D01*
X105363094Y-99975927D02*
X105464694Y-99975927D01*
D13*
X105420777Y-101436303D02*
G75*
G03*
X105420777Y-101436303I-29972J0D01*
G01*
D11*
%TO.C,R7*%
X128497000Y-91720936D02*
X128497000Y-92175064D01*
X127027000Y-91720936D02*
X127027000Y-92175064D01*
%TO.C,C6*%
X106115000Y-96661252D02*
X106115000Y-96138748D01*
X107585000Y-96661252D02*
X107585000Y-96138748D01*
%TO.C,RL1*%
X194172936Y-102015000D02*
X194627064Y-102015000D01*
X194172936Y-103485000D02*
X194627064Y-103485000D01*
%TO.C,C8*%
X194151248Y-104915000D02*
X194673752Y-104915000D01*
X194151248Y-106385000D02*
X194673752Y-106385000D01*
D12*
%TO.C,U1*%
X115010973Y-85481140D02*
X115010973Y-84719190D01*
X115201499Y-86624143D02*
X116598476Y-86624193D01*
X115477546Y-83703188D02*
X116322327Y-83703188D01*
D13*
X117329947Y-86550381D02*
G75*
G03*
X117329947Y-86550381I-29972J0D01*
G01*
D11*
%TO.C,D2*%
X148585000Y-123340000D02*
X146665000Y-123340000D01*
X146665000Y-123340000D02*
X146665000Y-126025000D01*
X148585000Y-126025000D02*
X148585000Y-123340000D01*
D14*
%TO.C,U8*%
X117626906Y-139550787D02*
X117626906Y-149603213D01*
X114584082Y-139550787D02*
X117626906Y-139550787D01*
X117626906Y-149603213D02*
X114584082Y-149603213D01*
X114584082Y-149603213D02*
X114584082Y-139550787D01*
D16*
X113588603Y-139369990D02*
G75*
G03*
X113588603Y-139369990I-150114J0D01*
G01*
D13*
X113135466Y-139627038D02*
G75*
G03*
X113135466Y-139627038I-29972J0D01*
G01*
D16*
X115486494Y-140131991D02*
G75*
G03*
X115486494Y-140131991I-150114J0D01*
G01*
D12*
%TO.C,U7*%
X112589027Y-91518860D02*
X112589027Y-92280810D01*
X112398501Y-90375857D02*
X111001524Y-90375807D01*
X112122454Y-93296812D02*
X111277673Y-93296812D01*
D13*
X110329997Y-90449619D02*
G75*
G03*
X110329997Y-90449619I-29972J0D01*
G01*
D11*
%TO.C,C2*%
X117735000Y-91238748D02*
X117735000Y-91761252D01*
X116265000Y-91238748D02*
X116265000Y-91761252D01*
%TO.C,TP4*%
X132784000Y-129950000D02*
G75*
G03*
X132784000Y-129950000I-1450000J0D01*
G01*
D12*
%TO.C,U9*%
X191184577Y-56839479D02*
X114095423Y-56839479D01*
X114095423Y-56839479D02*
X114095423Y-77540521D01*
X181596058Y-67190000D02*
X179310053Y-67190000D01*
X125969947Y-67190000D02*
X123683942Y-67190000D01*
X180453056Y-68333002D02*
X180453056Y-66046998D01*
X191184577Y-77540521D02*
X191184577Y-56839479D01*
X114095423Y-77540521D02*
X191184577Y-77540521D01*
X182053259Y-67190000D02*
G75*
G03*
X182053259Y-67190000I-1600203J0D01*
G01*
X126427147Y-67190000D02*
G75*
G03*
X126427147Y-67190000I-1600203J0D01*
G01*
D13*
X109654986Y-77540013D02*
G75*
G03*
X109654986Y-77540013I-29972J0D01*
G01*
D12*
%TO.C,J10*%
X106702829Y-83705505D02*
X106699934Y-84434233D01*
X101132827Y-83715487D02*
X102072578Y-83720034D01*
X104712304Y-83730499D02*
X104920076Y-83734207D01*
X104712304Y-83730499D02*
X106672832Y-83765500D01*
X104712659Y-83732785D02*
X104887234Y-83733623D01*
X101652842Y-84015513D02*
X101132827Y-83715487D01*
X101672832Y-84465500D02*
X101652842Y-84015513D01*
X101672832Y-84465500D02*
X101172832Y-84465500D01*
X101672832Y-84465500D02*
X101672832Y-90565500D01*
X101172832Y-84465500D02*
X101142834Y-90555492D01*
X106695108Y-85651911D02*
X106694778Y-85734385D01*
X106681036Y-89196640D02*
X106680782Y-89264484D01*
X106675778Y-90521304D02*
X106672832Y-91265500D01*
X101142834Y-90555492D02*
X101672832Y-90565500D01*
X101672832Y-90565500D02*
X101672832Y-90865500D01*
X101672832Y-90865500D02*
X101172832Y-91265500D01*
X106672832Y-91265500D02*
X104699680Y-91265500D01*
X101172832Y-91265500D02*
X102083525Y-91265500D01*
D13*
X106783779Y-83495447D02*
G75*
G03*
X106783779Y-83495447I-29997J0D01*
G01*
D11*
%TO.C,R1*%
X146839000Y-129513064D02*
X146839000Y-129058936D01*
X148309000Y-129513064D02*
X148309000Y-129058936D01*
D12*
%TO.C,D1*%
X114956998Y-101074987D02*
X114955982Y-101076003D01*
X114962002Y-102775013D02*
X114960986Y-102773997D01*
X115253772Y-101074987D02*
X114956998Y-101074987D01*
X115253772Y-101074987D02*
X117946178Y-101074987D01*
X115253772Y-102775013D02*
X114962002Y-102775013D01*
X116319965Y-101925000D02*
X115989967Y-101925000D01*
X116345974Y-101416999D02*
X116345974Y-102433001D01*
X116422175Y-101925000D02*
X117006376Y-101518599D01*
X117006376Y-101518599D02*
X117006376Y-102331401D01*
X117006376Y-101924746D02*
X117320066Y-101924746D01*
X117006376Y-102331401D02*
X116422175Y-101925000D01*
X117946178Y-101074987D02*
X117946178Y-101218853D01*
X117946178Y-102631147D02*
X117946178Y-102775013D01*
X117946178Y-102775013D02*
X115253772Y-102775013D01*
D13*
X114780061Y-102725102D02*
G75*
G03*
X114780061Y-102725102I-29972J0D01*
G01*
D11*
%TO.C,R10*%
X181222936Y-112690000D02*
X181677064Y-112690000D01*
X181222936Y-114160000D02*
X181677064Y-114160000D01*
%TO.C,R12*%
X121527064Y-80285000D02*
X121072936Y-80285000D01*
X121527064Y-78815000D02*
X121072936Y-78815000D01*
%TO.C,TP14*%
X116550000Y-96600000D02*
G75*
G03*
X116550000Y-96600000I-1450000J0D01*
G01*
%TO.C,TP6*%
X138372000Y-152654000D02*
G75*
G03*
X138372000Y-152654000I-1450000J0D01*
G01*
%TO.C,TP5*%
X132800000Y-126238000D02*
G75*
G03*
X132800000Y-126238000I-1450000J0D01*
G01*
%TO.C,C1*%
X109935000Y-86663748D02*
X109935000Y-87186252D01*
X108465000Y-86663748D02*
X108465000Y-87186252D01*
%TO.C,D5*%
X144732000Y-123204500D02*
X142812000Y-123204500D01*
X142812000Y-123204500D02*
X142812000Y-125889500D01*
X144732000Y-125889500D02*
X144732000Y-123204500D01*
%TO.C,RV1*%
X163070000Y-99071000D02*
X163070000Y-98041000D01*
X163070000Y-99071000D02*
X152830000Y-99071000D01*
X163070000Y-95059000D02*
X163070000Y-93040000D01*
X163070000Y-90060000D02*
X163070000Y-89030000D01*
X163070000Y-89030000D02*
X152830000Y-89030000D01*
X152830000Y-99071000D02*
X152830000Y-95540000D01*
X152830000Y-92560000D02*
X152830000Y-89030000D01*
%TO.C,R16*%
X144810436Y-138465000D02*
X145264564Y-138465000D01*
X144810436Y-139935000D02*
X145264564Y-139935000D01*
%TO.C,U5*%
X164210000Y-104750000D02*
X164210000Y-106250000D01*
X162090000Y-106250000D02*
X162090000Y-104250000D01*
%TO.C,TP7*%
X198300000Y-133750000D02*
G75*
G03*
X198300000Y-133750000I-1450000J0D01*
G01*
%TO.C,C11*%
X111461252Y-100135000D02*
X110938748Y-100135000D01*
X111461252Y-98665000D02*
X110938748Y-98665000D01*
D17*
%TO.C,U4*%
X188800000Y-110000000D02*
X190800000Y-110000000D01*
X188800000Y-110012370D02*
X188800000Y-110000000D01*
X188800000Y-112000000D02*
X188800000Y-111987630D01*
X190800000Y-110000000D02*
X190800000Y-110012370D01*
X190800000Y-111987630D02*
X190800000Y-112000000D01*
X190800000Y-112000000D02*
X188800000Y-112000000D01*
D13*
X188829820Y-110000000D02*
G75*
G03*
X188829820Y-110000000I-29972J0D01*
G01*
D14*
%TO.C,U3*%
X150406172Y-144481217D02*
X150406172Y-139428791D01*
X153448996Y-144481217D02*
X150406172Y-144481217D01*
X150406172Y-139428791D02*
X153448996Y-139428791D01*
X153448996Y-139428791D02*
X153448996Y-144481217D01*
D16*
X154850114Y-144606515D02*
G75*
G03*
X154850114Y-144606515I-150114J0D01*
G01*
D13*
X154957556Y-144405093D02*
G75*
G03*
X154957556Y-144405093I-29972J0D01*
G01*
D16*
X152846812Y-143860008D02*
G75*
G03*
X152846812Y-143860008I-150114J0D01*
G01*
D11*
%TO.C,TP3*%
X120068000Y-132842000D02*
G75*
G03*
X120068000Y-132842000I-1450000J0D01*
G01*
%TO.C,R5*%
X139219000Y-129513064D02*
X139219000Y-129058936D01*
X140689000Y-129513064D02*
X140689000Y-129058936D01*
%TD*%
%LPC*%
D18*
%TO.C,D6*%
X139900000Y-123962500D03*
X139900000Y-125837500D03*
%TD*%
D19*
%TO.C,TP1*%
X110700000Y-106600000D03*
%TD*%
D20*
%TO.C,R4*%
X143764000Y-130198500D03*
X143764000Y-128373500D03*
%TD*%
D19*
%TO.C,TP10*%
X112200000Y-77200000D03*
%TD*%
D21*
%TO.C,R11*%
X193337500Y-108300000D03*
X195162500Y-108300000D03*
%TD*%
D22*
%TO.C,D3*%
X109449974Y-101899999D03*
X112850024Y-101899999D03*
%TD*%
D19*
%TO.C,TP8*%
X129150000Y-87600000D03*
%TD*%
D23*
%TO.C,J7*%
X184658085Y-133049996D03*
D24*
X182118081Y-133049997D03*
X179578076Y-133049997D03*
X177038071Y-133049997D03*
X174498066Y-133049997D03*
X171958061Y-133049997D03*
X169418056Y-133049997D03*
X166878051Y-133049997D03*
X164338045Y-133049997D03*
X161798040Y-133049997D03*
X159258035Y-133049997D03*
X156718030Y-133049997D03*
X154178025Y-133049997D03*
X151638020Y-133049997D03*
X149098015Y-133049997D03*
X146558010Y-133049997D03*
X144018005Y-133049997D03*
X141478000Y-133049997D03*
X138937995Y-133049997D03*
X136397990Y-133049997D03*
X133857984Y-133049997D03*
X131317979Y-133049997D03*
X128777974Y-133049997D03*
X126237969Y-133049997D03*
X126237964Y-148590000D03*
X128777969Y-148590000D03*
X131317974Y-148590000D03*
X133857979Y-148590000D03*
X136397985Y-148590000D03*
X138937990Y-148590000D03*
X141477995Y-148590000D03*
X144018000Y-148590000D03*
X146558005Y-148590000D03*
X149098010Y-148590000D03*
X151638015Y-148590000D03*
X154178020Y-148590000D03*
X156718025Y-148590000D03*
X159258030Y-148590000D03*
X161798035Y-148590000D03*
X164338040Y-148590000D03*
X166878046Y-148590000D03*
X169418051Y-148590000D03*
X171958056Y-148590000D03*
X174498061Y-148590000D03*
X177038066Y-148590000D03*
X179578071Y-148590000D03*
X182118076Y-148590000D03*
D23*
X184658080Y-148589999D03*
%TD*%
D25*
%TO.C,U6*%
X185521586Y-89154000D03*
X184099184Y-92379807D03*
X185267586Y-95732614D03*
X192227200Y-95732614D03*
X193497202Y-92405207D03*
X192278000Y-89154000D03*
%TD*%
D26*
%TO.C,R13*%
X195162500Y-111100000D03*
X193337500Y-111100000D03*
%TD*%
D21*
%TO.C,R17*%
X144125000Y-141950000D03*
X145950000Y-141950000D03*
%TD*%
D27*
%TO.C,C9*%
X168425000Y-106350000D03*
X168425000Y-104450000D03*
%TD*%
D28*
%TO.C,Q3*%
X123374999Y-87249999D03*
X123374999Y-85350075D03*
X121374999Y-86300037D03*
%TD*%
D29*
%TO.C,R9*%
X112275000Y-85962500D03*
X112275000Y-87787500D03*
%TD*%
D21*
%TO.C,R6*%
X180562500Y-117225000D03*
X182387500Y-117225000D03*
%TD*%
D18*
%TO.C,TRIGGER1*%
X171575000Y-104450000D03*
X171575000Y-106325000D03*
%TD*%
D30*
%TO.C,U2*%
X119949999Y-91199999D03*
X119949999Y-91849986D03*
X119949999Y-92499973D03*
X122150151Y-92499973D03*
X122150151Y-91199999D03*
%TD*%
D31*
%TO.C,POWER1*%
X181864000Y-105037500D03*
X181864000Y-103162500D03*
%TD*%
D32*
%TO.C,C10*%
X112200000Y-96550000D03*
X110300000Y-96550000D03*
%TD*%
D19*
%TO.C,TP2*%
X112776000Y-134842000D03*
%TD*%
D29*
%TO.C,R8*%
X141350000Y-143850000D03*
X141350000Y-145675000D03*
%TD*%
%TO.C,R2*%
X174550000Y-104487500D03*
X174550000Y-106312500D03*
%TD*%
D20*
%TO.C,R3*%
X186975000Y-104887500D03*
X186975000Y-103062500D03*
%TD*%
D33*
%TO.C,D4*%
X105789840Y-101347402D03*
D34*
X105800000Y-99925000D03*
%TD*%
D29*
%TO.C,R7*%
X127762000Y-91035500D03*
X127762000Y-92860500D03*
%TD*%
D27*
%TO.C,C6*%
X106850000Y-97350000D03*
X106850000Y-95450000D03*
%TD*%
D21*
%TO.C,RL1*%
X193487500Y-102750000D03*
X195312500Y-102750000D03*
%TD*%
D35*
%TO.C,C8*%
X193462500Y-105650000D03*
X195362500Y-105650000D03*
%TD*%
D36*
%TO.C,U1*%
X116999999Y-86049999D03*
X116999999Y-85100291D03*
X116999999Y-84150329D03*
X114799847Y-84150075D03*
X114799847Y-86050253D03*
%TD*%
D18*
%TO.C,D2*%
X147625000Y-124087500D03*
X147625000Y-125962500D03*
%TD*%
D37*
%TO.C,U8*%
X113369908Y-140131990D03*
X113369908Y-141401993D03*
X113369908Y-142671995D03*
X113369908Y-143941998D03*
X113369908Y-145212000D03*
X113369908Y-146482003D03*
X113369908Y-147752005D03*
X113369908Y-149022008D03*
X118841078Y-149022008D03*
X118841078Y-147752005D03*
X118841078Y-146482003D03*
X118841078Y-145212000D03*
X118841078Y-143941998D03*
X118841078Y-142671995D03*
X118841078Y-141401993D03*
X118841078Y-140131990D03*
%TD*%
D36*
%TO.C,U7*%
X110599999Y-90949999D03*
X110599999Y-91899707D03*
X110599999Y-92849669D03*
X112800151Y-92849923D03*
X112800151Y-90949745D03*
%TD*%
D38*
%TO.C,C2*%
X117000000Y-90550000D03*
X117000000Y-92450000D03*
%TD*%
D19*
%TO.C,TP4*%
X131334000Y-129950000D03*
%TD*%
D39*
%TO.C,U9*%
X188479980Y-75190000D03*
D40*
X111326816Y-67189999D03*
X193953182Y-67189999D03*
%TD*%
D41*
%TO.C,J10*%
X106434172Y-86165524D03*
X106434172Y-86815512D03*
X106434172Y-87465499D03*
X106434172Y-88115486D03*
X106434172Y-88765474D03*
D42*
X106061554Y-89890443D03*
D43*
X103391500Y-91065448D03*
X103391500Y-83865550D03*
D42*
X106061554Y-85040557D03*
%TD*%
D20*
%TO.C,R1*%
X147574000Y-130198500D03*
X147574000Y-128373500D03*
%TD*%
D22*
%TO.C,D1*%
X114899949Y-101924999D03*
X118299999Y-101924999D03*
%TD*%
D21*
%TO.C,R10*%
X180537500Y-113425000D03*
X182362500Y-113425000D03*
%TD*%
D26*
%TO.C,R12*%
X122212500Y-79550000D03*
X120387500Y-79550000D03*
%TD*%
D19*
%TO.C,TP14*%
X115100000Y-96600000D03*
%TD*%
%TO.C,TP6*%
X136922000Y-152654000D03*
%TD*%
%TO.C,TP5*%
X131350000Y-126238000D03*
%TD*%
D38*
%TO.C,C1*%
X109200000Y-85975000D03*
X109200000Y-87875000D03*
%TD*%
D18*
%TO.C,D5*%
X143772000Y-123952000D03*
X143772000Y-125827000D03*
%TD*%
D44*
%TO.C,RV1*%
X162574999Y-91549999D03*
X153324999Y-94049999D03*
X162574999Y-96549999D03*
%TD*%
D21*
%TO.C,R16*%
X144125000Y-139200000D03*
X145950000Y-139200000D03*
%TD*%
D45*
%TO.C,U5*%
X163899999Y-104524999D03*
X163399999Y-104524999D03*
X162899999Y-104524999D03*
X162399999Y-104524999D03*
X162399999Y-105974999D03*
X162899999Y-105974999D03*
X163399999Y-105974999D03*
X163899999Y-105974999D03*
%TD*%
D19*
%TO.C,TP7*%
X196850000Y-133750000D03*
%TD*%
D32*
%TO.C,C11*%
X112150000Y-99400000D03*
X110250000Y-99400000D03*
%TD*%
D46*
%TO.C,U4*%
X188999999Y-110350012D03*
X188999999Y-110999999D03*
X188999999Y-111649986D03*
X190600202Y-111649986D03*
X190600202Y-110999999D03*
X190600202Y-110350012D03*
%TD*%
D47*
%TO.C,U3*%
X154699999Y-143860007D03*
X154699999Y-142590004D03*
X154699999Y-141320002D03*
X154699999Y-140049999D03*
X149155167Y-140049999D03*
X149155167Y-141320002D03*
X149155167Y-142590004D03*
X149155167Y-143860007D03*
%TD*%
D19*
%TO.C,TP3*%
X118618000Y-132842000D03*
%TD*%
D20*
%TO.C,R5*%
X139954000Y-130198500D03*
X139954000Y-128373500D03*
%TD*%
M02*
