#VRML V2.0 utf8
#created by JLC2KiCad_lib using the JLCPCB library
#for more info see https://github.com/TousstNicolas/JLC2KICAD_lib

Shape{
	appearance Appearance {
		material  Material 	{ 
			diffuseColor 0.25098039215686274 0.25098039215686274 0.25098039215686274 
			specularColor 0.12549019607843137 0.12549019607843137 0.12549019607843137
			ambientIntensity 0.2
			transparency 0.0
			shininess 0.5
		}
	}
	geometry IndexedFaceSet {
		ccw TRUE 
		solid FALSE
		coord DEF co Coordinate {
			point [
				-0.015 -0.0144 -0.2559, -0.015 -0.0187 -0.2559, -0.0188 -0.0189 -0.2559, 0.0061 -0.0187 -0.2559, -0.014 0.0164 -0.2559, 0.0008 0.0164 -0.2559, 0.0008 0.0034 -0.2559, 0.0138 -0.0167 -0.2559, 0.0138 -0.0123 -0.2559, 0.0061 0.0207 -0.2559, 0.0008 -0.0009 -0.2559, 0.0008 -0.0144 -0.2559, -0.0131 -0.0009 -0.2559, -0.0131 0.0034 -0.2559, 0.0333 -0.0174 -0.2559, 0.0464 -0.0187 -0.2559, 0.0295 -0.0187 -0.2559, 0.0269 -0.0189 -0.2559, -0.014 0.0207 -0.2559, -0.0188 0.2787 -0.2559, 0.041 0.0103 -0.2559, 0.0387 0.014 -0.2559, 0.0613 0.0207 -0.2559, 0.0269 0.0164 -0.2559, 0.0298 0.0153 -0.2559, 0.0145 -0.0127 -0.2559, 0.0326 0.0135 -0.2559, 0.0349 0.0109 -0.2559, 0.0378 0.0006 -0.2559, 0.0374 -0.0037 -0.2559, 0.0363 -0.0071 -0.2559, 0.0276 -0.0144 -0.2559, 0.0239 -0.0149 -0.2559, 0.0304 -0.0134 -0.2559, 0.0329 -0.0118 -0.2559, 0.0347 -0.0098 -0.2559, 0.0187 -0.0143 -0.2559, 0.0366 0.0078 -0.2559, 0.0376 0.0036 -0.2559, 0.0351 0.0174 -0.2559, 0.0666 0.0207 -0.2559, 0.5346 0.2787 -0.2559, 0.0666 -0.0187 -0.2559, 0.5346 -0.0189 -0.2559, 0.0365 -0.0153 -0.2559, 0.0394 -0.0122 -0.2559, 0.0464 -0.0144 -0.2559, 0.0415 -0.0085 -0.2559, 0.0613 -0.0144 -0.2559, 0.0427 -0.0043 -0.2559, 0.0431 0.0002 -0.2559, 0.0425 0.0058 -0.2559, 0.0314 0.0196 -0.2559, 0.027 0.0208 -0.2559, 0.0231 0.0212 -0.2559, 0.0184 0.0208 -0.2559, 0.0138 0.0196 -0.2559, 0.0138 0.0143 -0.2559, 0.0182 0.0162 -0.2559, 0.023 0.0168 -0.2559, 0.0246 -0.0192 -0.2559, 0.5346 -0.2787 -0.2559, 0.0236 -0.0192 -0.2559, -0.0188 -0.2787 -0.2559, 0.022 -0.0189 -0.2559, -0.5346 -0.2787 -0.2559, -0.5346 -0.0189 -0.2559, 0.018 -0.0184 -0.2559, -0.063 -0.0187 -0.2559, -0.0573 -0.0187 -0.2559, -0.0524 -0.0079 -0.2559, -0.0502 -0.0114 -0.2559, -0.0469 -0.0145 -0.2559, -0.0428 -0.0169 -0.2559, -0.0721 0.0207 -0.2559, -0.5346 0.2787 -0.2559, -0.0774 0.0207 -0.2559, -0.0928 -0.0187 -0.2559, -0.087 -0.0187 -0.2559, -0.083 -0.0076 -0.2559, -0.0668 -0.0076 -0.2559, -0.0227 0.0207 -0.2559, -0.0338 0.0207 -0.2559, -0.0484 0.0155 -0.2559, -0.0512 0.0125 -0.2559, -0.053 0.0091 -0.2559, -0.0395 0.0201 -0.2559, -0.0441 0.0185 -0.2559, -0.0484 0.0156 -0.2559, -0.0383 -0.0183 -0.2559, -0.0334 -0.0187 -0.2559, -0.0227 -0.0187 -0.2559, -0.0541 0.0052 -0.2559, -0.0544 0.0015 -0.2559, -0.0538 -0.0038 -0.2559, 0.5415 0.3052 0.1392, 0.5512 0.315 0.0, 0.4528 0.315 -0.0, 0.4528 0.3108 0.0591, 0.2953 0.3108 0.0591, -0.5415 0.3052 0.1392, -0.4528 0.315 -0.0, -0.5512 0.315 -0.0, -0.4528 0.3108 0.0591, -0.2953 0.3108 0.0591, -0.2953 0.315 0.0, 0.2953 0.315 0.0, -0.5415 -0.3052 0.1392, -0.5512 -0.315 0.0, -0.4528 -0.315 0.0, -0.2953 -0.315 -0.0, -0.0787 -0.315 -0.0, -0.2953 -0.3108 0.0591, -0.0787 -0.3108 0.0591, -0.4528 -0.3108 0.0591, 0.5415 -0.3052 0.1392, 0.0787 -0.3108 0.0591, 0.4528 -0.315 -0.0, 0.5512 -0.315 -0.0, 0.4528 -0.3108 0.0591, 0.2953 -0.3108 0.0591, 0.2953 -0.315 0.0, 0.0787 -0.315 -0.0, 0.5709 0.2953 0.0, 0.5709 -0.2953 -0.0, 0.5543 0.2787 -0.2376, 0.5543 -0.2787 -0.2376, 0.5346 -0.2983 -0.2376, -0.5346 -0.2983 -0.2376, -0.5709 -0.2953 -0.0, -0.5709 0.2953 -0.0, -0.5543 -0.2787 -0.2376, -0.5543 0.2787 -0.2376, 0.5346 0.2983 -0.2376, -0.5346 0.2983 -0.2376, 0.5611 0.2856 0.1392, 0.5611 -0.2856 0.1392, -0.5611 -0.2856 0.1392, -0.5611 0.2856 0.1392, -0.3206 -0.1907 0.1575, -0.327 -0.206 0.1575, 0.5415 -0.2856 0.1575, -0.3371 -0.2192 0.1575, -0.3502 -0.2293 0.1575, -0.3655 -0.2356 0.1575, -0.382 -0.2378 0.1575, -0.5415 -0.2856 0.1575, -0.3984 -0.2356 0.1575, -0.4137 -0.2293 0.1575, -0.4269 -0.2192 0.1575, -0.4369 -0.206 0.1575, -0.4369 -0.1425 0.1575, -0.4269 -0.1294 0.1575, -0.5415 0.2856 0.1575, -0.4137 -0.1193 0.1575, -0.3984 -0.113 0.1575, -0.382 -0.1108 0.1575, -0.3655 -0.113 0.1575, 0.5415 0.2856 0.1575, -0.3502 -0.1193 0.1575, -0.3371 -0.1294 0.1575, -0.327 -0.1425 0.1575, -0.3206 -0.1579 0.1575, -0.3185 -0.1743 0.1575, -0.4433 -0.1907 0.1575, -0.4454 -0.1743 0.1575, -0.4433 -0.1579 0.1575, -0.4433 -0.1579 0.1575
			]
		}
		coordIndex [
			0,1,2,-1,2,1,3,-1,4,5,6,-1,7,3,8,-1,8,3,9,-1,10,11,12,-1,12,11,0,-1,12,0,13,-1,14,15,16,-1,16,15,17,-1,6,13,4,-1,4,13,0,-1,4,0,18,-1,18,0,19,-1,18,19,9,-1,20,21,22,-1,23,24,25,-1,25,24,26,-1,25,26,27,-1,28,29,25,-1,25,29,30,-1,31,32,33,-1,33,32,34,-1,30,35,25,-1,25,35,34,-1,25,34,36,-1,36,34,32,-1,27,37,25,-1,25,37,38,-1,25,38,28,-1,21,39,22,-1,22,39,19,-1,22,19,40,-1,40,19,41,-1,40,41,42,-1,42,41,43,-1,14,44,15,-1,15,44,45,-1,15,45,46,-1,46,45,47,-1,46,47,48,-1,47,49,48,-1,48,49,50,-1,48,50,22,-1,22,50,51,-1,22,51,20,-1,39,52,19,-1,19,52,53,-1,19,53,54,-1,54,55,19,-1,19,55,56,-1,19,56,9,-1,9,56,57,-1,9,57,8,-1,8,57,58,-1,8,58,25,-1,25,58,59,-1,25,59,23,-1,15,42,17,-1,17,42,43,-1,17,43,60,-1,60,43,61,-1,60,61,62,-1,62,61,63,-1,62,63,64,-1,65,66,63,-1,63,66,2,-1,63,2,64,-1,64,2,3,-1,64,3,67,-1,67,3,7,-1,68,69,2,-1,70,71,69,-1,69,71,72,-1,69,72,73,-1,19,74,75,-1,75,74,76,-1,75,76,66,-1,66,76,77,-1,66,77,2,-1,2,77,78,-1,2,78,68,-1,68,78,79,-1,68,79,80,-1,0,2,19,-1,19,2,81,-1,19,81,82,-1,83,84,74,-1,74,84,85,-1,82,86,19,-1,19,86,87,-1,19,87,74,-1,74,87,88,-1,74,88,83,-1,73,89,69,-1,69,89,90,-1,69,90,2,-1,2,90,91,-1,2,91,81,-1,85,92,74,-1,74,92,93,-1,74,93,69,-1,69,93,94,-1,69,94,70,-1,95,96,97,-1,97,98,95,-1,95,98,99,-1,95,99,100,-1,101,102,103,-1,103,102,100,-1,103,100,104,-1,104,100,99,-1,104,99,105,-1,105,99,106,-1,107,108,109,-1,110,111,112,-1,112,111,113,-1,109,114,107,-1,107,114,112,-1,107,112,115,-1,115,112,113,-1,115,113,116,-1,117,118,119,-1,119,118,115,-1,119,115,120,-1,120,115,116,-1,120,116,121,-1,121,116,122,-1,123,124,125,-1,125,124,126,-1,127,118,117,-1,117,121,127,-1,127,121,122,-1,127,122,128,-1,128,122,111,-1,111,110,128,-1,128,110,109,-1,128,109,108,-1,129,130,131,-1,131,130,132,-1,97,96,133,-1,102,101,134,-1,134,101,105,-1,134,105,133,-1,133,105,106,-1,133,106,97,-1,135,136,123,-1,123,136,124,-1,137,138,129,-1,129,138,130,-1,139,140,141,-1,141,140,142,-1,141,142,143,-1,143,144,141,-1,141,144,145,-1,141,145,146,-1,146,145,147,-1,147,148,146,-1,146,148,149,-1,146,149,150,-1,151,152,153,-1,153,152,154,-1,153,154,155,-1,155,156,153,-1,153,156,157,-1,153,157,158,-1,158,157,159,-1,158,159,160,-1,160,161,158,-1,158,161,162,-1,158,162,141,-1,141,162,163,-1,141,163,139,-1,150,164,146,-1,146,164,165,-1,146,165,153,-1,153,165,166,-1,153,166,151,-1,
		]
	}
}
Shape{
	appearance Appearance {
		material  Material 	{ 
			diffuseColor 1.0 1.0 1.0 
			specularColor 0.5019607843137255 0.5019607843137255 0.5019607843137255
			ambientIntensity 0.2
			transparency 0.0
			shininess 0.5
		}
	}
	geometry IndexedFaceSet {
		ccw TRUE 
		solid FALSE
		coord DEF co Coordinate {
			point [
				0.0787 -0.3578 -0.0, -0.0787 -0.3578 -0.0, 0.0787 -0.315 -0.0, -0.0787 -0.315 -0.0, -0.0787 -0.3108 0.0591, -0.0787 -0.3578 0.0591, 0.0787 -0.3108 0.0591, 0.0787 -0.3578 0.0591, 0.0787 -0.5709 -0.2165, 0.0787 -0.5709 -0.2756, 0.0787 -0.4721 -0.2165, 0.0787 -0.4721 -0.2756, 0.0787 -0.4673 -0.2159, 0.0787 -0.4529 -0.2732, 0.0787 -0.4628 -0.2142, 0.0787 -0.4348 -0.2662, 0.0787 -0.4588 -0.2114, 0.0787 -0.4189 -0.2549, 0.0787 -0.4557 -0.2077, 0.0787 -0.4064 -0.2401, 0.0787 -0.4535 -0.2033, 0.0787 -0.3978 -0.2227, 0.0787 -0.4525 -0.1986, 0.0787 -0.3937 -0.2037, 0.0787 -0.4363 -0.0128, 0.0787 -0.3775 -0.018, 0.0787 -0.4322 0.0062, 0.0787 -0.3764 -0.0132, 0.0787 -0.4236 0.0236, 0.0787 -0.3743 -0.0089, 0.0787 -0.411 0.0384, 0.0787 -0.3711 -0.0052, 0.0787 -0.3952 0.0496, 0.0787 -0.3672 -0.0024, 0.0787 -0.3771 0.0567, 0.0787 -0.3627 -0.0006, -0.0787 -0.3771 0.0567, -0.0787 -0.3627 -0.0006, -0.0787 -0.3952 0.0496, -0.0787 -0.3672 -0.0024, -0.0787 -0.411 0.0384, -0.0787 -0.3711 -0.0052, -0.0787 -0.4236 0.0236, -0.0787 -0.3743 -0.0089, -0.0787 -0.4322 0.0062, -0.0787 -0.3764 -0.0132, -0.0787 -0.4363 -0.0128, -0.0787 -0.3775 -0.018, -0.0787 -0.4525 -0.1986, -0.0787 -0.3937 -0.2037, -0.0787 -0.4535 -0.2033, -0.0787 -0.3978 -0.2227, -0.0787 -0.4557 -0.2077, -0.0787 -0.4064 -0.2401, -0.0787 -0.4588 -0.2114, -0.0787 -0.4189 -0.2549, -0.0787 -0.4628 -0.2142, -0.0787 -0.4348 -0.2662, -0.0787 -0.4673 -0.2159, -0.0787 -0.4529 -0.2732, -0.0787 -0.4721 -0.2165, -0.0787 -0.4721 -0.2756, -0.0787 -0.5709 -0.2165, -0.0787 -0.5709 -0.2756, 0.4528 -0.3578 -0.0, 0.2953 -0.3578 -0.0, 0.4528 -0.315 -0.0, 0.2953 -0.315 0.0, 0.2953 -0.3108 0.0591, 0.2953 -0.3578 0.0591, 0.4528 -0.3108 0.0591, 0.4528 -0.3578 0.0591, 0.4528 -0.5709 -0.2165, 0.4528 -0.5709 -0.2756, 0.4528 -0.4721 -0.2165, 0.4528 -0.4721 -0.2756, 0.4528 -0.4673 -0.2159, 0.4528 -0.4529 -0.2732, 0.4528 -0.4628 -0.2142, 0.4528 -0.4348 -0.2662, 0.4528 -0.4588 -0.2114, 0.4528 -0.4189 -0.2549, 0.4528 -0.4557 -0.2077, 0.4528 -0.4064 -0.2401, 0.4528 -0.4535 -0.2033, 0.4528 -0.3978 -0.2227, 0.4528 -0.4525 -0.1986, 0.4528 -0.3937 -0.2037, 0.4528 -0.4363 -0.0128, 0.4528 -0.3775 -0.018, 0.4528 -0.4322 0.0062, 0.4528 -0.3764 -0.0132, 0.4528 -0.4236 0.0236, 0.4528 -0.3743 -0.0089, 0.4528 -0.411 0.0384, 0.4528 -0.3711 -0.0052, 0.4528 -0.3952 0.0496, 0.4528 -0.3672 -0.0024, 0.4528 -0.3771 0.0567, 0.4528 -0.3627 -0.0006, 0.2953 -0.5709 -0.2165, 0.2953 -0.4721 -0.2165, 0.2953 -0.5709 -0.2756, 0.2953 -0.4721 -0.2756, 0.2953 -0.4529 -0.2732, 0.2953 -0.4348 -0.2662, 0.2953 -0.4189 -0.2549, 0.2953 -0.4064 -0.2401, 0.2953 -0.3978 -0.2227, 0.2953 -0.3937 -0.2037, 0.2953 -0.3775 -0.018, 0.2953 -0.3764 -0.0132, 0.2953 -0.3743 -0.0089, 0.2953 -0.3711 -0.0052, 0.2953 -0.3672 -0.0024, 0.2953 -0.3627 -0.0006, 0.2953 -0.3771 0.0567, 0.2953 -0.3952 0.0496, 0.2953 -0.411 0.0384, 0.2953 -0.4236 0.0236, 0.2953 -0.4322 0.0062, 0.2953 -0.4363 -0.0128, 0.2953 -0.4525 -0.1986, 0.2953 -0.4535 -0.2033, 0.2953 -0.4557 -0.2077, 0.2953 -0.4588 -0.2114, 0.2953 -0.4628 -0.2142, 0.2953 -0.4673 -0.2159, -0.2953 -0.3578 -0.0, -0.4528 -0.3578 -0.0, -0.2953 -0.315 -0.0, -0.4528 -0.315 0.0, -0.4528 -0.3108 0.0591, -0.4528 -0.3578 0.0591, -0.2953 -0.3108 0.0591, -0.2953 -0.3578 0.0591, -0.2953 -0.5709 -0.2165, -0.2953 -0.5709 -0.2756, -0.2953 -0.4721 -0.2165, -0.2953 -0.4721 -0.2756, -0.2953 -0.4673 -0.2159, -0.2953 -0.4529 -0.2732, -0.2953 -0.4628 -0.2142, -0.2953 -0.4348 -0.2662, -0.2953 -0.4588 -0.2114, -0.2953 -0.4189 -0.2549, -0.2953 -0.4557 -0.2077, -0.2953 -0.4064 -0.2401, -0.2953 -0.4535 -0.2033, -0.2953 -0.3978 -0.2227, -0.2953 -0.4525 -0.1986, -0.2953 -0.3937 -0.2037, -0.2953 -0.4363 -0.0128, -0.2953 -0.3775 -0.018, -0.2953 -0.4322 0.0062, -0.2953 -0.3764 -0.0132, -0.2953 -0.4236 0.0236, -0.2953 -0.3743 -0.0089, -0.2953 -0.411 0.0384, -0.2953 -0.3711 -0.0052, -0.2953 -0.3952 0.0496, -0.2953 -0.3672 -0.0024, -0.2953 -0.3771 0.0567, -0.2953 -0.3627 -0.0006, -0.4528 -0.5709 -0.2165, -0.4528 -0.4721 -0.2165, -0.4528 -0.5709 -0.2756, -0.4528 -0.4721 -0.2756, -0.4528 -0.4529 -0.2732, -0.4528 -0.4348 -0.2662, -0.4528 -0.4189 -0.2549, -0.4528 -0.4064 -0.2401, -0.4528 -0.3978 -0.2227, -0.4528 -0.3937 -0.2037, -0.4528 -0.3775 -0.018, -0.4528 -0.3764 -0.0132, -0.4528 -0.3743 -0.0089, -0.4528 -0.3711 -0.0052, -0.4528 -0.3672 -0.0024, -0.4528 -0.3627 -0.0006, -0.4528 -0.3771 0.0567, -0.4528 -0.3952 0.0496, -0.4528 -0.411 0.0384, -0.4528 -0.4236 0.0236, -0.4528 -0.4322 0.0062, -0.4528 -0.4363 -0.0128, -0.4528 -0.4525 -0.1986, -0.4528 -0.4535 -0.2033, -0.4528 -0.4557 -0.2077, -0.4528 -0.4588 -0.2114, -0.4528 -0.4628 -0.2142, -0.4528 -0.4673 -0.2159, 0.2953 0.3578 -0.0, 0.4528 0.3578 -0.0, 0.2953 0.315 0.0, 0.4528 0.315 -0.0, 0.2953 0.3578 0.0591, 0.2953 0.3108 0.0591, 0.4528 0.3578 0.0591, 0.4528 0.3108 0.0591, 0.4528 0.3771 0.0567, 0.4528 0.3627 -0.0006, 0.4528 0.3952 0.0496, 0.4528 0.3672 -0.0024, 0.4528 0.411 0.0384, 0.4528 0.3711 -0.0052, 0.4528 0.4236 0.0236, 0.4528 0.3743 -0.0089, 0.4528 0.4322 0.0062, 0.4528 0.3764 -0.0132, 0.4528 0.4363 -0.0128, 0.4528 0.3775 -0.018, 0.4528 0.4525 -0.1986, 0.4528 0.3937 -0.2037, 0.4528 0.4535 -0.2033, 0.4528 0.3978 -0.2227, 0.4528 0.4557 -0.2077, 0.4528 0.4064 -0.2401, 0.4528 0.4588 -0.2114, 0.4528 0.4189 -0.2549, 0.4528 0.4628 -0.2142, 0.4528 0.4348 -0.2662, 0.4528 0.4673 -0.2159, 0.4528 0.4529 -0.2732, 0.4528 0.4721 -0.2165, 0.4528 0.4721 -0.2756, 0.4528 0.5709 -0.2165, 0.4528 0.5709 -0.2756, 0.2953 0.4721 -0.2165, 0.2953 0.5709 -0.2165, 0.2953 0.5709 -0.2756, 0.2953 0.4721 -0.2756, 0.2953 0.3937 -0.2037, 0.2953 0.3978 -0.2227, 0.2953 0.4064 -0.2401, 0.2953 0.4189 -0.2549, 0.2953 0.4348 -0.2662, 0.2953 0.4529 -0.2732, 0.2953 0.3775 -0.018, 0.2953 0.3627 -0.0006, 0.2953 0.3672 -0.0024, 0.2953 0.3711 -0.0052, 0.2953 0.3743 -0.0089, 0.2953 0.3764 -0.0132, 0.2953 0.4673 -0.2159, 0.2953 0.4628 -0.2142, 0.2953 0.4588 -0.2114, 0.2953 0.4557 -0.2077, 0.2953 0.4535 -0.2033, 0.2953 0.4525 -0.1986, 0.2953 0.4363 -0.0128, 0.2953 0.4322 0.0062, 0.2953 0.4236 0.0236, 0.2953 0.411 0.0384, 0.2953 0.3952 0.0496, 0.2953 0.3771 0.0567, -0.4528 0.3578 -0.0, -0.2953 0.3578 -0.0, -0.4528 0.315 -0.0, -0.2953 0.315 0.0, -0.4528 0.3578 0.0591, -0.4528 0.3108 0.0591, -0.2953 0.3578 0.0591, -0.2953 0.3108 0.0591, -0.2953 0.3771 0.0567, -0.2953 0.3627 -0.0006, -0.2953 0.3952 0.0496, -0.2953 0.3672 -0.0024, -0.2953 0.411 0.0384, -0.2953 0.3711 -0.0052, -0.2953 0.4236 0.0236, -0.2953 0.3743 -0.0089, -0.2953 0.4322 0.0062, -0.2953 0.3764 -0.0132, -0.2953 0.4363 -0.0128, -0.2953 0.3775 -0.018, -0.2953 0.4525 -0.1986, -0.2953 0.3937 -0.2037, -0.2953 0.4535 -0.2033, -0.2953 0.3978 -0.2227, -0.2953 0.4557 -0.2077, -0.2953 0.4064 -0.2401, -0.2953 0.4588 -0.2114, -0.2953 0.4189 -0.2549, -0.2953 0.4628 -0.2142, -0.2953 0.4348 -0.2662, -0.2953 0.4673 -0.2159, -0.2953 0.4529 -0.2732, -0.2953 0.4721 -0.2165, -0.2953 0.4721 -0.2756, -0.2953 0.5709 -0.2165, -0.2953 0.5709 -0.2756, -0.4528 0.4721 -0.2165, -0.4528 0.5709 -0.2165, -0.4528 0.5709 -0.2756, -0.4528 0.4721 -0.2756, -0.4528 0.3937 -0.2037, -0.4528 0.3978 -0.2227, -0.4528 0.4064 -0.2401, -0.4528 0.4189 -0.2549, -0.4528 0.4348 -0.2662, -0.4528 0.4529 -0.2732, -0.4528 0.3775 -0.018, -0.4528 0.3627 -0.0006, -0.4528 0.3672 -0.0024, -0.4528 0.3711 -0.0052, -0.4528 0.3743 -0.0089, -0.4528 0.3764 -0.0132, -0.4528 0.4673 -0.2159, -0.4528 0.4628 -0.2142, -0.4528 0.4588 -0.2114, -0.4528 0.4557 -0.2077, -0.4528 0.4535 -0.2033, -0.4528 0.4525 -0.1986, -0.4528 0.4363 -0.0128, -0.4528 0.4322 0.0062, -0.4528 0.4236 0.0236, -0.4528 0.411 0.0384, -0.4528 0.3952 0.0496, -0.4528 0.3771 0.0567, -0.4528 0.3771 0.0567
			]
		}
		coordIndex [
			0,1,2,-1,2,1,3,-1,4,5,6,-1,6,5,7,-1,8,9,10,-1,10,9,11,-1,10,11,12,-1,12,11,13,-1,12,13,14,-1,14,13,15,-1,14,15,16,-1,16,15,17,-1,16,17,18,-1,18,17,19,-1,18,19,20,-1,20,19,21,-1,20,21,22,-1,22,21,23,-1,22,23,24,-1,24,23,25,-1,24,25,26,-1,26,25,27,-1,26,27,28,-1,28,27,29,-1,28,29,30,-1,30,29,31,-1,30,31,32,-1,32,31,33,-1,32,33,34,-1,34,33,35,-1,34,35,7,-1,7,35,0,-1,7,0,6,-1,6,0,2,-1,4,3,5,-1,5,3,1,-1,5,1,36,-1,36,1,37,-1,36,37,38,-1,38,37,39,-1,38,39,40,-1,40,39,41,-1,40,41,42,-1,42,41,43,-1,42,43,44,-1,44,43,45,-1,44,45,46,-1,46,45,47,-1,46,47,48,-1,48,47,49,-1,48,49,50,-1,50,49,51,-1,50,51,52,-1,52,51,53,-1,52,53,54,-1,54,53,55,-1,54,55,56,-1,56,55,57,-1,56,57,58,-1,58,57,59,-1,58,59,60,-1,60,59,61,-1,60,61,62,-1,62,61,63,-1,8,10,62,-1,62,10,60,-1,9,8,63,-1,63,8,62,-1,11,9,61,-1,61,9,63,-1,11,61,59,-1,11,59,13,-1,13,59,57,-1,13,57,15,-1,15,57,55,-1,15,55,17,-1,17,55,53,-1,17,53,19,-1,19,53,51,-1,19,51,21,-1,21,51,49,-1,21,49,23,-1,25,23,47,-1,47,23,49,-1,25,47,27,-1,27,47,45,-1,27,45,29,-1,29,45,43,-1,29,43,31,-1,31,43,41,-1,31,41,33,-1,33,41,39,-1,33,39,35,-1,35,39,37,-1,35,37,0,-1,0,37,1,-1,7,5,36,-1,7,36,34,-1,34,36,38,-1,34,38,32,-1,32,38,40,-1,32,40,30,-1,30,40,42,-1,30,42,28,-1,28,42,44,-1,28,44,26,-1,26,44,46,-1,26,46,24,-1,22,24,48,-1,48,24,46,-1,22,48,20,-1,20,48,50,-1,20,50,18,-1,18,50,52,-1,18,52,16,-1,16,52,54,-1,16,54,14,-1,14,54,56,-1,14,56,12,-1,12,56,58,-1,12,58,10,-1,10,58,60,-1,64,65,66,-1,66,65,67,-1,68,69,70,-1,70,69,71,-1,72,73,74,-1,74,73,75,-1,74,75,76,-1,76,75,77,-1,76,77,78,-1,78,77,79,-1,78,79,80,-1,80,79,81,-1,80,81,82,-1,82,81,83,-1,82,83,84,-1,84,83,85,-1,84,85,86,-1,86,85,87,-1,86,87,88,-1,88,87,89,-1,88,89,90,-1,90,89,91,-1,90,91,92,-1,92,91,93,-1,92,93,94,-1,94,93,95,-1,94,95,96,-1,96,95,97,-1,96,97,98,-1,98,97,99,-1,98,99,71,-1,71,99,64,-1,71,64,70,-1,70,64,66,-1,72,74,100,-1,100,74,101,-1,73,72,102,-1,102,72,100,-1,75,73,103,-1,103,73,102,-1,75,103,104,-1,75,104,77,-1,77,104,105,-1,77,105,79,-1,79,105,106,-1,79,106,81,-1,81,106,107,-1,81,107,83,-1,83,107,108,-1,83,108,85,-1,85,108,109,-1,85,109,87,-1,89,87,110,-1,110,87,109,-1,89,110,91,-1,91,110,111,-1,91,111,93,-1,93,111,112,-1,93,112,95,-1,95,112,113,-1,95,113,97,-1,97,113,114,-1,97,114,99,-1,99,114,115,-1,99,115,64,-1,64,115,65,-1,68,67,69,-1,69,67,65,-1,69,65,116,-1,116,65,115,-1,116,115,117,-1,117,115,114,-1,117,114,118,-1,118,114,113,-1,118,113,119,-1,119,113,112,-1,119,112,120,-1,120,112,111,-1,120,111,121,-1,121,111,110,-1,121,110,122,-1,122,110,109,-1,122,109,123,-1,123,109,108,-1,123,108,124,-1,124,108,107,-1,124,107,125,-1,125,107,106,-1,125,106,126,-1,126,106,105,-1,126,105,127,-1,127,105,104,-1,127,104,101,-1,101,104,103,-1,101,103,100,-1,100,103,102,-1,71,69,116,-1,71,116,98,-1,98,116,117,-1,98,117,96,-1,96,117,118,-1,96,118,94,-1,94,118,119,-1,94,119,92,-1,92,119,120,-1,92,120,90,-1,90,120,121,-1,90,121,88,-1,86,88,122,-1,122,88,121,-1,86,122,84,-1,84,122,123,-1,84,123,82,-1,82,123,124,-1,82,124,80,-1,80,124,125,-1,80,125,78,-1,78,125,126,-1,78,126,76,-1,76,126,127,-1,76,127,74,-1,74,127,101,-1,128,129,130,-1,130,129,131,-1,132,133,134,-1,134,133,135,-1,136,137,138,-1,138,137,139,-1,138,139,140,-1,140,139,141,-1,140,141,142,-1,142,141,143,-1,142,143,144,-1,144,143,145,-1,144,145,146,-1,146,145,147,-1,146,147,148,-1,148,147,149,-1,148,149,150,-1,150,149,151,-1,150,151,152,-1,152,151,153,-1,152,153,154,-1,154,153,155,-1,154,155,156,-1,156,155,157,-1,156,157,158,-1,158,157,159,-1,158,159,160,-1,160,159,161,-1,160,161,162,-1,162,161,163,-1,162,163,135,-1,135,163,128,-1,135,128,134,-1,134,128,130,-1,136,138,164,-1,164,138,165,-1,137,136,166,-1,166,136,164,-1,139,137,167,-1,167,137,166,-1,139,167,168,-1,139,168,141,-1,141,168,169,-1,141,169,143,-1,143,169,170,-1,143,170,145,-1,145,170,171,-1,145,171,147,-1,147,171,172,-1,147,172,149,-1,149,172,173,-1,149,173,151,-1,153,151,174,-1,174,151,173,-1,153,174,155,-1,155,174,175,-1,155,175,157,-1,157,175,176,-1,157,176,159,-1,159,176,177,-1,159,177,161,-1,161,177,178,-1,161,178,163,-1,163,178,179,-1,163,179,128,-1,128,179,129,-1,132,131,133,-1,133,131,129,-1,133,129,180,-1,180,129,179,-1,180,179,181,-1,181,179,178,-1,181,178,182,-1,182,178,177,-1,182,177,183,-1,183,177,176,-1,183,176,184,-1,184,176,175,-1,184,175,185,-1,185,175,174,-1,185,174,186,-1,186,174,173,-1,186,173,187,-1,187,173,172,-1,187,172,188,-1,188,172,171,-1,188,171,189,-1,189,171,170,-1,189,170,190,-1,190,170,169,-1,190,169,191,-1,191,169,168,-1,191,168,165,-1,165,168,167,-1,165,167,164,-1,164,167,166,-1,135,133,180,-1,135,180,162,-1,162,180,181,-1,162,181,160,-1,160,181,182,-1,160,182,158,-1,158,182,183,-1,158,183,156,-1,156,183,184,-1,156,184,154,-1,154,184,185,-1,154,185,152,-1,150,152,186,-1,186,152,185,-1,150,186,148,-1,148,186,187,-1,148,187,146,-1,146,187,188,-1,146,188,144,-1,144,188,189,-1,144,189,142,-1,142,189,190,-1,142,190,140,-1,140,190,191,-1,140,191,138,-1,138,191,165,-1,192,193,194,-1,194,193,195,-1,196,197,198,-1,198,197,199,-1,199,195,198,-1,198,195,193,-1,198,193,200,-1,200,193,201,-1,200,201,202,-1,202,201,203,-1,202,203,204,-1,204,203,205,-1,204,205,206,-1,206,205,207,-1,206,207,208,-1,208,207,209,-1,208,209,210,-1,210,209,211,-1,210,211,212,-1,212,211,213,-1,212,213,214,-1,214,213,215,-1,214,215,216,-1,216,215,217,-1,216,217,218,-1,218,217,219,-1,218,219,220,-1,220,219,221,-1,220,221,222,-1,222,221,223,-1,222,223,224,-1,224,223,225,-1,224,225,226,-1,226,225,227,-1,224,226,228,-1,228,226,229,-1,226,227,229,-1,229,227,230,-1,227,225,230,-1,230,225,231,-1,213,232,233,-1,213,233,215,-1,215,233,234,-1,215,234,217,-1,217,234,235,-1,217,235,219,-1,219,235,236,-1,219,236,221,-1,221,236,237,-1,221,237,223,-1,223,237,231,-1,223,231,225,-1,213,211,232,-1,232,211,238,-1,193,192,201,-1,201,192,239,-1,201,239,203,-1,203,239,240,-1,203,240,205,-1,205,240,241,-1,205,241,207,-1,207,241,242,-1,207,242,209,-1,209,242,243,-1,209,243,211,-1,211,243,238,-1,229,230,228,-1,228,230,231,-1,228,231,244,-1,244,231,237,-1,244,237,245,-1,245,237,236,-1,245,236,246,-1,246,236,235,-1,246,235,247,-1,247,235,234,-1,247,234,248,-1,248,234,233,-1,248,233,249,-1,249,233,232,-1,249,232,250,-1,250,232,238,-1,250,238,251,-1,251,238,243,-1,251,243,252,-1,252,243,242,-1,252,242,253,-1,253,242,241,-1,253,241,254,-1,254,241,240,-1,254,240,255,-1,255,240,239,-1,255,239,196,-1,196,239,192,-1,196,192,197,-1,197,192,194,-1,210,250,251,-1,210,251,208,-1,208,251,252,-1,208,252,206,-1,206,252,253,-1,206,253,204,-1,204,253,254,-1,204,254,202,-1,202,254,255,-1,202,255,200,-1,200,255,196,-1,200,196,198,-1,210,212,250,-1,250,212,249,-1,224,228,222,-1,222,228,244,-1,222,244,220,-1,220,244,245,-1,220,245,218,-1,218,245,246,-1,218,246,216,-1,216,246,247,-1,216,247,214,-1,214,247,248,-1,214,248,212,-1,212,248,249,-1,256,257,258,-1,258,257,259,-1,260,261,262,-1,262,261,263,-1,263,259,262,-1,262,259,257,-1,262,257,264,-1,264,257,265,-1,264,265,266,-1,266,265,267,-1,266,267,268,-1,268,267,269,-1,268,269,270,-1,270,269,271,-1,270,271,272,-1,272,271,273,-1,272,273,274,-1,274,273,275,-1,274,275,276,-1,276,275,277,-1,276,277,278,-1,278,277,279,-1,278,279,280,-1,280,279,281,-1,280,281,282,-1,282,281,283,-1,282,283,284,-1,284,283,285,-1,284,285,286,-1,286,285,287,-1,286,287,288,-1,288,287,289,-1,288,289,290,-1,290,289,291,-1,288,290,292,-1,292,290,293,-1,290,291,293,-1,293,291,294,-1,291,289,294,-1,294,289,295,-1,277,296,297,-1,277,297,279,-1,279,297,298,-1,279,298,281,-1,281,298,299,-1,281,299,283,-1,283,299,300,-1,283,300,285,-1,285,300,301,-1,285,301,287,-1,287,301,295,-1,287,295,289,-1,277,275,296,-1,296,275,302,-1,257,256,265,-1,265,256,303,-1,265,303,267,-1,267,303,304,-1,267,304,269,-1,269,304,305,-1,269,305,271,-1,271,305,306,-1,271,306,273,-1,273,306,307,-1,273,307,275,-1,275,307,302,-1,293,294,292,-1,292,294,295,-1,292,295,308,-1,308,295,301,-1,308,301,309,-1,309,301,300,-1,309,300,310,-1,310,300,299,-1,310,299,311,-1,311,299,298,-1,311,298,312,-1,312,298,297,-1,312,297,313,-1,313,297,296,-1,313,296,314,-1,314,296,302,-1,314,302,315,-1,315,302,307,-1,315,307,316,-1,316,307,306,-1,316,306,317,-1,317,306,305,-1,317,305,318,-1,318,305,304,-1,318,304,319,-1,319,304,303,-1,319,303,260,-1,260,303,256,-1,260,256,261,-1,261,256,258,-1,274,314,315,-1,274,315,272,-1,272,315,316,-1,272,316,270,-1,270,316,317,-1,270,317,268,-1,268,317,318,-1,268,318,266,-1,266,318,319,-1,266,319,264,-1,264,319,260,-1,264,260,262,-1,274,276,314,-1,314,276,313,-1,288,292,286,-1,286,292,308,-1,286,308,284,-1,284,308,309,-1,284,309,282,-1,282,309,310,-1,282,310,280,-1,280,310,311,-1,280,311,278,-1,278,311,312,-1,278,312,276,-1,276,312,313,-1,
		]
	}
}
Shape{
	appearance Appearance {
		material  Material 	{ 
			diffuseColor 0.0 0.0 0.0 
			specularColor 0.0 0.0 0.0
			ambientIntensity 0.2
			transparency 0.0
			shininess 0.5
		}
	}
	geometry IndexedFaceSet {
		ccw TRUE 
		solid FALSE
		coord DEF co Coordinate {
			point [
				-0.3185 -0.1743 0.1571, -0.3185 -0.1743 0.1575, -0.3206 -0.1579 0.1571, -0.3206 -0.1579 0.1575, -0.327 -0.1425 0.1571, -0.327 -0.1425 0.1575, -0.3371 -0.1294 0.1571, -0.3371 -0.1294 0.1575, -0.3502 -0.1193 0.1571, -0.3502 -0.1193 0.1575, -0.3655 -0.113 0.1571, -0.3655 -0.113 0.1575, -0.382 -0.1108 0.1571, -0.382 -0.1108 0.1575, -0.3984 -0.113 0.1571, -0.3984 -0.113 0.1575, -0.4137 -0.1193 0.1571, -0.4137 -0.1193 0.1575, -0.4269 -0.1294 0.1571, -0.4269 -0.1294 0.1575, -0.4369 -0.1425 0.1571, -0.4369 -0.1425 0.1575, -0.4433 -0.1579 0.1571, -0.4433 -0.1579 0.1575, -0.4454 -0.1743 0.1571, -0.4454 -0.1743 0.1575, -0.4433 -0.1907 0.1571, -0.4433 -0.1907 0.1575, -0.4369 -0.206 0.1571, -0.4369 -0.206 0.1575, -0.4269 -0.2192 0.1571, -0.4269 -0.2192 0.1575, -0.4137 -0.2293 0.1571, -0.4137 -0.2293 0.1575, -0.3984 -0.2356 0.1571, -0.3984 -0.2356 0.1575, -0.382 -0.2378 0.1571, -0.382 -0.2378 0.1575, -0.3655 -0.2356 0.1571, -0.3655 -0.2356 0.1575, -0.3502 -0.2293 0.1571, -0.3502 -0.2293 0.1575, -0.3371 -0.2192 0.1571, -0.3371 -0.2192 0.1575, -0.327 -0.206 0.1571, -0.327 -0.206 0.1575, -0.3206 -0.1907 0.1571, -0.3206 -0.1907 0.1575, -0.382 -0.1743 0.1571, -0.0774 0.0207 -0.2555, -0.0928 -0.0187 -0.2555, -0.0774 0.0207 -0.2559, -0.0928 -0.0187 -0.2559, -0.087 -0.0187 -0.2555, -0.087 -0.0187 -0.2559, -0.083 -0.0076 -0.2555, -0.083 -0.0076 -0.2559, -0.0668 -0.0076 -0.2555, -0.0668 -0.0076 -0.2559, -0.063 -0.0187 -0.2555, -0.063 -0.0187 -0.2559, -0.0573 -0.0187 -0.2555, -0.0573 -0.0187 -0.2559, -0.0721 0.0207 -0.2555, -0.0721 0.0207 -0.2559, -0.0681 -0.0033 -0.2555, -0.0813 -0.0033 -0.2555, -0.074 0.0131 -0.2555, -0.0744 0.0145 -0.2555, -0.0746 0.0159 -0.2555, -0.0747 0.0159 -0.2555, -0.075 0.0145 -0.2555, -0.0753 0.0131 -0.2555, -0.0681 -0.0033 -0.2559, -0.0813 -0.0033 -0.2559, -0.074 0.0131 -0.2559, -0.0744 0.0145 -0.2559, -0.0746 0.0159 -0.2559, -0.0747 0.0159 -0.2559, -0.075 0.0145 -0.2559, -0.0753 0.0131 -0.2559, -0.0334 -0.0187 -0.2555, -0.0227 -0.0187 -0.2555, -0.0334 -0.0187 -0.2559, -0.0227 -0.0187 -0.2559, -0.0227 0.0207 -0.2555, -0.0227 0.0207 -0.2559, -0.0338 0.0207 -0.2555, -0.0338 0.0207 -0.2559, -0.0544 0.0015 -0.2555, -0.0544 0.0015 -0.2559, -0.0541 0.0052 -0.2559, -0.0541 0.0052 -0.2555, -0.053 0.0091 -0.2559, -0.053 0.0091 -0.2555, -0.0512 0.0125 -0.2559, -0.0512 0.0125 -0.2555, -0.0484 0.0155 -0.2559, -0.0484 0.0155 -0.2555, -0.0484 0.0156 -0.2559, -0.0484 0.0156 -0.2555, -0.0441 0.0185 -0.2559, -0.0441 0.0185 -0.2555, -0.0395 0.0201 -0.2559, -0.0395 0.0201 -0.2555, -0.0383 -0.0183 -0.2559, -0.0383 -0.0183 -0.2555, -0.0428 -0.0169 -0.2559, -0.0428 -0.0169 -0.2555, -0.0469 -0.0145 -0.2559, -0.0469 -0.0145 -0.2555, -0.0502 -0.0114 -0.2559, -0.0502 -0.0114 -0.2555, -0.0524 -0.0079 -0.2559, -0.0524 -0.0079 -0.2555, -0.0538 -0.0038 -0.2559, -0.0538 -0.0038 -0.2555, -0.0465 0.0108 -0.2555, -0.0446 0.0129 -0.2555, -0.0417 0.0147 -0.2555, -0.0384 0.0159 -0.2555, -0.0338 0.0164 -0.2555, -0.028 0.0164 -0.2555, -0.028 -0.0144 -0.2555, -0.0336 -0.0144 -0.2555, -0.0377 -0.014 -0.2555, -0.041 -0.013 -0.2555, -0.0437 -0.0114 -0.2555, -0.0459 -0.0092 -0.2555, -0.0476 -0.0065 -0.2555, -0.0487 -0.0028 -0.2555, -0.0491 0.0014 -0.2555, -0.0488 0.0053 -0.2555, -0.0478 0.0084 -0.2555, -0.0338 0.0164 -0.2559, -0.028 0.0164 -0.2559, -0.0384 0.0159 -0.2559, -0.0417 0.0147 -0.2559, -0.0446 0.0129 -0.2559, -0.0465 0.0108 -0.2559, -0.0478 0.0084 -0.2559, -0.0488 0.0053 -0.2559, -0.0491 0.0014 -0.2559, -0.0487 -0.0028 -0.2559, -0.0476 -0.0065 -0.2559, -0.0459 -0.0092 -0.2559, -0.0437 -0.0114 -0.2559, -0.041 -0.013 -0.2559, -0.0377 -0.014 -0.2559, -0.0336 -0.0144 -0.2559, -0.028 -0.0144 -0.2559, -0.015 -0.0144 -0.2555, -0.015 -0.0187 -0.2555, -0.015 -0.0144 -0.2559, -0.015 -0.0187 -0.2559, 0.0061 -0.0187 -0.2555, 0.0061 -0.0187 -0.2559, 0.0061 0.0207 -0.2555, 0.0061 0.0207 -0.2559, -0.014 0.0207 -0.2555, -0.014 0.0207 -0.2559, -0.014 0.0164 -0.2555, -0.014 0.0164 -0.2559, 0.0008 0.0164 -0.2555, 0.0008 0.0164 -0.2559, 0.0008 0.0034 -0.2555, 0.0008 0.0034 -0.2559, -0.0131 0.0034 -0.2555, -0.0131 0.0034 -0.2559, -0.0131 -0.0009 -0.2555, -0.0131 -0.0009 -0.2559, 0.0008 -0.0009 -0.2555, 0.0008 -0.0009 -0.2559, 0.0008 -0.0144 -0.2555, 0.0008 -0.0144 -0.2559, 0.0138 -0.0123 -0.2555, 0.0138 -0.0167 -0.2555, 0.0138 -0.0123 -0.2559, 0.0138 -0.0167 -0.2559, 0.018 -0.0184 -0.2555, 0.0246 -0.0192 -0.2555, 0.0246 -0.0192 -0.2559, 0.0236 -0.0192 -0.2559, 0.0236 -0.0192 -0.2555, 0.022 -0.0189 -0.2559, 0.018 -0.0184 -0.2559, 0.0269 -0.0189 -0.2559, 0.0295 -0.0187 -0.2555, 0.0295 -0.0187 -0.2559, 0.0333 -0.0174 -0.2555, 0.0333 -0.0174 -0.2559, 0.0365 -0.0153 -0.2555, 0.0365 -0.0153 -0.2559, 0.0394 -0.0122 -0.2555, 0.0394 -0.0122 -0.2559, 0.0415 -0.0085 -0.2555, 0.0415 -0.0085 -0.2559, 0.0427 -0.0043 -0.2555, 0.0427 -0.0043 -0.2559, 0.0431 0.0002 -0.2555, 0.0431 0.0002 -0.2559, 0.0231 0.0212 -0.2555, 0.0231 0.0212 -0.2559, 0.027 0.0208 -0.2559, 0.027 0.0208 -0.2555, 0.0314 0.0196 -0.2559, 0.0314 0.0196 -0.2555, 0.0351 0.0174 -0.2559, 0.0351 0.0174 -0.2555, 0.0387 0.014 -0.2559, 0.0387 0.014 -0.2555, 0.041 0.0103 -0.2559, 0.041 0.0103 -0.2555, 0.0425 0.0058 -0.2559, 0.0425 0.0058 -0.2555, 0.0138 0.0196 -0.2555, 0.0138 0.0196 -0.2559, 0.0184 0.0208 -0.2559, 0.0184 0.0208 -0.2555, 0.0138 0.0143 -0.2555, 0.0138 0.0143 -0.2559, 0.023 0.0168 -0.2555, 0.023 0.0168 -0.2559, 0.0182 0.0162 -0.2559, 0.0182 0.0162 -0.2555, 0.0378 0.0006 -0.2555, 0.0378 0.0006 -0.2559, 0.0376 0.0036 -0.2559, 0.0376 0.0036 -0.2555, 0.0366 0.0078 -0.2559, 0.0366 0.0078 -0.2555, 0.0349 0.0109 -0.2559, 0.0349 0.0109 -0.2555, 0.0326 0.0135 -0.2559, 0.0326 0.0135 -0.2555, 0.0298 0.0153 -0.2559, 0.0298 0.0153 -0.2555, 0.0269 0.0164 -0.2559, 0.0269 0.0164 -0.2555, 0.0239 -0.0149 -0.2555, 0.0239 -0.0149 -0.2559, 0.0276 -0.0144 -0.2559, 0.0276 -0.0144 -0.2555, 0.0304 -0.0134 -0.2559, 0.0304 -0.0134 -0.2555, 0.0329 -0.0118 -0.2559, 0.0329 -0.0118 -0.2555, 0.0347 -0.0098 -0.2559, 0.0347 -0.0098 -0.2555, 0.0363 -0.0071 -0.2559, 0.0363 -0.0071 -0.2555, 0.0374 -0.0037 -0.2559, 0.0374 -0.0037 -0.2555, 0.0145 -0.0127 -0.2559, 0.0145 -0.0127 -0.2555, 0.0187 -0.0143 -0.2559, 0.0187 -0.0143 -0.2555, 0.0464 -0.0144 -0.2555, 0.0464 -0.0187 -0.2555, 0.0464 -0.0144 -0.2559, 0.0464 -0.0187 -0.2559, 0.0666 -0.0187 -0.2555, 0.0666 -0.0187 -0.2559, 0.0666 0.0207 -0.2555, 0.0666 0.0207 -0.2559, 0.0613 0.0207 -0.2555, 0.0613 0.0207 -0.2559, 0.0613 -0.0144 -0.2555, 0.0613 -0.0144 -0.2559, 0.0613 -0.0144 -0.2559
			]
		}
		coordIndex [
			0,1,2,-1,2,1,3,-1,2,3,4,-1,4,3,5,-1,4,5,6,-1,6,5,7,-1,6,7,8,-1,8,7,9,-1,8,9,10,-1,10,9,11,-1,10,11,12,-1,12,11,13,-1,12,13,14,-1,14,13,15,-1,14,15,16,-1,16,15,17,-1,16,17,18,-1,18,17,19,-1,18,19,20,-1,20,19,21,-1,20,21,22,-1,22,21,23,-1,22,23,24,-1,24,23,25,-1,24,25,26,-1,26,25,27,-1,26,27,28,-1,28,27,29,-1,28,29,30,-1,30,29,31,-1,30,31,32,-1,32,31,33,-1,32,33,34,-1,34,33,35,-1,34,35,36,-1,36,35,37,-1,36,37,38,-1,38,37,39,-1,38,39,40,-1,40,39,41,-1,40,41,42,-1,42,41,43,-1,42,43,44,-1,44,43,45,-1,44,45,46,-1,46,45,47,-1,46,47,0,-1,0,47,1,-1,44,46,48,-1,48,46,0,-1,48,0,2,-1,38,40,48,-1,48,40,42,-1,48,42,44,-1,32,34,48,-1,48,34,36,-1,48,36,38,-1,26,28,48,-1,48,28,30,-1,48,30,32,-1,20,22,48,-1,48,22,24,-1,48,24,26,-1,14,16,48,-1,48,16,18,-1,48,18,20,-1,8,10,48,-1,48,10,12,-1,48,12,14,-1,2,4,48,-1,48,4,6,-1,48,6,8,-1,49,50,51,-1,51,50,52,-1,50,53,52,-1,52,53,54,-1,53,55,54,-1,54,55,56,-1,55,57,56,-1,56,57,58,-1,57,59,58,-1,58,59,60,-1,59,61,60,-1,60,61,62,-1,61,63,62,-1,62,63,64,-1,63,49,64,-1,64,49,51,-1,65,57,66,-1,66,57,55,-1,67,63,65,-1,65,63,61,-1,65,61,57,-1,57,61,59,-1,67,68,63,-1,63,68,69,-1,63,69,49,-1,49,69,70,-1,49,70,71,-1,71,72,49,-1,49,72,66,-1,49,66,50,-1,50,66,55,-1,50,55,53,-1,65,66,73,-1,73,66,74,-1,67,65,75,-1,75,65,73,-1,67,75,76,-1,67,76,68,-1,68,76,77,-1,68,77,69,-1,70,69,78,-1,78,69,77,-1,70,78,79,-1,70,79,71,-1,71,79,80,-1,71,80,72,-1,66,72,74,-1,74,72,80,-1,81,82,83,-1,83,82,84,-1,82,85,84,-1,84,85,86,-1,85,87,86,-1,86,87,88,-1,89,90,91,-1,89,91,92,-1,92,91,93,-1,92,93,94,-1,94,93,95,-1,94,95,96,-1,96,95,97,-1,96,97,98,-1,98,97,99,-1,98,99,100,-1,100,99,101,-1,100,101,102,-1,102,101,103,-1,102,103,104,-1,104,103,88,-1,104,88,87,-1,81,83,105,-1,81,105,106,-1,106,105,107,-1,106,107,108,-1,108,107,109,-1,108,109,110,-1,110,109,111,-1,110,111,112,-1,112,111,113,-1,112,113,114,-1,114,113,115,-1,114,115,116,-1,116,115,90,-1,116,90,89,-1,94,96,117,-1,117,96,98,-1,117,98,118,-1,118,98,100,-1,118,100,119,-1,119,100,102,-1,119,102,120,-1,120,102,104,-1,120,104,121,-1,121,104,87,-1,121,87,122,-1,122,87,85,-1,122,85,123,-1,123,85,82,-1,123,82,124,-1,124,82,81,-1,124,81,125,-1,125,81,106,-1,125,106,126,-1,126,106,108,-1,126,108,127,-1,127,108,110,-1,127,110,128,-1,128,110,112,-1,128,112,129,-1,129,112,114,-1,129,114,130,-1,130,114,116,-1,130,116,131,-1,131,116,89,-1,131,89,132,-1,132,89,92,-1,132,92,133,-1,133,92,94,-1,133,94,117,-1,121,122,134,-1,134,122,135,-1,121,134,136,-1,121,136,120,-1,120,136,137,-1,120,137,119,-1,119,137,138,-1,119,138,118,-1,118,138,139,-1,118,139,117,-1,117,139,140,-1,117,140,133,-1,133,140,141,-1,133,141,132,-1,132,141,142,-1,132,142,131,-1,131,142,143,-1,131,143,130,-1,130,143,144,-1,130,144,129,-1,129,144,145,-1,129,145,128,-1,128,145,146,-1,128,146,127,-1,127,146,147,-1,127,147,126,-1,126,147,148,-1,126,148,125,-1,125,148,149,-1,125,149,124,-1,123,124,150,-1,150,124,149,-1,122,123,135,-1,135,123,150,-1,151,152,153,-1,153,152,154,-1,152,155,154,-1,154,155,156,-1,155,157,156,-1,156,157,158,-1,157,159,158,-1,158,159,160,-1,159,161,160,-1,160,161,162,-1,161,163,162,-1,162,163,164,-1,163,165,164,-1,164,165,166,-1,165,167,166,-1,166,167,168,-1,167,169,168,-1,168,169,170,-1,169,171,170,-1,170,171,172,-1,171,173,172,-1,172,173,174,-1,173,151,174,-1,174,151,153,-1,155,152,151,-1,151,173,155,-1,155,173,171,-1,155,171,157,-1,161,159,163,-1,163,159,157,-1,163,157,165,-1,165,157,171,-1,165,171,167,-1,167,171,169,-1,175,176,177,-1,177,176,178,-1,178,176,179,-1,180,181,182,-1,180,182,183,-1,183,182,184,-1,183,184,179,-1,179,184,185,-1,179,185,178,-1,181,180,186,-1,186,180,187,-1,186,187,188,-1,188,187,189,-1,188,189,190,-1,190,189,191,-1,190,191,192,-1,192,191,193,-1,192,193,194,-1,194,193,195,-1,194,195,196,-1,196,195,197,-1,196,197,198,-1,198,197,199,-1,198,199,200,-1,201,202,203,-1,201,203,204,-1,204,203,205,-1,204,205,206,-1,206,205,207,-1,206,207,208,-1,208,207,209,-1,208,209,210,-1,210,209,211,-1,210,211,212,-1,212,211,213,-1,212,213,214,-1,214,213,200,-1,214,200,199,-1,215,216,217,-1,215,217,218,-1,218,217,202,-1,218,202,201,-1,215,219,216,-1,216,219,220,-1,221,222,223,-1,221,223,224,-1,224,223,220,-1,224,220,219,-1,225,226,227,-1,225,227,228,-1,228,227,229,-1,228,229,230,-1,230,229,231,-1,230,231,232,-1,232,231,233,-1,232,233,234,-1,234,233,235,-1,234,235,236,-1,236,235,237,-1,236,237,238,-1,238,237,222,-1,238,222,221,-1,239,240,241,-1,239,241,242,-1,242,241,243,-1,242,243,244,-1,244,243,245,-1,244,245,246,-1,246,245,247,-1,246,247,248,-1,248,247,249,-1,248,249,250,-1,250,249,251,-1,250,251,252,-1,252,251,226,-1,252,226,225,-1,175,177,253,-1,175,253,254,-1,254,253,255,-1,254,255,256,-1,256,255,240,-1,256,240,239,-1,242,180,239,-1,239,180,183,-1,239,183,256,-1,256,183,179,-1,256,179,254,-1,254,179,176,-1,254,176,175,-1,219,215,224,-1,224,215,218,-1,224,218,221,-1,221,218,201,-1,221,201,238,-1,238,201,204,-1,238,204,236,-1,236,204,206,-1,236,206,234,-1,234,206,208,-1,234,208,232,-1,232,208,210,-1,232,210,230,-1,230,210,212,-1,230,212,228,-1,228,212,214,-1,228,214,225,-1,225,214,199,-1,225,199,252,-1,252,199,197,-1,252,197,250,-1,250,197,195,-1,250,195,248,-1,248,195,193,-1,248,193,246,-1,246,193,191,-1,246,191,244,-1,244,191,189,-1,244,189,242,-1,242,189,187,-1,242,187,180,-1,257,258,259,-1,259,258,260,-1,258,261,260,-1,260,261,262,-1,261,263,262,-1,262,263,264,-1,263,265,264,-1,264,265,266,-1,265,267,266,-1,266,267,268,-1,267,257,268,-1,268,257,259,-1,265,263,267,-1,267,263,261,-1,267,261,257,-1,257,261,258,-1,
		]
	}
}
Shape{
	appearance Appearance {
		material  Material 	{ 
			diffuseColor 0.25098039215686274 0.25098039215686274 0.25098039215686274 
			specularColor 0.12549019607843137 0.12549019607843137 0.12549019607843137
			ambientIntensity 0.2
			transparency 0.0
			shininess 0.5
		}
	}
	geometry IndexedFaceSet {
		ccw TRUE 
		solid FALSE
		coord DEF co Coordinate {
			point [
				-0.0681 -0.0033 -0.2559, -0.0813 -0.0033 -0.2559, -0.074 0.0131 -0.2559, -0.0753 0.0131 -0.2559, -0.0744 0.0145 -0.2559, -0.075 0.0145 -0.2559, -0.0746 0.0159 -0.2559, -0.0747 0.0159 -0.2559, -0.028 0.0164 -0.2559, -0.028 -0.0144 -0.2559, -0.0338 0.0164 -0.2559, -0.0336 -0.0144 -0.2559, -0.0377 -0.014 -0.2559, -0.0491 0.0014 -0.2559, -0.0488 0.0053 -0.2559, -0.0478 0.0084 -0.2559, -0.0384 0.0159 -0.2559, -0.041 -0.013 -0.2559, -0.0437 -0.0114 -0.2559, -0.0459 -0.0092 -0.2559, -0.0476 -0.0065 -0.2559, -0.0487 -0.0028 -0.2559, -0.0465 0.0108 -0.2559, -0.0446 0.0129 -0.2559, -0.0417 0.0147 -0.2559, -0.5543 -0.2787 -0.2376, -0.5536 -0.2838 -0.2379, -0.5709 -0.2953 -0.0, -0.5702 -0.3004 -0.0, -0.5694 -0.3028 -0.0, -0.5536 -0.2838 -0.2379, -0.5682 -0.3051 -0.0, -0.5516 -0.2885 -0.2381, -0.5668 -0.3073 -0.0, -0.5516 -0.2885 -0.2381, -0.5651 -0.3092 -0.0, -0.5485 -0.2926 -0.2382, -0.5632 -0.3109 -0.0, -0.5444 -0.2957 -0.2381, -0.5611 -0.3123 -0.0, -0.5444 -0.2957 -0.2381, -0.5588 -0.3135 -0.0, -0.5397 -0.2977 -0.2379, -0.5563 -0.3143 -0.0, -0.5397 -0.2977 -0.2379, -0.5346 -0.2983 -0.2376, -0.5512 -0.315 0.0, -0.5415 -0.3052 0.1392, -0.5466 -0.3045 0.1395, -0.5466 -0.3045 0.1395, -0.5513 -0.3026 0.1397, -0.5513 -0.3026 0.1397, -0.5553 -0.2994 0.1397, -0.5585 -0.2954 0.1397, -0.5585 -0.2954 0.1397, -0.5604 -0.2907 0.1395, -0.5604 -0.2907 0.1395, -0.5611 -0.2856 0.1392, -0.5395 -0.2787 -0.2553, -0.5346 -0.2787 -0.2559, -0.5393 -0.28 -0.2553, -0.5346 -0.2882 -0.2535, -0.5346 -0.2882 -0.2535, -0.5371 -0.2879 -0.2535, -0.5346 -0.2921 -0.2506, -0.5346 -0.2922 -0.2506, -0.5381 -0.2917 -0.2506, -0.5389 -0.2948 -0.2467, -0.5395 -0.2968 -0.2423, -0.544 -0.2949 -0.2423, -0.5533 -0.2787 -0.2423, -0.5527 -0.2836 -0.2423, -0.5346 -0.2974 -0.2423, -0.5346 -0.2974 -0.2424, -0.5346 -0.2953 -0.2467, -0.5346 -0.2953 -0.2468, -0.5533 -0.2787 -0.2424, -0.5507 -0.283 -0.2467, -0.5429 -0.2931 -0.2467, -0.5479 -0.292 -0.2423, -0.5512 -0.2787 -0.2467, -0.5512 -0.2787 -0.2468, -0.5476 -0.2822 -0.2506, -0.5414 -0.2904 -0.2506, -0.5464 -0.2905 -0.2467, -0.5481 -0.2787 -0.2506, -0.548 -0.2787 -0.2506, -0.5438 -0.2812 -0.2535, -0.5442 -0.2882 -0.2506, -0.5394 -0.2869 -0.2535, -0.5359 -0.2834 -0.2553, -0.5508 -0.2881 -0.2423, -0.549 -0.287 -0.2467, -0.5463 -0.2855 -0.2506, -0.5428 -0.2835 -0.2535, -0.5389 -0.2812 -0.2553, -0.5346 -0.2836 -0.2553, -0.5346 -0.2836 -0.2553, -0.5413 -0.2854 -0.2535, -0.5371 -0.283 -0.2553, -0.5381 -0.2822 -0.2553, -0.5441 -0.2787 -0.2535, -0.5441 -0.2787 -0.2535, -0.5395 -0.2787 -0.2553, -0.5415 -0.3022 0.1484, -0.5415 -0.2991 0.1521, -0.545 -0.2986 0.1521, -0.544 -0.2948 0.155, -0.5428 -0.2903 0.1569, -0.5439 -0.2898 0.1569, -0.5415 -0.2856 0.1575, -0.5457 -0.288 0.1569, -0.545 -0.2891 0.1569, -0.5462 -0.2869 0.1569, -0.5415 -0.2905 0.1569, -0.5463 -0.3037 0.1438, -0.5509 -0.3018 0.1438, -0.5547 -0.2988 0.1438, -0.5577 -0.295 0.1438, -0.5596 -0.2904 0.1438, -0.5602 -0.2856 0.1438, -0.5464 -0.2856 0.1569, -0.5415 -0.299 0.1522, -0.5415 -0.2951 0.155, -0.5415 -0.295 0.1551, -0.5415 -0.2905 0.1569, -0.5462 -0.2938 0.155, -0.5482 -0.2923 0.155, -0.5497 -0.2903 0.155, -0.5507 -0.288 0.155, -0.5464 -0.2856 0.1569, -0.5509 -0.2856 0.1551, -0.551 -0.2856 0.155, -0.5549 -0.2856 0.1522, -0.5482 -0.2973 0.1521, -0.551 -0.2951 0.1521, -0.5532 -0.2923 0.1521, -0.5545 -0.2891 0.1521, -0.5415 -0.3043 0.144, -0.5415 -0.3022 0.1483, -0.5458 -0.3017 0.1483, -0.5498 -0.3 0.1483, -0.5533 -0.2974 0.1483, -0.5559 -0.2939 0.1483, -0.5576 -0.2899 0.1483, -0.5415 -0.3043 0.1438, -0.555 -0.2856 0.1521, -0.5581 -0.2856 0.1484, -0.5581 -0.2856 0.1483, -0.5602 -0.2856 0.144, -0.5346 0.2983 -0.2376, -0.5397 0.2977 -0.2379, -0.5512 0.315 -0.0, -0.5563 0.3143 0.0, -0.5588 0.3135 0.0, -0.5397 0.2977 -0.2379, -0.5611 0.3123 0.0, -0.5444 0.2957 -0.2381, -0.5632 0.3109 0.0, -0.5444 0.2957 -0.2381, -0.5651 0.3092 0.0, -0.5485 0.2926 -0.2382, -0.5668 0.3073 0.0, -0.5516 0.2885 -0.2381, -0.5682 0.3051 0.0, -0.5516 0.2885 -0.2381, -0.5694 0.3028 0.0, -0.5536 0.2838 -0.2379, -0.5702 0.3004 0.0, -0.5536 0.2838 -0.2379, -0.5543 0.2787 -0.2376, -0.5709 0.2953 -0.0, -0.5346 -0.0189 -0.2559, -0.5533 0.2787 -0.2423, -0.5533 0.2787 -0.2424, -0.5512 0.2787 -0.2467, -0.5512 0.2787 -0.2468, -0.5481 0.2787 -0.2506, -0.548 0.2787 -0.2506, -0.5441 0.2787 -0.2535, -0.5441 0.2787 -0.2535, -0.5395 0.2787 -0.2553, -0.5395 0.2787 -0.2553, -0.5346 0.2787 -0.2559, -0.0188 -0.2787 -0.2559, 0.5346 -0.2787 -0.2559, 0.5346 -0.2836 -0.2553, 0.5346 -0.2836 -0.2553, 0.5346 -0.2882 -0.2535, 0.5346 -0.2882 -0.2535, 0.5346 -0.2921 -0.2506, 0.5346 -0.2922 -0.2506, 0.5346 -0.2953 -0.2468, 0.5346 -0.2953 -0.2467, 0.5346 -0.2974 -0.2424, 0.5346 -0.2974 -0.2423, 0.5346 -0.2983 -0.2376, 0.5397 -0.2977 -0.2379, 0.5512 -0.315 -0.0, 0.5563 -0.3143 0.0, 0.5588 -0.3135 0.0, 0.5397 -0.2977 -0.2379, 0.5611 -0.3123 0.0, 0.5444 -0.2957 -0.2381, 0.5632 -0.3109 0.0, 0.5444 -0.2957 -0.2381, 0.5651 -0.3092 0.0, 0.5485 -0.2926 -0.2382, 0.5668 -0.3073 0.0, 0.5516 -0.2885 -0.2381, 0.5682 -0.3051 0.0, 0.5516 -0.2885 -0.2381, 0.5694 -0.3028 0.0, 0.5536 -0.2838 -0.2379, 0.5702 -0.3004 0.0, 0.5536 -0.2838 -0.2379, 0.5543 -0.2787 -0.2376, 0.5709 -0.2953 -0.0, 0.5611 -0.2856 0.1392, 0.5604 -0.2907 0.1395, 0.5604 -0.2907 0.1395, 0.5585 -0.2954 0.1397, 0.5585 -0.2954 0.1397, 0.5553 -0.2994 0.1397, 0.5513 -0.3026 0.1397, 0.5513 -0.3026 0.1397, 0.5466 -0.3045 0.1395, 0.5466 -0.3045 0.1395, 0.5415 -0.3052 0.1392, 0.5415 -0.3043 0.1438, 0.5415 -0.3043 0.144, 0.5415 -0.3022 0.1483, 0.5415 -0.3022 0.1484, 0.5415 -0.2991 0.1521, 0.5415 -0.299 0.1522, 0.5415 -0.2951 0.155, 0.5415 -0.295 0.1551, 0.5415 -0.2905 0.1569, 0.5415 -0.2905 0.1569, 0.5415 -0.2856 0.1575, -0.5611 0.2856 0.1392, -0.5602 0.2856 0.1438, -0.5602 0.2856 0.144, -0.5581 0.2856 0.1483, -0.5581 0.2856 0.1484, -0.555 0.2856 0.1521, -0.5549 0.2856 0.1522, -0.551 0.2856 0.155, -0.5509 0.2856 0.1551, -0.5464 0.2856 0.1569, -0.5464 0.2856 0.1569, -0.5415 0.2856 0.1575, -0.5604 0.2907 0.1395, -0.5604 0.2907 0.1395, -0.5585 0.2954 0.1397, -0.5585 0.2954 0.1397, -0.5553 0.2994 0.1397, -0.5513 0.3026 0.1397, -0.5513 0.3026 0.1397, -0.5466 0.3045 0.1395, -0.5466 0.3045 0.1395, -0.5415 0.3052 0.1392, -0.5346 0.2836 -0.2553, -0.5359 0.2834 -0.2553, -0.5438 0.2812 -0.2535, -0.5476 0.2822 -0.2506, -0.5507 0.283 -0.2467, -0.5527 0.2836 -0.2423, -0.5508 0.2881 -0.2423, -0.5346 0.2974 -0.2423, -0.5395 0.2968 -0.2423, -0.5346 0.2974 -0.2424, -0.5389 0.2948 -0.2467, -0.549 0.287 -0.2467, -0.5479 0.292 -0.2423, -0.5346 0.2953 -0.2467, -0.5346 0.2953 -0.2468, -0.5381 0.2917 -0.2506, -0.5463 0.2855 -0.2506, -0.5464 0.2905 -0.2467, -0.5346 0.2922 -0.2506, -0.5346 0.2921 -0.2506, -0.5371 0.2879 -0.2535, -0.5442 0.2882 -0.2506, -0.5428 0.2835 -0.2535, -0.5393 0.28 -0.2553, -0.544 0.2949 -0.2423, -0.5429 0.2931 -0.2467, -0.5414 0.2904 -0.2506, -0.5394 0.2869 -0.2535, -0.5371 0.283 -0.2553, -0.5413 0.2854 -0.2535, -0.5389 0.2812 -0.2553, -0.5381 0.2822 -0.2553, -0.5346 0.2882 -0.2535, -0.5346 0.2882 -0.2535, -0.5346 0.2836 -0.2553, 0.5359 -0.2834 -0.2553, 0.5441 -0.2787 -0.2535, 0.5441 -0.2787 -0.2535, 0.5438 -0.2812 -0.2535, 0.548 -0.2787 -0.2506, 0.5481 -0.2787 -0.2506, 0.5476 -0.2822 -0.2506, 0.5507 -0.283 -0.2467, 0.5527 -0.2836 -0.2423, 0.5508 -0.2881 -0.2423, 0.5395 -0.2968 -0.2423, 0.5533 -0.2787 -0.2423, 0.5533 -0.2787 -0.2424, 0.5512 -0.2787 -0.2467, 0.5512 -0.2787 -0.2468, 0.5389 -0.2948 -0.2467, 0.549 -0.287 -0.2467, 0.5479 -0.292 -0.2423, 0.5381 -0.2917 -0.2506, 0.5463 -0.2855 -0.2506, 0.5464 -0.2905 -0.2467, 0.5371 -0.2879 -0.2535, 0.5442 -0.2882 -0.2506, 0.5428 -0.2835 -0.2535, 0.5393 -0.28 -0.2553, 0.544 -0.2949 -0.2423, 0.5429 -0.2931 -0.2467, 0.5414 -0.2904 -0.2506, 0.5394 -0.2869 -0.2535, 0.5371 -0.283 -0.2553, 0.5395 -0.2787 -0.2553, 0.5395 -0.2787 -0.2553, 0.5413 -0.2854 -0.2535, 0.5389 -0.2812 -0.2553, 0.5381 -0.2822 -0.2553, 0.5581 -0.2856 0.1484, 0.555 -0.2856 0.1521, 0.5545 -0.2891 0.1521, 0.5507 -0.288 0.155, 0.5462 -0.2869 0.1569, 0.5457 -0.288 0.1569, 0.5439 -0.2898 0.1569, 0.545 -0.2891 0.1569, 0.5428 -0.2903 0.1569, 0.5464 -0.2856 0.1569, 0.5596 -0.2904 0.1438, 0.5577 -0.295 0.1438, 0.5547 -0.2988 0.1438, 0.5509 -0.3018 0.1438, 0.5463 -0.3037 0.1438, 0.5549 -0.2856 0.1522, 0.551 -0.2856 0.155, 0.5509 -0.2856 0.1551, 0.5464 -0.2856 0.1569, 0.5497 -0.2903 0.155, 0.5482 -0.2923 0.155, 0.5462 -0.2938 0.155, 0.544 -0.2948 0.155, 0.5532 -0.2923 0.1521, 0.551 -0.2951 0.1521, 0.5482 -0.2973 0.1521, 0.545 -0.2986 0.1521, 0.5602 -0.2856 0.144, 0.5581 -0.2856 0.1483, 0.5576 -0.2899 0.1483, 0.5559 -0.2939 0.1483, 0.5533 -0.2974 0.1483, 0.5498 -0.3 0.1483, 0.5458 -0.3017 0.1483, 0.5602 -0.2856 0.1438, -0.5545 0.2891 0.1521, -0.5507 0.288 0.155, -0.5462 0.2869 0.1569, -0.5457 0.288 0.1569, -0.5439 0.2898 0.1569, -0.545 0.2891 0.1569, -0.5428 0.2903 0.1569, -0.5596 0.2904 0.1438, -0.5577 0.295 0.1438, -0.5547 0.2988 0.1438, -0.5509 0.3018 0.1438, -0.5463 0.3037 0.1438, -0.5415 0.3043 0.1438, -0.5415 0.2905 0.1569, -0.5497 0.2903 0.155, -0.5482 0.2923 0.155, -0.5462 0.2938 0.155, -0.544 0.2948 0.155, -0.5415 0.2905 0.1569, -0.5415 0.295 0.1551, -0.5415 0.2951 0.155, -0.5415 0.299 0.1522, -0.5532 0.2923 0.1521, -0.551 0.2951 0.1521, -0.5482 0.2973 0.1521, -0.545 0.2986 0.1521, -0.5576 0.2899 0.1483, -0.5559 0.2939 0.1483, -0.5533 0.2974 0.1483, -0.5498 0.3 0.1483, -0.5458 0.3017 0.1483, -0.5415 0.2991 0.1521, -0.5415 0.3022 0.1484, -0.5415 0.3022 0.1483, -0.5415 0.3043 0.144, -0.0188 0.2787 -0.2559, 0.5346 0.2983 -0.2376, 0.5346 0.2974 -0.2423, 0.5346 0.2974 -0.2424, 0.5346 0.2953 -0.2467, 0.5346 0.2953 -0.2468, 0.5346 0.2922 -0.2506, 0.5346 0.2921 -0.2506, 0.5346 0.2882 -0.2535, 0.5346 0.2882 -0.2535, 0.5346 0.2836 -0.2553, 0.5346 0.2836 -0.2553, 0.5346 0.2787 -0.2559, 0.5346 -0.0189 -0.2559, 0.5395 0.2787 -0.2553, 0.5395 0.2787 -0.2553, 0.5441 0.2787 -0.2535, 0.5441 0.2787 -0.2535, 0.548 0.2787 -0.2506, 0.5481 0.2787 -0.2506, 0.5512 0.2787 -0.2468, 0.5512 0.2787 -0.2467, 0.5533 0.2787 -0.2424, 0.5533 0.2787 -0.2423, 0.5543 0.2787 -0.2376, 0.5611 0.2856 0.1392, 0.5602 0.2856 0.1438, 0.5602 0.2856 0.144, 0.5581 0.2856 0.1483, 0.5581 0.2856 0.1484, 0.555 0.2856 0.1521, 0.5549 0.2856 0.1522, 0.551 0.2856 0.155, 0.5509 0.2856 0.1551, 0.5464 0.2856 0.1569, 0.5464 0.2856 0.1569, 0.5415 0.2856 0.1575, 0.5415 0.3052 0.1392, 0.5415 0.3043 0.1438, 0.5415 0.3043 0.144, 0.5415 0.3022 0.1483, 0.5415 0.3022 0.1484, 0.5415 0.2991 0.1521, 0.5415 0.299 0.1522, 0.5415 0.2951 0.155, 0.5415 0.295 0.1551, 0.5415 0.2905 0.1569, 0.5415 0.2905 0.1569, 0.5393 0.28 -0.2553, 0.5371 0.2879 -0.2535, 0.5381 0.2917 -0.2506, 0.5389 0.2948 -0.2467, 0.5395 0.2968 -0.2423, 0.544 0.2949 -0.2423, 0.5536 0.2838 -0.2379, 0.5516 0.2885 -0.2381, 0.5536 0.2838 -0.2379, 0.5527 0.2836 -0.2423, 0.5397 0.2977 -0.2379, 0.5397 0.2977 -0.2379, 0.5444 0.2957 -0.2381, 0.5444 0.2957 -0.2381, 0.5485 0.2926 -0.2382, 0.5507 0.283 -0.2467, 0.5429 0.2931 -0.2467, 0.5479 0.292 -0.2423, 0.5476 0.2822 -0.2506, 0.5414 0.2904 -0.2506, 0.5464 0.2905 -0.2467, 0.5438 0.2812 -0.2535, 0.5442 0.2882 -0.2506, 0.5394 0.2869 -0.2535, 0.5359 0.2834 -0.2553, 0.5516 0.2885 -0.2381, 0.5508 0.2881 -0.2423, 0.549 0.287 -0.2467, 0.5463 0.2855 -0.2506, 0.5428 0.2835 -0.2535, 0.5389 0.2812 -0.2553, 0.5413 0.2854 -0.2535, 0.5371 0.283 -0.2553, 0.5381 0.2822 -0.2553, 0.545 0.2986 0.1521, 0.544 0.2948 0.155, 0.5428 0.2903 0.1569, 0.5439 0.2898 0.1569, 0.5457 0.288 0.1569, 0.545 0.2891 0.1569, 0.5462 0.2869 0.1569, 0.5463 0.3037 0.1438, 0.5466 0.3045 0.1395, 0.5466 0.3045 0.1395, 0.5513 0.3026 0.1397, 0.5509 0.3018 0.1438, 0.5513 0.3026 0.1397, 0.5547 0.2988 0.1438, 0.5553 0.2994 0.1397, 0.5577 0.295 0.1438, 0.5585 0.2954 0.1397, 0.5585 0.2954 0.1397, 0.5596 0.2904 0.1438, 0.5604 0.2907 0.1395, 0.5604 0.2907 0.1395, 0.5462 0.2938 0.155, 0.5482 0.2923 0.155, 0.5497 0.2903 0.155, 0.5507 0.288 0.155, 0.5482 0.2973 0.1521, 0.551 0.2951 0.1521, 0.5532 0.2923 0.1521, 0.5545 0.2891 0.1521, 0.5458 0.3017 0.1483, 0.5498 0.3 0.1483, 0.5533 0.2974 0.1483, 0.5559 0.2939 0.1483, 0.5576 0.2899 0.1483, 0.5709 0.2953 0.0, 0.5702 0.3004 0.0, 0.5694 0.3028 0.0, 0.5682 0.3051 0.0, 0.5668 0.3073 0.0, 0.5651 0.3092 0.0, 0.5632 0.3109 0.0, 0.5611 0.3123 0.0, 0.5588 0.3135 0.0, 0.5563 0.3143 0.0, 0.5512 0.315 0.0, 0.5512 0.315 0.0
			]
		}
		coordIndex [
			0,1,2,-1,2,1,3,-1,2,3,4,-1,4,3,5,-1,4,5,6,-1,6,5,7,-1,8,9,10,-1,10,9,11,-1,10,11,12,-1,13,14,10,-1,10,14,15,-1,10,15,16,-1,12,17,10,-1,10,17,18,-1,10,18,19,-1,19,20,10,-1,10,20,21,-1,10,21,13,-1,22,23,15,-1,15,23,24,-1,15,24,16,-1,25,26,27,-1,27,26,28,-1,28,26,29,-1,29,26,30,-1,29,30,31,-1,31,30,32,-1,31,32,33,-1,33,32,34,-1,33,34,35,-1,35,34,36,-1,35,36,37,-1,37,36,38,-1,37,38,39,-1,39,38,40,-1,39,40,41,-1,41,40,42,-1,41,42,43,-1,42,44,43,-1,43,44,45,-1,43,45,46,-1,47,48,46,-1,46,48,43,-1,43,48,41,-1,41,48,49,-1,41,49,39,-1,39,49,50,-1,39,50,37,-1,37,50,51,-1,37,51,35,-1,35,51,52,-1,35,52,33,-1,33,52,53,-1,33,53,31,-1,31,53,54,-1,31,54,29,-1,29,54,55,-1,29,55,28,-1,55,56,28,-1,28,56,57,-1,28,57,27,-1,58,59,60,-1,61,62,63,-1,64,65,66,-1,67,68,69,-1,26,25,70,-1,32,30,71,-1,71,30,26,-1,44,42,68,-1,68,42,40,-1,68,40,69,-1,69,40,38,-1,69,38,36,-1,45,44,72,-1,72,44,68,-1,72,68,73,-1,73,68,67,-1,73,67,74,-1,74,67,75,-1,26,70,71,-1,71,70,76,-1,71,76,77,-1,65,75,66,-1,66,75,67,-1,66,67,78,-1,78,67,69,-1,78,69,79,-1,79,69,36,-1,76,80,77,-1,77,80,81,-1,77,81,82,-1,62,64,63,-1,63,64,66,-1,63,66,83,-1,83,66,78,-1,83,78,84,-1,84,78,79,-1,81,85,82,-1,82,85,86,-1,82,86,87,-1,84,88,83,-1,83,88,89,-1,83,89,63,-1,63,89,90,-1,63,90,61,-1,34,32,91,-1,91,32,71,-1,91,71,92,-1,92,71,77,-1,92,77,93,-1,93,77,82,-1,93,82,94,-1,94,82,87,-1,94,87,95,-1,95,87,60,-1,95,60,59,-1,59,96,90,-1,90,96,97,-1,90,97,61,-1,88,98,89,-1,89,98,99,-1,89,99,90,-1,90,99,59,-1,98,100,99,-1,99,100,59,-1,86,101,87,-1,87,101,102,-1,87,102,60,-1,60,102,103,-1,60,103,58,-1,36,34,79,-1,79,34,91,-1,79,91,84,-1,84,91,92,-1,84,92,88,-1,88,92,93,-1,88,93,98,-1,98,93,94,-1,98,94,100,-1,100,94,95,-1,100,95,59,-1,104,105,106,-1,107,108,109,-1,110,111,112,-1,113,111,110,-1,109,108,110,-1,114,110,108,-1,115,49,48,-1,49,115,50,-1,50,115,116,-1,50,116,51,-1,51,116,117,-1,51,117,52,-1,52,117,118,-1,52,118,53,-1,53,118,54,-1,54,118,119,-1,54,119,55,-1,55,119,56,-1,56,119,120,-1,56,120,57,-1,121,113,110,-1,122,123,107,-1,107,123,124,-1,107,124,108,-1,108,124,125,-1,108,125,114,-1,126,112,127,-1,127,112,111,-1,127,111,128,-1,128,111,113,-1,128,113,129,-1,121,130,113,-1,113,130,131,-1,113,131,129,-1,129,131,132,-1,129,132,133,-1,106,126,134,-1,134,126,127,-1,134,127,135,-1,135,127,128,-1,135,128,136,-1,136,128,129,-1,136,129,137,-1,137,129,133,-1,138,139,140,-1,140,139,104,-1,104,106,140,-1,140,106,134,-1,140,134,141,-1,141,134,135,-1,141,135,142,-1,142,135,136,-1,142,136,143,-1,143,136,137,-1,143,137,144,-1,105,122,106,-1,106,122,107,-1,106,107,126,-1,126,107,109,-1,126,109,112,-1,112,109,110,-1,138,115,145,-1,145,115,48,-1,145,48,47,-1,133,146,137,-1,137,146,147,-1,137,147,144,-1,144,147,148,-1,144,148,149,-1,138,140,115,-1,115,140,141,-1,115,141,116,-1,116,141,142,-1,116,142,117,-1,117,142,143,-1,117,143,118,-1,118,143,144,-1,118,144,119,-1,119,144,149,-1,119,149,120,-1,150,151,152,-1,152,151,153,-1,153,151,154,-1,154,151,155,-1,154,155,156,-1,156,155,157,-1,156,157,158,-1,158,157,159,-1,158,159,160,-1,160,159,161,-1,160,161,162,-1,162,161,163,-1,162,163,164,-1,164,163,165,-1,164,165,166,-1,166,165,167,-1,166,167,168,-1,167,169,168,-1,168,169,170,-1,168,170,171,-1,172,59,58,-1,25,170,70,-1,70,170,173,-1,70,173,76,-1,76,173,174,-1,76,174,80,-1,80,174,175,-1,80,175,81,-1,81,175,176,-1,81,176,85,-1,85,176,177,-1,85,177,86,-1,86,177,178,-1,86,178,101,-1,101,178,179,-1,101,179,102,-1,102,179,180,-1,102,180,103,-1,103,180,181,-1,103,181,58,-1,58,181,182,-1,58,182,172,-1,172,182,183,-1,184,185,186,-1,59,184,96,-1,96,184,186,-1,96,186,97,-1,97,186,187,-1,97,187,61,-1,61,187,188,-1,61,188,62,-1,62,188,189,-1,62,189,64,-1,64,189,190,-1,64,190,65,-1,65,190,191,-1,65,191,75,-1,75,191,192,-1,75,192,74,-1,74,192,193,-1,74,193,73,-1,73,193,194,-1,73,194,72,-1,72,194,195,-1,72,195,45,-1,45,195,196,-1,196,197,198,-1,198,197,199,-1,199,197,200,-1,200,197,201,-1,200,201,202,-1,202,201,203,-1,202,203,204,-1,204,203,205,-1,204,205,206,-1,206,205,207,-1,206,207,208,-1,208,207,209,-1,208,209,210,-1,210,209,211,-1,210,211,212,-1,212,211,213,-1,212,213,214,-1,213,215,214,-1,214,215,216,-1,214,216,217,-1,218,219,217,-1,217,219,214,-1,214,219,212,-1,212,219,220,-1,212,220,210,-1,210,220,221,-1,210,221,208,-1,208,221,222,-1,208,222,206,-1,206,222,223,-1,206,223,204,-1,204,223,224,-1,204,224,202,-1,202,224,225,-1,202,225,200,-1,200,225,226,-1,200,226,199,-1,226,227,199,-1,199,227,228,-1,199,228,198,-1,47,228,145,-1,145,228,229,-1,145,229,138,-1,138,229,230,-1,138,230,139,-1,139,230,231,-1,139,231,104,-1,104,231,232,-1,104,232,105,-1,105,232,233,-1,105,233,122,-1,122,233,234,-1,122,234,123,-1,123,234,235,-1,123,235,124,-1,124,235,236,-1,124,236,125,-1,125,236,237,-1,125,237,114,-1,237,238,114,-1,114,238,239,-1,114,239,110,-1,240,57,241,-1,241,57,120,-1,241,120,242,-1,242,120,149,-1,242,149,243,-1,243,149,148,-1,243,148,244,-1,244,148,147,-1,244,147,245,-1,245,147,146,-1,245,146,246,-1,246,146,133,-1,246,133,247,-1,247,133,132,-1,247,132,248,-1,248,132,131,-1,248,131,249,-1,249,131,130,-1,249,130,250,-1,130,121,250,-1,250,121,110,-1,250,110,251,-1,240,252,171,-1,171,252,168,-1,168,252,166,-1,166,252,253,-1,166,253,164,-1,164,253,254,-1,164,254,162,-1,162,254,255,-1,162,255,160,-1,160,255,256,-1,160,256,158,-1,158,256,257,-1,158,257,156,-1,156,257,258,-1,156,258,154,-1,154,258,259,-1,154,259,153,-1,259,260,153,-1,153,260,261,-1,153,261,152,-1,262,183,263,-1,180,179,264,-1,178,177,265,-1,266,267,268,-1,151,150,269,-1,157,155,270,-1,270,155,151,-1,169,167,267,-1,267,167,165,-1,267,165,268,-1,268,165,163,-1,268,163,161,-1,170,169,173,-1,173,169,267,-1,173,267,174,-1,174,267,266,-1,174,266,175,-1,175,266,176,-1,151,269,270,-1,270,269,271,-1,270,271,272,-1,177,176,265,-1,265,176,266,-1,265,266,273,-1,273,266,268,-1,273,268,274,-1,274,268,161,-1,271,275,272,-1,272,275,276,-1,272,276,277,-1,179,178,264,-1,264,178,265,-1,264,265,278,-1,278,265,273,-1,278,273,279,-1,279,273,274,-1,276,280,277,-1,277,280,281,-1,277,281,282,-1,279,283,278,-1,278,283,284,-1,278,284,264,-1,264,284,285,-1,264,285,180,-1,159,157,286,-1,286,157,270,-1,286,270,287,-1,287,270,272,-1,287,272,288,-1,288,272,277,-1,288,277,289,-1,289,277,282,-1,289,282,290,-1,290,282,263,-1,290,263,183,-1,183,182,285,-1,285,182,181,-1,285,181,180,-1,283,291,284,-1,284,291,292,-1,284,292,285,-1,285,292,183,-1,291,293,292,-1,292,293,183,-1,281,294,282,-1,282,294,295,-1,282,295,263,-1,263,295,296,-1,263,296,262,-1,161,159,274,-1,274,159,286,-1,274,286,279,-1,279,286,287,-1,279,287,283,-1,283,287,288,-1,283,288,291,-1,291,288,289,-1,291,289,293,-1,293,289,290,-1,293,290,183,-1,186,185,297,-1,298,299,300,-1,301,302,303,-1,304,305,306,-1,197,196,195,-1,203,201,307,-1,307,201,197,-1,215,213,305,-1,305,213,211,-1,305,211,306,-1,306,211,209,-1,306,209,207,-1,216,215,308,-1,308,215,305,-1,308,305,309,-1,309,305,304,-1,309,304,310,-1,310,304,311,-1,197,195,307,-1,307,195,194,-1,307,194,312,-1,302,311,303,-1,303,311,304,-1,303,304,313,-1,313,304,306,-1,313,306,314,-1,314,306,207,-1,194,193,312,-1,312,193,192,-1,312,192,315,-1,299,301,300,-1,300,301,303,-1,300,303,316,-1,316,303,313,-1,316,313,317,-1,317,313,314,-1,192,191,315,-1,315,191,190,-1,315,190,318,-1,317,319,316,-1,316,319,320,-1,316,320,300,-1,300,320,321,-1,300,321,298,-1,205,203,322,-1,322,203,307,-1,322,307,323,-1,323,307,312,-1,323,312,324,-1,324,312,315,-1,324,315,325,-1,325,315,318,-1,325,318,326,-1,326,318,297,-1,326,297,185,-1,185,327,321,-1,321,327,328,-1,321,328,298,-1,319,329,320,-1,320,329,330,-1,320,330,321,-1,321,330,185,-1,329,331,330,-1,330,331,185,-1,190,189,318,-1,318,189,188,-1,318,188,297,-1,297,188,187,-1,297,187,186,-1,207,205,314,-1,314,205,322,-1,314,322,317,-1,317,322,323,-1,317,323,319,-1,319,323,324,-1,319,324,329,-1,329,324,325,-1,329,325,331,-1,331,325,326,-1,331,326,185,-1,332,333,334,-1,335,336,337,-1,239,338,339,-1,340,338,239,-1,337,336,239,-1,341,239,336,-1,342,220,219,-1,220,342,221,-1,221,342,343,-1,221,343,222,-1,222,343,344,-1,222,344,223,-1,223,344,345,-1,223,345,224,-1,224,345,225,-1,225,345,346,-1,225,346,226,-1,226,346,227,-1,227,346,229,-1,227,229,228,-1,238,340,239,-1,347,348,335,-1,335,348,349,-1,335,349,336,-1,336,349,350,-1,336,350,341,-1,351,339,352,-1,352,339,338,-1,352,338,353,-1,353,338,340,-1,353,340,354,-1,238,237,340,-1,340,237,236,-1,340,236,354,-1,354,236,235,-1,354,235,234,-1,334,351,355,-1,355,351,352,-1,355,352,356,-1,356,352,353,-1,356,353,357,-1,357,353,354,-1,357,354,358,-1,358,354,234,-1,359,360,361,-1,361,360,332,-1,332,334,361,-1,361,334,355,-1,361,355,362,-1,362,355,356,-1,362,356,363,-1,363,356,357,-1,363,357,364,-1,364,357,358,-1,364,358,365,-1,333,347,334,-1,334,347,335,-1,334,335,351,-1,351,335,337,-1,351,337,339,-1,339,337,239,-1,359,342,366,-1,366,342,219,-1,366,219,218,-1,234,233,358,-1,358,233,232,-1,358,232,365,-1,365,232,231,-1,365,231,230,-1,359,361,342,-1,342,361,362,-1,342,362,343,-1,343,362,363,-1,343,363,344,-1,344,363,364,-1,344,364,345,-1,345,364,365,-1,345,365,346,-1,346,365,230,-1,346,230,229,-1,244,245,367,-1,368,369,370,-1,251,371,372,-1,373,371,251,-1,370,369,251,-1,250,251,369,-1,374,253,252,-1,253,374,254,-1,254,374,375,-1,254,375,255,-1,255,375,376,-1,255,376,256,-1,256,376,377,-1,256,377,257,-1,257,377,258,-1,258,377,378,-1,258,378,259,-1,259,378,260,-1,260,378,379,-1,260,379,261,-1,380,373,251,-1,246,247,368,-1,368,247,248,-1,368,248,369,-1,369,248,249,-1,369,249,250,-1,381,372,382,-1,382,372,371,-1,382,371,383,-1,383,371,373,-1,383,373,384,-1,380,385,373,-1,373,385,386,-1,373,386,384,-1,384,386,387,-1,384,387,388,-1,367,381,389,-1,389,381,382,-1,389,382,390,-1,390,382,383,-1,390,383,391,-1,391,383,384,-1,391,384,392,-1,392,384,388,-1,242,243,393,-1,393,243,244,-1,244,367,393,-1,393,367,389,-1,393,389,394,-1,394,389,390,-1,394,390,395,-1,395,390,391,-1,395,391,396,-1,396,391,392,-1,396,392,397,-1,245,246,367,-1,367,246,368,-1,367,368,381,-1,381,368,370,-1,381,370,372,-1,372,370,251,-1,242,374,241,-1,241,374,252,-1,241,252,240,-1,388,398,392,-1,392,398,399,-1,392,399,397,-1,397,399,400,-1,397,400,401,-1,242,393,374,-1,374,393,394,-1,374,394,375,-1,375,394,395,-1,375,395,376,-1,376,395,396,-1,376,396,377,-1,377,396,397,-1,377,397,378,-1,378,397,401,-1,378,401,379,-1,402,183,262,-1,150,403,269,-1,269,403,404,-1,269,404,271,-1,271,404,405,-1,271,405,275,-1,275,405,406,-1,275,406,276,-1,276,406,407,-1,276,407,280,-1,280,407,408,-1,280,408,281,-1,281,408,409,-1,281,409,294,-1,294,409,410,-1,294,410,295,-1,295,410,411,-1,295,411,296,-1,296,411,412,-1,296,412,262,-1,262,412,413,-1,262,413,402,-1,402,413,414,-1,415,414,416,-1,185,415,327,-1,327,415,416,-1,327,416,328,-1,328,416,417,-1,328,417,298,-1,298,417,418,-1,298,418,299,-1,299,418,419,-1,299,419,301,-1,301,419,420,-1,301,420,302,-1,302,420,421,-1,302,421,311,-1,311,421,422,-1,311,422,310,-1,310,422,423,-1,310,423,309,-1,309,423,424,-1,309,424,308,-1,308,424,425,-1,308,425,216,-1,216,425,426,-1,218,427,366,-1,366,427,428,-1,366,428,359,-1,359,428,429,-1,359,429,360,-1,360,429,430,-1,360,430,332,-1,332,430,431,-1,332,431,333,-1,333,431,432,-1,333,432,347,-1,347,432,433,-1,347,433,348,-1,348,433,434,-1,348,434,349,-1,349,434,435,-1,349,435,350,-1,350,435,436,-1,350,436,341,-1,436,437,341,-1,341,437,438,-1,341,438,239,-1,439,261,440,-1,440,261,379,-1,440,379,441,-1,441,379,401,-1,441,401,442,-1,442,401,400,-1,442,400,443,-1,443,400,399,-1,443,399,444,-1,444,399,398,-1,444,398,445,-1,445,398,388,-1,445,388,446,-1,446,388,387,-1,446,387,447,-1,447,387,386,-1,447,386,448,-1,448,386,385,-1,448,385,449,-1,385,380,449,-1,449,380,251,-1,449,251,438,-1,416,414,450,-1,411,410,451,-1,409,408,452,-1,453,454,455,-1,456,426,425,-1,457,458,459,-1,459,458,456,-1,460,461,454,-1,454,461,462,-1,454,462,455,-1,455,462,463,-1,455,463,464,-1,403,460,404,-1,404,460,454,-1,404,454,405,-1,405,454,453,-1,405,453,406,-1,406,453,407,-1,456,425,459,-1,459,425,424,-1,459,424,465,-1,408,407,452,-1,452,407,453,-1,452,453,466,-1,466,453,455,-1,466,455,467,-1,467,455,464,-1,424,423,465,-1,465,423,422,-1,465,422,468,-1,410,409,451,-1,451,409,452,-1,451,452,469,-1,469,452,466,-1,469,466,470,-1,470,466,467,-1,422,421,468,-1,468,421,420,-1,468,420,471,-1,470,472,469,-1,469,472,473,-1,469,473,451,-1,451,473,474,-1,451,474,411,-1,475,457,476,-1,476,457,459,-1,476,459,477,-1,477,459,465,-1,477,465,478,-1,478,465,468,-1,478,468,479,-1,479,468,471,-1,479,471,480,-1,480,471,450,-1,480,450,414,-1,414,413,474,-1,474,413,412,-1,474,412,411,-1,472,481,473,-1,473,481,482,-1,473,482,474,-1,474,482,414,-1,481,483,482,-1,482,483,414,-1,420,419,471,-1,471,419,418,-1,471,418,450,-1,450,418,417,-1,450,417,416,-1,464,475,467,-1,467,475,476,-1,467,476,470,-1,470,476,477,-1,470,477,472,-1,472,477,478,-1,472,478,481,-1,481,478,479,-1,481,479,483,-1,483,479,480,-1,483,480,414,-1,443,444,484,-1,485,486,487,-1,438,488,489,-1,490,488,438,-1,487,486,438,-1,449,438,486,-1,491,492,493,-1,492,491,494,-1,494,491,495,-1,494,495,496,-1,496,495,497,-1,496,497,498,-1,498,497,499,-1,498,499,500,-1,500,499,501,-1,501,499,502,-1,501,502,503,-1,503,502,504,-1,504,502,428,-1,504,428,427,-1,437,490,438,-1,445,446,485,-1,485,446,447,-1,485,447,486,-1,486,447,448,-1,486,448,449,-1,505,489,506,-1,506,489,488,-1,506,488,507,-1,507,488,490,-1,507,490,508,-1,437,436,490,-1,490,436,435,-1,490,435,508,-1,508,435,434,-1,508,434,433,-1,484,505,509,-1,509,505,506,-1,509,506,510,-1,510,506,507,-1,510,507,511,-1,511,507,508,-1,511,508,512,-1,512,508,433,-1,441,442,513,-1,513,442,443,-1,443,484,513,-1,513,484,509,-1,513,509,514,-1,514,509,510,-1,514,510,515,-1,515,510,511,-1,515,511,516,-1,516,511,512,-1,516,512,517,-1,444,445,484,-1,484,445,485,-1,484,485,505,-1,505,485,487,-1,505,487,489,-1,489,487,438,-1,441,491,440,-1,440,491,493,-1,440,493,439,-1,433,432,512,-1,512,432,431,-1,512,431,517,-1,517,431,430,-1,517,430,429,-1,441,513,491,-1,491,513,514,-1,491,514,495,-1,495,514,515,-1,495,515,497,-1,497,515,516,-1,497,516,499,-1,499,516,517,-1,499,517,502,-1,502,517,429,-1,502,429,428,-1,426,456,518,-1,518,456,519,-1,519,456,520,-1,520,456,458,-1,520,458,521,-1,521,458,457,-1,521,457,522,-1,522,457,475,-1,522,475,523,-1,523,475,464,-1,523,464,524,-1,524,464,463,-1,524,463,525,-1,525,463,462,-1,525,462,526,-1,526,462,461,-1,526,461,527,-1,461,460,527,-1,527,460,403,-1,527,403,528,-1,439,493,528,-1,528,493,527,-1,527,493,526,-1,526,493,492,-1,526,492,525,-1,525,492,494,-1,525,494,524,-1,524,494,496,-1,524,496,523,-1,523,496,498,-1,523,498,522,-1,522,498,500,-1,522,500,521,-1,521,500,501,-1,521,501,520,-1,520,501,503,-1,520,503,519,-1,503,504,519,-1,519,504,427,-1,519,427,518,-1,
		]
	}
}