(module "SENSOR-TH_AM2302" (layer F.Cu) (tedit 641D7928)
  (descr "SENSOR-TH_AM2302 footprint")
  (tags "SENSOR-TH_AM2302 footprint")
  (fp_text reference REF** (at -0.003937 -4.542799) (layer F.SilkS)
    (effects (font (size 1 1) (thickness 0.15)))
  )
  (fp_text value SENSOR-TH_AM2302 (at -0.003937 7.257557) (layer F.Fab)
    (effects (font (size 1 1) (thickness 0.15)))
  )
  (fp_circle (center -7.7 5.257531) (end -7.670003 5.257531) (layer F.SilkS) (width 0.059995))
  (fp_line (start -7.705359 -1.071882) (end 7.694691 -1.071882) (layer F.SilkS) (width 0.254001))
  (fp_line (start -7.702565 -2.542545) (end -7.702565 5.257557) (layer F.SilkS) (width 0.254001))
  (fp_line (start -7.702565 -2.542545) (end 7.697485 -2.542545) (layer F.SilkS) (width 0.254001))
  (fp_line (start 7.697485 -2.542799) (end 7.697485 5.257557) (layer F.SilkS) (width 0.254001))
  (fp_line (start 5.217424 -2.502667) (end 5.217424 -1.102616) (layer F.SilkS) (width 0.254001))
  (fp_line (start -7.702565 5.257557) (end 7.697485 5.257557) (layer F.SilkS) (width 0.254001))
  (fp_line (start -5.192786 -2.522479) (end -5.192786 -1.122936) (layer F.SilkS) (width 0.254001))
  (pad 1 thru_hole rect (at -3.810008 0) (size 1.400051 1.400051) (drill 0.8) (layers *.Cu *.Mask))
  (pad 2 thru_hole circle (at -1.270003 0) (size 1.400051 1.400051) (drill 0.8) (layers *.Cu *.Mask))
  (pad 3 thru_hole circle (at 1.270003 0) (size 1.400051 1.400051) (drill 0.8) (layers *.Cu *.Mask))
  (pad 4 thru_hole circle (at 3.810008 0) (size 1.400051 1.400051) (drill 0.8) (layers *.Cu *.Mask))
  (fp_text user REF** (at -0.003937 9.257557) (layer F.Fab)
    (effects (font (size 1 1) (thickness 0.15)))
  )
  (model "C:/Users/dylan/OneDrive - University of Cape Town/UNIVERSITY FILES/Third Year/Semester 1/EEE3088F/group-34-hat/PCB/Library/kicad6-librariess/JLC2KiCad_lib/footprint/packages3d/SENSOR-TH_AM2302.wrl"
    (at (xyz -0.000748 -0.054016 0.395195))
    (scale (xyz 1 1 1))
    (rotate (xyz 0 0 -180))
  )
)