G04 EAGLE Gerber RS-274X export*
G75*
%MOMM*%
%FSLAX34Y34*%
%LPD*%
%INSoldermask Top*%
%IPPOS*%
%AMOC8*
5,1,8,0,0,1.08239X$1,22.5*%
G01*
%ADD10R,1.403200X1.003200*%
%ADD11C,1.727200*%
%ADD12P,1.869504X8X22.500000*%
%ADD13R,1.853200X0.803200*%


D10*
X228600Y243950D03*
X228600Y225950D03*
X247650Y243950D03*
X247650Y225950D03*
X266700Y243950D03*
X266700Y225950D03*
X444500Y243950D03*
X444500Y225950D03*
X425450Y243950D03*
X425450Y225950D03*
X406400Y243950D03*
X406400Y225950D03*
D11*
X90170Y266700D02*
X74930Y266700D01*
X74930Y241300D02*
X90170Y241300D01*
X90170Y215900D02*
X74930Y215900D01*
X74930Y190500D02*
X90170Y190500D01*
X90170Y165100D02*
X74930Y165100D01*
X74930Y139700D02*
X90170Y139700D01*
X90170Y114300D02*
X74930Y114300D01*
D12*
X177800Y139700D03*
X177800Y107950D03*
X177800Y76200D03*
X495300Y76200D03*
X495300Y107950D03*
X495300Y139700D03*
X495300Y171450D03*
X495300Y203200D03*
X495300Y234950D03*
X495300Y266700D03*
D11*
X582930Y266700D02*
X598170Y266700D01*
X598170Y241300D02*
X582930Y241300D01*
X582930Y215900D02*
X598170Y215900D01*
X598170Y190500D02*
X582930Y190500D01*
X582930Y165100D02*
X598170Y165100D01*
X598170Y139700D02*
X582930Y139700D01*
X582930Y114300D02*
X598170Y114300D01*
D12*
X495300Y298450D03*
D11*
X627380Y88900D02*
X642620Y88900D01*
X642620Y63500D02*
X627380Y63500D01*
X627380Y38100D02*
X642620Y38100D01*
X45720Y88900D02*
X30480Y88900D01*
X30480Y63500D02*
X45720Y63500D01*
X45720Y38100D02*
X30480Y38100D01*
D12*
X177800Y298450D03*
X177800Y266700D03*
X177800Y234950D03*
X177800Y203200D03*
X177800Y171450D03*
D13*
X287800Y234950D03*
X287800Y222250D03*
X287800Y209550D03*
X287800Y196850D03*
X287800Y184150D03*
X287800Y171450D03*
X287800Y158750D03*
X287800Y146050D03*
X385300Y146050D03*
X385300Y158750D03*
X385300Y171450D03*
X385300Y184150D03*
X385300Y196850D03*
X385300Y209550D03*
X385300Y222250D03*
X385300Y234950D03*
M02*
