<svg xmlns="http://www.w3.org/2000/svg" width="24" height="47" viewBox="0 0 24 47">
  <text id="_" data-name="+" transform="translate(12 38)" fill="#bcbbba" font-size="35" font-family="SegoeUI, Segoe UI"><tspan x="-11.971" y="0">+</tspan></text>
</svg>
