<svg xmlns="http://www.w3.org/2000/svg" xmlns:xlink="http://www.w3.org/1999/xlink" width="16.554" height="19.7" viewBox="0 0 16.554 19.7">
  <defs>
    <clipPath id="clip-path">
      <rect id="Rectangle_68" data-name="Rectangle 68" width="16.554" height="19.7" fill="#e76f14"/>
    </clipPath>
  </defs>
  <g id="Group_60" data-name="Group 60" clip-path="url(#clip-path)">
    <path id="Path_48" data-name="Path 48" d="M12.815,0c.312.088.63.159.934.269a3.018,3.018,0,0,1,1.162.795c.246.261.5.518.739.783a3.522,3.522,0,0,1-.079,4.8q-4.273,4.3-8.564,8.587a2.821,2.821,0,0,1-1.566.7c-1.065.205-2.124.442-3.192.635A1.961,1.961,0,0,1,.069,15.12a2.728,2.728,0,0,1,.042-1.347c.218-1.019.429-2.04.645-3.059a2.261,2.261,0,0,1,.615-1.151l8.5-8.54a3.391,3.391,0,0,1,1.95-.986A.655.655,0,0,0,11.931,0ZM1.961,14.619a.825.825,0,0,0,.105,0c1.108-.187,2.216-.372,3.322-.569a.685.685,0,0,0,.341-.174c.639-.629,1.267-1.268,1.9-1.9Q10.864,8.714,14.1,5.457a1.532,1.532,0,0,0,.014-2.327q-.35-.356-.706-.707a1.559,1.559,0,0,0-2.18-.006Q6.987,6.666,2.757,10.925a.478.478,0,0,0-.118.23c-.129.626-.25,1.254-.372,1.881-.1.52-.2,1.04-.305,1.582" transform="translate(0 -0.001)" fill="#e76f14"/>
    <path id="Path_49" data-name="Path 49" d="M1.044,349.03a1.053,1.053,0,0,1-.707-.716.907.907,0,0,1,.868-1.172c.058,0,.115,0,.173,0q7.131,0,14.263,0a1.094,1.094,0,0,1,.642.151.926.926,0,0,1,.446.861.884.884,0,0,1-.615.805c-.057.023-.113.049-.169.074Z" transform="translate(-0.288 -329.33)" fill="#e76f14"/>
  </g>
</svg>
