<mxfile host="app.diagrams.net" modified="2023-04-13T12:06:03.140Z" agent="Mozilla/5.0 (Macintosh; Intel Mac OS X 10_15_7) AppleWebKit/537.36 (KHTML, like Gecko) Chrome/112.0.0.0 Safari/537.36" etag="NqmoiIys26wdqYACKQ4A" version="21.1.7" type="device">
  <diagram id="yyEKbpskc-0J1iTDgMWW" name="Page-1">
    <mxGraphModel dx="954" dy="623" grid="1" gridSize="10" guides="1" tooltips="1" connect="1" arrows="1" fold="1" page="1" pageScale="1" pageWidth="827" pageHeight="1169" math="0" shadow="0">
      <root>
        <mxCell id="0" />
        <mxCell id="1" parent="0" />
        <mxCell id="TmKG4kpp7Fe0w5NmcbaV-9" value="" style="rounded=1;whiteSpace=wrap;html=1;fillColor=none;" parent="1" vertex="1">
          <mxGeometry x="40" y="20" width="680" height="250" as="geometry" />
        </mxCell>
        <mxCell id="TmKG4kpp7Fe0w5NmcbaV-4" value="" style="rounded=1;whiteSpace=wrap;html=1;fillColor=#dae8fc;strokeColor=#6c8ebf;" parent="1" vertex="1">
          <mxGeometry x="50" y="30" width="420" height="230" as="geometry" />
        </mxCell>
        <mxCell id="TmKG4kpp7Fe0w5NmcbaV-1" value="" style="rounded=1;whiteSpace=wrap;html=1;fillColor=#f5f5f5;fontColor=#333333;strokeColor=#666666;" parent="1" vertex="1">
          <mxGeometry x="254" y="80" width="176" height="150" as="geometry" />
        </mxCell>
        <mxCell id="TmKG4kpp7Fe0w5NmcbaV-5" value="Docker" style="text;html=1;strokeColor=none;fillColor=none;align=center;verticalAlign=middle;whiteSpace=wrap;rounded=0;" parent="1" vertex="1">
          <mxGeometry x="185" y="40" width="60" height="30" as="geometry" />
        </mxCell>
        <mxCell id="TmKG4kpp7Fe0w5NmcbaV-6" value="Docker container" style="text;html=1;strokeColor=none;fillColor=none;align=center;verticalAlign=middle;whiteSpace=wrap;rounded=0;" parent="1" vertex="1">
          <mxGeometry x="254" y="80" width="156" height="30" as="geometry" />
        </mxCell>
        <mxCell id="TmKG4kpp7Fe0w5NmcbaV-8" value="Frontend&lt;br&gt;(nginx)" style="rounded=1;whiteSpace=wrap;html=1;" parent="1" vertex="1">
          <mxGeometry x="263" y="119" width="120" height="60" as="geometry" />
        </mxCell>
        <mxCell id="TmKG4kpp7Fe0w5NmcbaV-11" value="" style="rounded=0;whiteSpace=wrap;html=1;fillColor=none;" parent="1" vertex="1">
          <mxGeometry x="490" y="50" width="210" height="190" as="geometry" />
        </mxCell>
        <mxCell id="TmKG4kpp7Fe0w5NmcbaV-12" value="" style="rounded=0;whiteSpace=wrap;html=1;fillColor=#d5e8d4;strokeColor=#82b366;" parent="1" vertex="1">
          <mxGeometry x="490" y="50" width="210" height="30" as="geometry" />
        </mxCell>
        <mxCell id="TmKG4kpp7Fe0w5NmcbaV-13" value="Browser" style="text;html=1;strokeColor=none;fillColor=none;align=center;verticalAlign=middle;whiteSpace=wrap;rounded=0;" parent="1" vertex="1">
          <mxGeometry x="565" y="50" width="60" height="30" as="geometry" />
        </mxCell>
        <mxCell id="TmKG4kpp7Fe0w5NmcbaV-14" value="" style="endArrow=none;dashed=1;html=1;rounded=0;" parent="1" edge="1">
          <mxGeometry width="50" height="50" relative="1" as="geometry">
            <mxPoint x="700" y="106" as="sourcePoint" />
            <mxPoint x="490" y="106" as="targetPoint" />
            <Array as="points" />
          </mxGeometry>
        </mxCell>
        <mxCell id="TmKG4kpp7Fe0w5NmcbaV-15" value="http://localhost:8080" style="text;html=1;strokeColor=none;fillColor=none;align=left;verticalAlign=middle;whiteSpace=wrap;rounded=0;" parent="1" vertex="1">
          <mxGeometry x="500" y="80" width="160" height="30" as="geometry" />
        </mxCell>
        <mxCell id="TmKG4kpp7Fe0w5NmcbaV-21" value="" style="endArrow=classic;html=1;rounded=0;entryX=0;entryY=0.5;entryDx=0;entryDy=0;" parent="1" source="TmKG4kpp7Fe0w5NmcbaV-8" target="TmKG4kpp7Fe0w5NmcbaV-2" edge="1">
          <mxGeometry width="50" height="50" relative="1" as="geometry">
            <mxPoint x="390" y="230" as="sourcePoint" />
            <mxPoint x="440" y="180" as="targetPoint" />
          </mxGeometry>
        </mxCell>
        <mxCell id="TmKG4kpp7Fe0w5NmcbaV-27" value="" style="curved=1;endArrow=classic;html=1;rounded=0;exitX=0.25;exitY=1;exitDx=0;exitDy=0;entryX=1;entryY=0.5;entryDx=0;entryDy=0;" parent="1" source="TmKG4kpp7Fe0w5NmcbaV-15" target="TmKG4kpp7Fe0w5NmcbaV-2" edge="1">
          <mxGeometry width="50" height="50" relative="1" as="geometry">
            <mxPoint x="430" y="180" as="sourcePoint" />
            <mxPoint x="480" y="130" as="targetPoint" />
            <Array as="points">
              <mxPoint x="520" y="180" />
              <mxPoint x="460" y="140" />
            </Array>
          </mxGeometry>
        </mxCell>
        <mxCell id="TmKG4kpp7Fe0w5NmcbaV-31" value="" style="rounded=1;whiteSpace=wrap;html=1;fillColor=#f5f5f5;fontColor=#333333;strokeColor=#666666;" parent="1" vertex="1">
          <mxGeometry x="59" y="80" width="171" height="150" as="geometry" />
        </mxCell>
        <mxCell id="TmKG4kpp7Fe0w5NmcbaV-7" value="Backend&lt;br&gt;(Flask)" style="rounded=1;whiteSpace=wrap;html=1;" parent="1" vertex="1">
          <mxGeometry x="70" y="124" width="120" height="60" as="geometry" />
        </mxCell>
        <mxCell id="TmKG4kpp7Fe0w5NmcbaV-33" value="" style="group" parent="1" vertex="1" connectable="0">
          <mxGeometry x="390" y="129" width="60" height="40" as="geometry" />
        </mxCell>
        <mxCell id="TmKG4kpp7Fe0w5NmcbaV-2" value="" style="rounded=1;whiteSpace=wrap;html=1;" parent="TmKG4kpp7Fe0w5NmcbaV-33" vertex="1">
          <mxGeometry x="10" width="40" height="40" as="geometry" />
        </mxCell>
        <mxCell id="TmKG4kpp7Fe0w5NmcbaV-28" value="8080" style="text;html=1;strokeColor=none;fillColor=none;align=center;verticalAlign=middle;whiteSpace=wrap;rounded=0;" parent="TmKG4kpp7Fe0w5NmcbaV-33" vertex="1">
          <mxGeometry y="5" width="60" height="30" as="geometry" />
        </mxCell>
        <mxCell id="TmKG4kpp7Fe0w5NmcbaV-23" value="" style="endArrow=classic;html=1;rounded=0;exitX=1;exitY=0.5;exitDx=0;exitDy=0;entryX=0;entryY=0.5;entryDx=0;entryDy=0;" parent="1" source="TmKG4kpp7Fe0w5NmcbaV-7" target="TmKG4kpp7Fe0w5NmcbaV-3" edge="1">
          <mxGeometry width="50" height="50" relative="1" as="geometry">
            <mxPoint x="390" y="230" as="sourcePoint" />
            <mxPoint x="440" y="180" as="targetPoint" />
          </mxGeometry>
        </mxCell>
        <mxCell id="TmKG4kpp7Fe0w5NmcbaV-34" value="Docker container" style="text;html=1;strokeColor=none;fillColor=none;align=center;verticalAlign=middle;whiteSpace=wrap;rounded=0;" parent="1" vertex="1">
          <mxGeometry x="61" y="80" width="156" height="30" as="geometry" />
        </mxCell>
        <mxCell id="TmKG4kpp7Fe0w5NmcbaV-35" value="" style="curved=1;endArrow=classic;html=1;rounded=0;entryX=1;entryY=1;entryDx=0;entryDy=0;exitX=0.75;exitY=1;exitDx=0;exitDy=0;" parent="1" source="TmKG4kpp7Fe0w5NmcbaV-8" target="TmKG4kpp7Fe0w5NmcbaV-3" edge="1">
          <mxGeometry width="50" height="50" relative="1" as="geometry">
            <mxPoint x="345" y="134" as="sourcePoint" />
            <mxPoint x="235" y="164" as="targetPoint" />
            <Array as="points">
              <mxPoint x="340" y="209" />
              <mxPoint x="260" y="209" />
            </Array>
          </mxGeometry>
        </mxCell>
        <mxCell id="TmKG4kpp7Fe0w5NmcbaV-36" value="" style="group" parent="1" vertex="1" connectable="0">
          <mxGeometry x="194" y="134" width="60" height="40" as="geometry" />
        </mxCell>
        <mxCell id="TmKG4kpp7Fe0w5NmcbaV-3" value="" style="rounded=1;whiteSpace=wrap;html=1;" parent="TmKG4kpp7Fe0w5NmcbaV-36" vertex="1">
          <mxGeometry x="10" width="40" height="40" as="geometry" />
        </mxCell>
        <mxCell id="TmKG4kpp7Fe0w5NmcbaV-32" value="5000" style="text;html=1;strokeColor=none;fillColor=none;align=center;verticalAlign=middle;whiteSpace=wrap;rounded=0;" parent="TmKG4kpp7Fe0w5NmcbaV-36" vertex="1">
          <mxGeometry y="5" width="60" height="30" as="geometry" />
        </mxCell>
      </root>
    </mxGraphModel>
  </diagram>
</mxfile>
