{
  "extends": [
    ":timezone(Europe/Moscow)",
    ":separateMajorReleases",
    ":combinePatchMinorReleases",
    ":ignoreUnstable",
    ":prImmediately",
    ":semanticCommits",
    ":semanticCommitType(build)",
    ":semanticCommitScope(deps)",
    ":updateNotScheduled",
    ":automergeMinor",
    ":automergePr",
    ":ignoreModulesAndTests",
    ":maintainLockFilesDisabled",
    ":autodetectPinVersions",
    ":disableRateLimiting",
    "group:monorepos",
    "group:recommended",
    "helpers:disableTypesNodeMajor"
  ],
  "enabledManagers": [
    "npm"
  ],
  "commitMessageTopic": "{{depName}}",
  "baseBranches": [
    "develop"
  ],
  "assignees": ["savushkin.i"],
  "assigneesSampleSize": 1
}
