module gitlab.com/savitskyi.andriy/shippy-service-consignment

go 1.14

require (
	github.com/golang/protobuf v1.4.2 // indirect
	golang.org/x/net v0.0.0-20200513185701-a91f0712d120 // indirect
	golang.org/x/sys v0.0.0-20200515095857-1151b9dac4a9 // indirect
	golang.org/x/text v0.3.2 // indirect
	google.golang.org/genproto v0.0.0-20200515170657-fc4c6c6a6587 // indirect
	google.golang.org/grpc v1.29.1
)
