{
  "type": "service_account",
  "project_id": "shopping-app-f29b6",
  "private_key_id": "650ffeefb5f79c3d10af106b9a5daca636cf9774",
  "private_key": "-----BEGIN PRIVATE KEY-----\nMIIEvQIBADANBgkqhkiG9w0BAQEFAASCBKcwggSjAgEAAoIBAQDRTsM2SxlwvHw7\n9vZoMvd1LHI8pSZrElLgRCcV9luUmGg4bGrYAX7QN5JuAswsL8tbaAa+jajupYbO\nWxoiexGnFcyt97p0uKFCxyETcIj8ebv7LVIOSWrJmFbjXwWEY24KWZygt857cVaR\nOLcmR444CyEIWlQGNs6odG0ISwMcgVuUxC7lDyN73K0SRs73owyC++N1jM4BszXR\nmD4kPGzzmNWeVUyfsE5y/yNcjUJF+NWcSEmDCV/Z3mrXxNM7EUS49eOjQxhFv1U3\n43ryMNSZh29pGUQV0wT9/ZTT94CHnM9lyakJjf727z1fy4UX+T6ERl9pqWV5+ZME\nfZWHD4CHAgMBAAECggEAAOQ+1Pc1Q14s1003gn0ebGYv5w3ltSoNpqfo/2EecGpv\nyIxprhmKMpUyBKbyu14ewHkXzO2p4mOxHdA/MxYRdAPrQch0MmAWS8RbtzX7rLum\nBIK5E+zVzXMJLQxwEml2rrOar7KTaMI0VgexprJCVanHzmh4GCium61sniRCU0zr\nHmlkaP6VXceESOFxHaSOlnd1jCxTceQJrGkdGqvC4pvNSwEsg1O3F6LMCIdTtIbT\nIFjEgDl+IHlPZ4dRv2XORBHVCsgmF9gP8EPsAuceF+nbUIDEDnA0CnCgM8Sh2zwR\nwZV1DmKijF3qf5C6oI7Q+XDgQet5xvGJ7luPPFfypQKBgQD6IwTRwjrS04CxUfKd\nVDd5ztS//t5caS8oT+fpGkC7LO8bpSu+Z9aIHy4b5A0pY7bn8iJZO+zRPE0Cw9Rw\nzjM3JP+lftJwusEoVtP6hNUURxn7gUKlil7rAq94QVlnRXcfeuKHw+L7Ap5PBDyL\nnWMaaeh2gG0qN+rEe3khy7cdiwKBgQDWNr4m1JVST9JfV224g8cQKQd9DpA6EglE\nROcIqm5sM8TeX3CbqroPD5mzQ+ZvherTERqdmc03/P7LuMvouMchaHdweT3f8irZ\nlsHpvSxgKObmqUE+h4wdq9ShLb6w/lswKMIrC5FmYQPfZZcNFZ0kU1vk0aM3DX+P\n0I2c7v0AdQKBgCjDPC3SsTNaNEaxTBBHgSLgidsf9aypl33CR9C87n+SOwUOTaqh\n0VwteJ4i8+Ii1dPGqcJQ+a6/XO1ubFhVwhLifKbDnBey13dzbugMbYz4aUuLLQk9\nG2rA7UdzntYtg9QlenUVfw/YxWOrFRLLezL6v19QXnna0u9iD8NqJ1UxAoGALw0p\nKShKgCDuSWjPvdacE82fSnW3cjnh9S/ZO0sMJBIe7OUzu819Pq+jh/+jDt3wXVoF\naZaNv/1/DcpSZ5SmkIz8pyTKVXVAujhl8WxO4fQ5+3Iz1YM6YI4MjzaYCxJjfymE\ntKW+0yj+C8SpsAMOWBtDNPhjDEWXvkQFxvGrer0CgYEA9IWFYNdjMM+VdE+CAU1B\n1UTdNkoFOPDNiYagwYy7tpbKFbT7+lEAKRvnIdkhcgb9t+t6NXpmOsD8Oe2wkZpn\nJau2Rgn5JBXIIQ7HTKx6dKADuRuK0G/azybkNhA6UnNZzcz6vWXBLcot9kJ+Rt9t\n6mwipzYQdgagqgax/cnQKpE=\n-----END PRIVATE KEY-----\n",
  "client_email": "firebase-adminsdk-mzlu1@shopping-app-f29b6.iam.gserviceaccount.com",
  "client_id": "112913638387416147139",
  "auth_uri": "https://accounts.google.com/o/oauth2/auth",
  "token_uri": "https://oauth2.googleapis.com/token",
  "auth_provider_x509_cert_url": "https://www.googleapis.com/oauth2/v1/certs",
  "client_x509_cert_url": "https://www.googleapis.com/robot/v1/metadata/x509/firebase-adminsdk-mzlu1%40shopping-app-f29b6.iam.gserviceaccount.com"
}