module example.com/tung-pt/go-lang

go 1.16

require (
	golang.org/x/net v0.0.0-20210614182718-04defd469f4e // indirect
	golang.org/x/sys v0.0.0-20210630005230-0f9fa26af87c // indirect
	google.golang.org/genproto v0.0.0-20210701191553-46259e63a0a9 // indirect
	google.golang.org/grpc v1.39.0
	google.golang.org/protobuf v1.27.1
)
