<svg width="32" height="32" viewBox="0 0 32 32" fill="none" xmlns="http://www.w3.org/2000/svg">
<rect width="32" height="32" rx="12" fill="#0066FF"/>
<path d="M22.6597 13.772C22.9695 11.6981 21.3905 10.5832 19.231 9.83948L19.9324 7.03032L18.2218 6.60423L17.5385 9.33952C17.0894 9.22762 16.6278 9.12133 16.1689 9.01722L16.8547 6.26386L15.1458 5.83777L14.4465 8.64584L10.9973 7.79148L10.5422 9.61817C10.5422 9.61817 11.8111 9.90899 11.7843 9.92707C12.4769 10.1001 12.6025 10.5583 12.5813 10.9217L10.6622 18.6175C10.5774 18.8279 10.3627 19.1433 9.8786 19.0227C9.89575 19.0476 8.63556 18.711 8.63556 18.711L7.7865 20.6714L11.2307 21.541L10.5229 24.3829L12.231 24.809L12.9323 21.9977C13.3998 22.1242 13.8518 22.2411 14.2947 22.3511L13.5962 25.1494L15.3065 25.5755L16.0143 22.739C18.9307 23.2907 21.1238 23.0682 22.0457 20.4325C22.7894 18.309 22.0092 17.0841 20.4747 16.2849C21.5921 16.0262 22.4337 15.2915 22.6583 13.7731L22.6597 13.772ZM18.751 19.2515C18.2211 21.3749 14.6468 20.2274 13.487 19.9391L14.4261 16.1745C15.5853 16.4638 19.3024 17.0367 18.7517 19.2511L18.751 19.2515ZM19.2815 13.7419C18.7993 15.6744 15.8231 14.6926 14.8572 14.4516L15.7075 11.0364C16.6737 11.2776 19.7831 11.7268 19.2803 13.7418" fill="white"/>
</svg>
