<svg width="24" height="25" viewBox="0 0 24 25" fill="none" xmlns="http://www.w3.org/2000/svg">
<path fill-rule="evenodd" clip-rule="evenodd" d="M13.9931 2.62409C14.0482 2.18359 13.8062 1.75952 13.399 1.58275C12.9918 1.40599 12.5168 1.51884 12.2326 1.85987L3.32607 12.5477L3.30317 12.5752C3.14885 12.7603 2.99254 12.9478 2.87874 13.1126C2.77111 13.2684 2.5746 13.5748 2.56853 13.9774C2.56158 14.4384 2.76699 14.877 3.12557 15.1667C3.43878 15.4198 3.79995 15.465 3.98855 15.4821C4.18798 15.5002 4.43206 15.5001 4.67305 15.5001L10.8681 15.5001L10.0086 22.376C9.9535 22.8165 10.1954 23.2406 10.6026 23.4174C11.0099 23.5941 11.4849 23.4813 11.7691 23.1402L20.6986 12.4249C20.8528 12.2398 21.0092 12.0523 21.1229 11.8875C21.2306 11.7317 21.4271 11.4253 21.4331 11.0227C21.4401 10.5617 21.2347 10.1231 20.8761 9.83338C20.5629 9.58027 20.2017 9.53509 20.0131 9.51802C19.8137 9.49996 19.5696 9.50001 19.3286 9.50005L13.1336 9.50006L13.9931 2.62409Z" fill="white"/>
</svg>
