<svg width="24" height="24" viewBox="0 0 24 24" fill="none" xmlns="http://www.w3.org/2000/svg">
<rect width="24" height="24" rx="8" fill="#F93939"/>
<path fill-rule="evenodd" clip-rule="evenodd" d="M8.79699 11.5688L6.44499 12.8056L6.89299 10.1864L4.99219 8.33038L7.62099 7.95118L8.79699 5.56718L9.97139 7.95118L12.6002 8.33038L10.6962 10.1864L11.1474 12.804L8.79699 11.5688ZM14.4002 4.80078H16.0002V6.40078H14.4002V4.80078ZM16.0002 8.00078H17.6002V9.60078H16.0002V8.00078ZM16.0002 11.2008H17.6002V12.8008H16.0002V11.2008ZM14.4002 14.4008H16.0002V16.0008H14.4002V14.4008Z" fill="#FFDA2C"/>
</svg>
