<svg width="32" height="32" viewBox="0 0 32 32" fill="none" xmlns="http://www.w3.org/2000/svg">
<rect width="32" height="32" rx="12" fill="#0066FF"/>
<path d="M18.0749 22.9384V25.2933L15.97 26.5L13.925 25.2933V22.9384L15.97 24.145L18.0749 22.9384ZM6.81244 14.7933L8.85743 16V20.0385L12.3788 22.0917V24.4467L6.81244 21.2451V14.7933ZM25.1276 14.7933V21.2549L19.5014 24.4564V22.1015L23.0227 20.0482V16.0097L25.1276 14.7933ZM19.4914 11.5918L21.5962 12.7984V15.1534L18.0749 17.2067V21.3035L16.0299 22.5102L13.9949 21.3035V17.1969L10.3438 15.1437V12.7887L12.4486 11.582L15.97 13.6353L19.4914 11.5918ZM10.3438 16.8369L12.3888 18.0436V20.3985L10.3438 19.1918V16.8369ZM21.5962 16.8369V19.1918L19.5512 20.3985V18.0436L21.5962 16.8369ZM8.85743 9.53846L10.9623 10.7451L8.85743 11.9518V14.3068L6.81244 13.1001V10.7451L8.85743 9.53846ZM23.0826 9.53846L25.1874 10.7451V13.1001L23.0826 14.3068V11.9518L21.0376 10.7451L23.0826 9.53846ZM15.97 9.53846L18.0749 10.7451L15.97 11.9518L13.925 10.7451L15.97 9.53846ZM15.97 5.5L21.5962 8.70157L19.5512 9.90825L16.0299 7.85496L12.4387 9.90825L10.3937 8.70157L15.97 5.5Z" fill="white"/>
</svg>
