EESchema Schematic File Version 4
EELAYER 30 0
EELAYER END
$Descr A4 11693 8268
encoding utf-8
Sheet 4 6
Title "HX711 load cell measure"
Date "2021-02-15"
Rev "0.1"
Comp ""
Comment1 "Saverio Girardi"
Comment2 "Design by:"
Comment3 ""
Comment4 ""
$EndDescr
$Comp
L Gisa_IC_misc:HX711 U6
U 1 1 602E4073
P 7200 4000
F 0 "U6" H 7200 4575 50  0000 C CNN
F 1 "HX711" H 7200 4484 50  0000 C CNN
F 2 "Package_SO:SOP-16_4.55x10.3mm_P1.27mm" H 6950 4450 50  0001 C CNN
F 3 "https://cdn.sparkfun.com/datasheets/Sensors/ForceFlex/hx711_english.pdf" H 6950 4450 50  0001 C CNN
	1    7200 4000
	1    0    0    -1  
$EndComp
$Comp
L Connector:Conn_01x04_Male J8
U 1 1 602E7718
P 3600 2950
F 0 "J8" H 3708 3231 50  0000 C CNN
F 1 "LOAD_CELL" H 3708 3140 50  0000 C CNN
F 2 "" H 3600 2950 50  0001 C CNN
F 3 "~" H 3600 2950 50  0001 C CNN
	1    3600 2950
	1    0    0    -1  
$EndComp
Text GLabel 3800 2850 2    50   Input ~ 0
EXC+
$Comp
L power:GND #PWR0126
U 1 1 602E8301
P 3850 3200
F 0 "#PWR0126" H 3850 2950 50  0001 C CNN
F 1 "GND" H 3850 3027 50  0000 C CNN
F 2 "" H 3850 3200 50  0001 C CNN
F 3 "" H 3850 3200 50  0001 C CNN
	1    3850 3200
	1    0    0    -1  
$EndComp
Wire Wire Line
	3800 3150 3850 3150
Wire Wire Line
	3850 3150 3850 3200
$Comp
L Device:R_Small R7
U 1 1 602E8829
P 4300 2900
F 0 "R7" V 4104 2900 50  0000 C CNN
F 1 "100" V 4195 2900 50  0000 C CNN
F 2 "" H 4300 2900 50  0001 C CNN
F 3 "~" H 4300 2900 50  0001 C CNN
	1    4300 2900
	0    1    1    0   
$EndComp
$Comp
L Device:R_Small R8
U 1 1 602E96BF
P 4300 3100
F 0 "R8" V 4100 3100 50  0000 C CNN
F 1 "100" V 4200 3100 50  0000 C CNN
F 2 "" H 4300 3100 50  0001 C CNN
F 3 "~" H 4300 3100 50  0001 C CNN
	1    4300 3100
	0    -1   -1   0   
$EndComp
Wire Wire Line
	3800 3050 4150 3050
Wire Wire Line
	4150 3050 4150 3100
Wire Wire Line
	4150 3100 4200 3100
Wire Wire Line
	4200 2900 4150 2900
Wire Wire Line
	4150 2900 4150 2950
Wire Wire Line
	4150 2950 3800 2950
$Comp
L Device:C_Small C19
U 1 1 602EAAA5
P 4550 3000
F 0 "C19" H 4642 3046 50  0000 L CNN
F 1 "100n" H 4642 2955 50  0000 L CNN
F 2 "" H 4550 3000 50  0001 C CNN
F 3 "~" H 4550 3000 50  0001 C CNN
	1    4550 3000
	1    0    0    -1  
$EndComp
Text GLabel 4900 2900 2    50   Input ~ 0
CELL_SIG+
Text GLabel 4900 3100 2    50   Input ~ 0
CELL_SIG+
Wire Wire Line
	6700 3750 6800 3750
Text GLabel 6800 3950 0    50   Input ~ 0
VFB
Wire Wire Line
	6800 3850 6550 3850
Wire Wire Line
	6550 3850 6550 3950
Text GLabel 6300 3950 0    50   Input ~ 0
EXC+
Text GLabel 6800 4250 0    50   Input ~ 0
CELL_SIG+
Text GLabel 6800 4350 0    50   Input ~ 0
CELL_SIG+
Text GLabel 6800 4150 0    50   Input ~ 0
VBG
Text GLabel 1100 7400 0    50   Input ~ 0
GND
$Comp
L power:GND #PWR0127
U 1 1 602EE3E5
P 1150 7450
F 0 "#PWR0127" H 1150 7200 50  0001 C CNN
F 1 "GND" H 1150 7277 50  0000 C CNN
F 2 "" H 1150 7450 50  0001 C CNN
F 3 "" H 1150 7450 50  0001 C CNN
	1    1150 7450
	1    0    0    -1  
$EndComp
Text HLabel 1200 7400 2    50   Input ~ 0
GND
Wire Wire Line
	1100 7400 1150 7400
Wire Wire Line
	1150 7400 1150 7450
Wire Wire Line
	1150 7400 1200 7400
Connection ~ 1150 7400
Text GLabel 6800 4050 0    50   Input ~ 0
GND
$Comp
L power:+3V3 #PWR0128
U 1 1 602EF180
P 1700 7350
F 0 "#PWR0128" H 1700 7200 50  0001 C CNN
F 1 "+3V3" H 1715 7523 50  0000 C CNN
F 2 "" H 1700 7350 50  0001 C CNN
F 3 "" H 1700 7350 50  0001 C CNN
	1    1700 7350
	1    0    0    -1  
$EndComp
Text HLabel 1750 7400 2    50   Input ~ 0
3V3
Wire Wire Line
	1700 7350 1700 7400
Wire Wire Line
	1700 7400 1750 7400
$Comp
L power:+3V3 #PWR0129
U 1 1 602F081B
P 7650 3350
F 0 "#PWR0129" H 7650 3200 50  0001 C CNN
F 1 "+3V3" H 7665 3523 50  0000 C CNN
F 2 "" H 7650 3350 50  0001 C CNN
F 3 "" H 7650 3350 50  0001 C CNN
	1    7650 3350
	1    0    0    -1  
$EndComp
Wire Wire Line
	6400 3550 6400 3350
Wire Wire Line
	6400 3350 6750 3350
Wire Wire Line
	7650 3350 7650 3650
Wire Wire Line
	7650 3650 7600 3650
Wire Wire Line
	6800 3650 6750 3650
Wire Wire Line
	6750 3650 6750 3350
Connection ~ 6750 3350
Wire Wire Line
	6750 3350 7650 3350
Connection ~ 7650 3350
Text HLabel 7600 4050 2    50   Input ~ 0
CELL_DO
Text HLabel 7600 4150 2    50   Input ~ 0
CELL_SCK
Wire Wire Line
	7600 3850 7650 3850
Wire Wire Line
	7650 3850 7650 3800
Wire Wire Line
	7650 3750 7600 3750
Text GLabel 7700 3800 2    50   Input ~ 0
GND
Wire Wire Line
	7650 3800 7700 3800
Connection ~ 7650 3800
Wire Wire Line
	7650 3800 7650 3750
NoConn ~ 7600 3950
NoConn ~ 7600 4250
NoConn ~ 7600 4350
Text GLabel 3750 4250 0    50   Input ~ 0
EXC+
Wire Wire Line
	4400 2900 4550 2900
Wire Wire Line
	4400 3100 4550 3100
Connection ~ 4550 2900
Wire Wire Line
	4550 2900 4900 2900
Connection ~ 4550 3100
Wire Wire Line
	4550 3100 4900 3100
$Comp
L Device:C_Small C17
U 1 1 602F5910
P 3800 4400
F 0 "C17" H 3892 4446 50  0000 L CNN
F 1 "10u" H 3892 4355 50  0000 L CNN
F 2 "" H 3800 4400 50  0001 C CNN
F 3 "~" H 3800 4400 50  0001 C CNN
	1    3800 4400
	1    0    0    -1  
$EndComp
$Comp
L power:GND #PWR0130
U 1 1 602F64EE
P 3800 4550
F 0 "#PWR0130" H 3800 4300 50  0001 C CNN
F 1 "GND" H 3800 4377 50  0000 C CNN
F 2 "" H 3800 4550 50  0001 C CNN
F 3 "" H 3800 4550 50  0001 C CNN
	1    3800 4550
	1    0    0    -1  
$EndComp
Wire Wire Line
	3800 4500 3800 4550
Wire Wire Line
	3800 4300 3800 4250
Wire Wire Line
	3800 4250 3750 4250
Text GLabel 4300 4250 0    50   Input ~ 0
VBG
$Comp
L Device:C_Small C18
U 1 1 602F762E
P 4350 4400
F 0 "C18" H 4442 4446 50  0000 L CNN
F 1 "100n" H 4442 4355 50  0000 L CNN
F 2 "" H 4350 4400 50  0001 C CNN
F 3 "~" H 4350 4400 50  0001 C CNN
	1    4350 4400
	1    0    0    -1  
$EndComp
$Comp
L power:GND #PWR0131
U 1 1 602F7A31
P 4350 4550
F 0 "#PWR0131" H 4350 4300 50  0001 C CNN
F 1 "GND" H 4350 4377 50  0000 C CNN
F 2 "" H 4350 4550 50  0001 C CNN
F 3 "" H 4350 4550 50  0001 C CNN
	1    4350 4550
	1    0    0    -1  
$EndComp
Wire Wire Line
	4350 4500 4350 4550
Wire Wire Line
	4350 4300 4350 4250
Wire Wire Line
	4350 4250 4300 4250
$Comp
L Device:R_Small R9
U 1 1 602F8D0E
P 5150 4350
F 0 "R9" H 5209 4396 50  0000 L CNN
F 1 "12k" H 5209 4305 50  0000 L CNN
F 2 "" H 5150 4350 50  0001 C CNN
F 3 "~" H 5150 4350 50  0001 C CNN
	1    5150 4350
	1    0    0    -1  
$EndComp
$Comp
L Device:R_Small R10
U 1 1 602F940D
P 5150 4650
F 0 "R10" H 5209 4696 50  0000 L CNN
F 1 "8k2" H 5209 4605 50  0000 L CNN
F 2 "" H 5150 4650 50  0001 C CNN
F 3 "~" H 5150 4650 50  0001 C CNN
	1    5150 4650
	1    0    0    -1  
$EndComp
Text GLabel 5100 4200 0    50   Input ~ 0
EXC+
Wire Wire Line
	5100 4200 5150 4200
Wire Wire Line
	5150 4200 5150 4250
Wire Wire Line
	5150 4450 5150 4500
$Comp
L power:GND #PWR0132
U 1 1 602FA964
P 5150 4800
F 0 "#PWR0132" H 5150 4550 50  0001 C CNN
F 1 "GND" H 5150 4627 50  0000 C CNN
F 2 "" H 5150 4800 50  0001 C CNN
F 3 "" H 5150 4800 50  0001 C CNN
	1    5150 4800
	1    0    0    -1  
$EndComp
Wire Wire Line
	5150 4750 5150 4800
Text GLabel 5100 4500 0    50   Input ~ 0
VFB
Wire Wire Line
	5100 4500 5150 4500
Connection ~ 5150 4500
Wire Wire Line
	5150 4500 5150 4550
Wire Wire Line
	6300 3950 6400 3950
$Comp
L Transistor_BJT:S8550 Q1
U 1 1 602FC3FE
P 6500 3750
F 0 "Q1" H 6691 3704 50  0000 L CNN
F 1 "S8550" H 6691 3795 50  0000 L CNN
F 2 "Package_TO_SOT_THT:TO-92_Inline" H 6700 3675 50  0001 L CIN
F 3 "http://www.unisonic.com.tw/datasheet/S8550.pdf" H 6500 3750 50  0001 L CNN
	1    6500 3750
	-1   0    0    1   
$EndComp
Connection ~ 6400 3950
Wire Wire Line
	6400 3950 6550 3950
Text Notes 4700 5150 0    50   ~ 0
NOTA:\nVerificare questo partitore!!
$EndSCHEMATC
