EESchema Schematic File Version 4
EELAYER 30 0
EELAYER END
$Descr A4 11693 8268
encoding utf-8
Sheet 6 6
Title "SIM7020 LTE NB IoT module"
Date "2021-04-09"
Rev "0.1"
Comp "Gisa corp."
Comment1 "Saverio Girardi"
Comment2 "Design by:"
Comment3 ""
Comment4 ""
$EndDescr
$Comp
L Connector:SIM_Card J?
U 1 1 6070D68A
P 8100 5500
F 0 "J?" H 8730 5600 50  0000 L CNN
F 1 "SIM_Card" H 8730 5509 50  0000 L CNN
F 2 "" H 8100 5850 50  0001 C CNN
F 3 " ~" H 8050 5500 50  0001 C CNN
	1    8100 5500
	1    0    0    -1  
$EndComp
$Comp
L power:GND #PWR?
U 1 1 6070DC52
P 5700 3600
F 0 "#PWR?" H 5700 3350 50  0001 C CNN
F 1 "GND" H 5700 3427 50  0000 C CNN
F 2 "" H 5700 3600 50  0001 C CNN
F 3 "" H 5700 3600 50  0001 C CNN
	1    5700 3600
	1    0    0    -1  
$EndComp
$Comp
L Device:C_Small C?
U 1 1 60710F37
P 9450 5350
F 0 "C?" H 9542 5396 50  0000 L CNN
F 1 "C_Small" H 9542 5305 50  0000 L CNN
F 2 "" H 9450 5350 50  0001 C CNN
F 3 "~" H 9450 5350 50  0001 C CNN
	1    9450 5350
	1    0    0    -1  
$EndComp
$Comp
L power:GND #PWR?
U 1 1 60711327
P 9450 5550
F 0 "#PWR?" H 9450 5300 50  0001 C CNN
F 1 "GND" H 9450 5377 50  0000 C CNN
F 2 "" H 9450 5550 50  0001 C CNN
F 3 "" H 9450 5550 50  0001 C CNN
	1    9450 5550
	1    0    0    -1  
$EndComp
Text GLabel 7600 5200 0    50   Input ~ 0
SIM_VCC
$Comp
L Gisa_passives:Rarray_4 R?
U 1 1 607172F4
P 6950 5450
F 0 "R?" H 6900 5700 50  0000 C CNN
F 1 "33R" H 6950 5200 50  0000 C CNN
F 2 "" H 7600 5650 50  0001 C CNN
F 3 "" H 6950 5450 50  0001 C CNN
	1    6950 5450
	1    0    0    -1  
$EndComp
Text Notes 6750 5800 0    50   ~ 0
 C25501
Text GLabel 7600 5500 0    50   Input ~ 0
GND
Wire Wire Line
	7150 5300 7600 5300
Wire Wire Line
	7600 5400 7150 5400
NoConn ~ 7600 5600
Wire Wire Line
	7600 5700 7300 5700
Wire Wire Line
	7300 5700 7300 5500
Wire Wire Line
	7300 5500 7150 5500
NoConn ~ 7150 5600
Text GLabel 9400 5200 0    50   Input ~ 0
SIM_VCC
Text GLabel 9400 5500 0    50   Input ~ 0
GND
Wire Wire Line
	9400 5500 9450 5500
Wire Wire Line
	9450 5500 9450 5450
Wire Wire Line
	9450 5550 9450 5500
Connection ~ 9450 5500
Wire Wire Line
	9450 5250 9450 5200
Wire Wire Line
	9450 5200 9400 5200
$Comp
L Device:C_Small C?
U 1 1 60719556
P 6450 5650
F 0 "C?" H 6542 5696 50  0000 L CNN
F 1 "22p" H 6542 5605 50  0000 L CNN
F 2 "" H 6450 5650 50  0001 C CNN
F 3 "~" H 6450 5650 50  0001 C CNN
	1    6450 5650
	1    0    0    -1  
$EndComp
$Comp
L Device:C_Small C?
U 1 1 60719CA0
P 6150 5650
F 0 "C?" H 6242 5696 50  0000 L CNN
F 1 "22p" H 6242 5605 50  0000 L CNN
F 2 "" H 6150 5650 50  0001 C CNN
F 3 "~" H 6150 5650 50  0001 C CNN
	1    6150 5650
	1    0    0    -1  
$EndComp
$Comp
L Device:C_Small C?
U 1 1 6071A0D2
P 5850 5650
F 0 "C?" H 5942 5696 50  0000 L CNN
F 1 "22p" H 5942 5605 50  0000 L CNN
F 2 "" H 5850 5650 50  0001 C CNN
F 3 "~" H 5850 5650 50  0001 C CNN
	1    5850 5650
	1    0    0    -1  
$EndComp
Wire Wire Line
	6450 5550 6450 5500
Wire Wire Line
	6450 5500 6750 5500
Wire Wire Line
	6750 5400 6150 5400
Wire Wire Line
	6150 5400 6150 5550
Wire Wire Line
	6750 5300 5850 5300
Wire Wire Line
	5850 5300 5850 5550
Wire Wire Line
	5850 5750 5850 5800
Wire Wire Line
	5850 5800 6150 5800
Wire Wire Line
	6150 5800 6150 5750
Wire Wire Line
	6150 5800 6450 5800
Wire Wire Line
	6450 5800 6450 5750
Connection ~ 6150 5800
$Comp
L power:GND #PWR?
U 1 1 6071B904
P 6150 5850
F 0 "#PWR?" H 6150 5600 50  0001 C CNN
F 1 "GND" H 6150 5677 50  0000 C CNN
F 2 "" H 6150 5850 50  0001 C CNN
F 3 "" H 6150 5850 50  0001 C CNN
	1    6150 5850
	1    0    0    -1  
$EndComp
Wire Wire Line
	6150 5850 6150 5800
NoConn ~ 6750 5600
Wire Wire Line
	5850 5300 5750 5300
Connection ~ 5850 5300
Wire Wire Line
	6150 5400 5750 5400
Connection ~ 6150 5400
Wire Wire Line
	6450 5500 5750 5500
Connection ~ 6450 5500
Text GLabel 5750 5300 0    50   Input ~ 0
SIM_RST
Text GLabel 5750 5400 0    50   Input ~ 0
SIM_CLK
Text GLabel 5750 5500 0    50   Input ~ 0
SIM_DATA
NoConn ~ 6650 1750
Text GLabel 6650 2050 2    50   Input ~ 0
SIM_RST
Text GLabel 6650 1950 2    50   Input ~ 0
SIM_CLK
Text GLabel 6650 1850 2    50   Input ~ 0
SIM_DATA
Text GLabel 6650 2150 2    50   Input ~ 0
SIM_VCC
Text GLabel 5650 1350 1    50   Input ~ 0
3V3
$Comp
L Gisa_modules:SIM7020E U?
U 1 1 60738D05
P 5850 2450
F 0 "U?" H 5200 3500 50  0000 C CNN
F 1 "SIM7020E" H 6350 3500 50  0000 C CNN
F 2 "RF_GSM:SIMCom_SIM800C" H 4900 3650 50  0001 C CNN
F 3 "https://simcom.ee/documents/SIM7020/SIM7020%20Hardware%20Design_V1.01.pdf" H 1200 100 50  0001 C CNN
	1    5850 2450
	1    0    0    -1  
$EndComp
Wire Wire Line
	5300 3550 5300 3600
Wire Wire Line
	5300 3600 5400 3600
Wire Wire Line
	6200 3600 6200 3550
Wire Wire Line
	6100 3550 6100 3600
Connection ~ 6100 3600
Wire Wire Line
	6100 3600 6200 3600
Wire Wire Line
	6000 3550 6000 3600
Connection ~ 6000 3600
Wire Wire Line
	6000 3600 6100 3600
Wire Wire Line
	5900 3550 5900 3600
Connection ~ 5900 3600
Wire Wire Line
	5900 3600 6000 3600
Wire Wire Line
	5800 3550 5800 3600
Connection ~ 5800 3600
Wire Wire Line
	5800 3600 5900 3600
Wire Wire Line
	5700 3550 5700 3600
Connection ~ 5700 3600
Wire Wire Line
	5700 3600 5800 3600
Wire Wire Line
	5600 3550 5600 3600
Connection ~ 5600 3600
Wire Wire Line
	5600 3600 5700 3600
Wire Wire Line
	5500 3550 5500 3600
Connection ~ 5500 3600
Wire Wire Line
	5500 3600 5600 3600
Wire Wire Line
	5400 3550 5400 3600
Connection ~ 5400 3600
Wire Wire Line
	5400 3600 5500 3600
Wire Wire Line
	5850 1350 5850 1300
Wire Wire Line
	5850 1300 5950 1300
Wire Wire Line
	5950 1300 5950 1350
Wire Wire Line
	5950 1300 5950 1250
Connection ~ 5950 1300
Text GLabel 5950 1250 1    50   Input ~ 0
VBAT
Text GLabel 6150 1350 1    50   Input ~ 0
VDD_EXT
Text HLabel 6650 2500 2    50   Input ~ 0
USB_D+
Text HLabel 6650 2400 2    50   Input ~ 0
USB_D-
Text HLabel 6650 2600 2    50   Input ~ 0
USB_VBUS
Text HLabel 6650 3250 2    50   Input ~ 0
ADC
$Comp
L Device:LED_Small D?
U 1 1 607499CE
P 10850 5550
F 0 "D?" V 10896 5482 50  0000 R CNN
F 1 "RED" V 10805 5482 50  0000 R CNN
F 2 "" V 10850 5550 50  0001 C CNN
F 3 "~" V 10850 5550 50  0001 C CNN
	1    10850 5550
	0    -1   -1   0   
$EndComp
$Comp
L Device:R_Small R?
U 1 1 6074A964
P 10850 5350
F 0 "R?" H 10909 5396 50  0000 L CNN
F 1 "51" H 10909 5305 50  0000 L CNN
F 2 "" H 10850 5350 50  0001 C CNN
F 3 "~" H 10850 5350 50  0001 C CNN
	1    10850 5350
	1    0    0    -1  
$EndComp
$Comp
L power:GND #PWR?
U 1 1 6074BD15
P 10850 5650
F 0 "#PWR?" H 10850 5400 50  0001 C CNN
F 1 "GND" H 10850 5477 50  0000 C CNN
F 2 "" H 10850 5650 50  0001 C CNN
F 3 "" H 10850 5650 50  0001 C CNN
	1    10850 5650
	1    0    0    -1  
$EndComp
Text HLabel 6650 3000 2    50   Input ~ 0
STATUS
Text HLabel 6650 2750 2    50   Input ~ 0
GPIO0
Text HLabel 6650 2850 2    50   Input ~ 0
GPIO1
Text GLabel 6350 6750 0    50   Input ~ 0
3V3
Text GLabel 6350 7150 0    50   Input ~ 0
VBAT
Text GLabel 6350 6950 0    50   Input ~ 0
VDD_EXT
Text GLabel 5600 6750 0    50   Input ~ 0
GND
$Comp
L power:GND #PWR?
U 1 1 6074EA51
P 5650 6800
F 0 "#PWR?" H 5650 6550 50  0001 C CNN
F 1 "GND" H 5650 6627 50  0000 C CNN
F 2 "" H 5650 6800 50  0001 C CNN
F 3 "" H 5650 6800 50  0001 C CNN
	1    5650 6800
	1    0    0    -1  
$EndComp
Text HLabel 5050 2000 0    50   Input ~ 0
UART1_TXD
Text HLabel 5050 2100 0    50   Input ~ 0
UART1_RXD
Text HLabel 5050 2200 0    50   Input ~ 0
UART1_RTS
Text HLabel 5050 2300 0    50   Input ~ 0
UART1_CTS
Text HLabel 5050 2400 0    50   Input ~ 0
UART1_DCD
Text HLabel 5050 2500 0    50   Input ~ 0
UART1_DTR
Text HLabel 5050 2600 0    50   Input ~ 0
UART1_RI
Text HLabel 5050 2800 0    50   Input ~ 0
UART2_TXD
Text HLabel 5050 2900 0    50   Input ~ 0
UART2_RXD
Text HLabel 5050 3100 0    50   Input ~ 0
RTC_EINT
Text HLabel 5050 3200 0    50   Input ~ 0
RTC_GPIO0
Text HLabel 6450 6750 2    50   Input ~ 0
3V3
Wire Wire Line
	6350 6750 6450 6750
$Comp
L Device:C_Small C?
U 1 1 607584ED
P 6400 7300
F 0 "C?" H 6492 7346 50  0000 L CNN
F 1 "10u" H 6492 7255 50  0000 L CNN
F 2 "" H 6400 7300 50  0001 C CNN
F 3 "~" H 6400 7300 50  0001 C CNN
	1    6400 7300
	1    0    0    -1  
$EndComp
$Comp
L power:GND #PWR?
U 1 1 607588A8
P 6400 7450
F 0 "#PWR?" H 6400 7200 50  0001 C CNN
F 1 "GND" H 6400 7277 50  0000 C CNN
F 2 "" H 6400 7450 50  0001 C CNN
F 3 "" H 6400 7450 50  0001 C CNN
	1    6400 7450
	1    0    0    -1  
$EndComp
Wire Wire Line
	6400 7400 6400 7450
Wire Wire Line
	6400 7200 6400 7150
Wire Wire Line
	6400 7150 6350 7150
Wire Wire Line
	5600 6750 5650 6750
Wire Wire Line
	5650 6750 5650 6800
Text HLabel 6450 6950 2    50   Input ~ 0
VDD_EXT
Wire Wire Line
	6350 6950 6450 6950
Text HLabel 6450 7150 2    50   Input ~ 0
VBAT
Wire Wire Line
	6400 7150 6450 7150
Connection ~ 6400 7150
Wire Notes Line
	6950 6550 5250 6550
Text Notes 5300 7750 0    50   ~ 0
Power port
Text Notes 5300 6500 0    50   ~ 0
Sim card
$Comp
L Gisa_connectors:LTE_Antenna_VTH U?
U 1 1 6077B6F7
P 3400 5200
F 0 "U?" H 3650 5150 50  0000 L CNN
F 1 "LTE_Antenna_VTH" H 3200 5600 50  0000 L CNN
F 2 "" H 3400 5200 50  0001 C CNN
F 3 "" H 3400 5200 50  0001 C CNN
	1    3400 5200
	1    0    0    -1  
$EndComp
$Comp
L power:GND #PWR?
U 1 1 6077E23E
P 3450 5350
F 0 "#PWR?" H 3450 5100 50  0001 C CNN
F 1 "GND" H 3450 5177 50  0000 C CNN
F 2 "" H 3450 5350 50  0001 C CNN
F 3 "" H 3450 5350 50  0001 C CNN
	1    3450 5350
	1    0    0    -1  
$EndComp
Wire Wire Line
	3300 5350 3300 5300
Wire Wire Line
	3300 5350 3400 5350
Wire Wire Line
	3600 5350 3600 5300
Connection ~ 3450 5350
Wire Wire Line
	3450 5350 3500 5350
Wire Wire Line
	3500 5300 3500 5350
Connection ~ 3500 5350
Wire Wire Line
	3500 5350 3600 5350
Wire Wire Line
	3400 5300 3400 5350
Connection ~ 3400 5350
Wire Wire Line
	3400 5350 3450 5350
$Comp
L Device:R_Small R?
U 1 1 607863AD
P 2600 4950
F 0 "R?" V 2404 4950 50  0000 C CNN
F 1 "0" V 2495 4950 50  0000 C CNN
F 2 "" H 2600 4950 50  0001 C CNN
F 3 "~" H 2600 4950 50  0001 C CNN
	1    2600 4950
	0    1    1    0   
$EndComp
$Comp
L Device:C_Small C?
U 1 1 60786FBE
P 2800 5100
F 0 "C?" H 2892 5146 50  0000 L CNN
F 1 "NC" H 2892 5055 50  0000 L CNN
F 2 "" H 2800 5100 50  0001 C CNN
F 3 "~" H 2800 5100 50  0001 C CNN
	1    2800 5100
	1    0    0    -1  
$EndComp
$Comp
L Device:C_Small C?
U 1 1 60788BC7
P 2400 5100
F 0 "C?" H 2492 5146 50  0000 L CNN
F 1 "NC" H 2492 5055 50  0000 L CNN
F 2 "" H 2400 5100 50  0001 C CNN
F 3 "~" H 2400 5100 50  0001 C CNN
	1    2400 5100
	1    0    0    -1  
$EndComp
Wire Wire Line
	2400 5000 2400 4950
Wire Wire Line
	2400 4950 2500 4950
Wire Wire Line
	2700 4950 2800 4950
Wire Wire Line
	2800 5000 2800 4950
Connection ~ 2800 4950
Wire Wire Line
	2800 4950 3100 4950
Wire Wire Line
	2400 4950 2300 4950
Connection ~ 2400 4950
$Comp
L power:GND #PWR?
U 1 1 6078FC2C
P 2800 5200
F 0 "#PWR?" H 2800 4950 50  0001 C CNN
F 1 "GND" H 2800 5027 50  0000 C CNN
F 2 "" H 2800 5200 50  0001 C CNN
F 3 "" H 2800 5200 50  0001 C CNN
	1    2800 5200
	1    0    0    -1  
$EndComp
$Comp
L power:GND #PWR?
U 1 1 60790050
P 2400 5200
F 0 "#PWR?" H 2400 4950 50  0001 C CNN
F 1 "GND" H 2400 5027 50  0000 C CNN
F 2 "" H 2400 5200 50  0001 C CNN
F 3 "" H 2400 5200 50  0001 C CNN
	1    2400 5200
	1    0    0    -1  
$EndComp
Text GLabel 2300 4950 0    50   Input ~ 0
ANTENNA
Text GLabel 6650 1550 2    50   Input ~ 0
ANTENNA
$Comp
L Switch:SW_Push_Dual SW?
U 1 1 607961FB
P 2600 6350
F 0 "SW?" H 2600 6635 50  0000 C CNN
F 1 "PWR_BTN" H 2600 6544 50  0000 C CNN
F 2 "" H 2600 6550 50  0001 C CNN
F 3 "~" H 2600 6550 50  0001 C CNN
	1    2600 6350
	1    0    0    -1  
$EndComp
$Comp
L Device:C_Small C?
U 1 1 60796DDB
P 2600 6800
F 0 "C?" V 2350 6800 50  0000 C CNN
F 1 "100n" V 2450 6800 50  0000 C CNN
F 2 "" H 2600 6800 50  0001 C CNN
F 3 "~" H 2600 6800 50  0001 C CNN
	1    2600 6800
	0    -1   -1   0   
$EndComp
Wire Wire Line
	2400 6550 2400 6800
Wire Wire Line
	2400 6800 2500 6800
Wire Wire Line
	2400 6350 2400 6550
Connection ~ 2400 6550
Wire Wire Line
	2800 6350 2800 6550
Wire Wire Line
	2800 6550 2800 6800
Wire Wire Line
	2800 6800 2700 6800
Connection ~ 2800 6550
$Comp
L power:GND #PWR?
U 1 1 6079F4C0
P 2800 6800
F 0 "#PWR?" H 2800 6550 50  0001 C CNN
F 1 "GND" H 2800 6627 50  0000 C CNN
F 2 "" H 2800 6800 50  0001 C CNN
F 3 "" H 2800 6800 50  0001 C CNN
	1    2800 6800
	1    0    0    -1  
$EndComp
Text GLabel 5050 1700 0    50   Input ~ 0
PWRKEY
$Comp
L Device:Q_NPN_BEC Q?
U 1 1 607A0391
P 1800 6850
F 0 "Q?" H 1991 6896 50  0000 L CNN
F 1 "Q_NPN_BEC" H 1991 6805 50  0000 L CNN
F 2 "" H 2000 6950 50  0001 C CNN
F 3 "~" H 1800 6850 50  0001 C CNN
	1    1800 6850
	1    0    0    -1  
$EndComp
Text Notes 2000 7050 0    50   ~ 0
C2150
$Comp
L Device:R_Small R?
U 1 1 607A1BBE
P 1500 7050
F 0 "R?" H 1559 7096 50  0000 L CNN
F 1 "47k" H 1559 7005 50  0000 L CNN
F 2 "" H 1500 7050 50  0001 C CNN
F 3 "~" H 1500 7050 50  0001 C CNN
	1    1500 7050
	1    0    0    -1  
$EndComp
$Comp
L Device:R_Small R?
U 1 1 607A2849
P 1300 6850
F 0 "R?" V 1104 6850 50  0000 C CNN
F 1 "4k7" V 1195 6850 50  0000 C CNN
F 2 "" H 1300 6850 50  0001 C CNN
F 3 "~" H 1300 6850 50  0001 C CNN
	1    1300 6850
	0    1    1    0   
$EndComp
Wire Wire Line
	1400 6850 1500 6850
Wire Wire Line
	1500 6850 1500 6950
Wire Wire Line
	1500 6850 1600 6850
Connection ~ 1500 6850
Wire Wire Line
	1900 7050 1900 7250
Wire Wire Line
	1900 7250 1500 7250
Wire Wire Line
	1500 7250 1500 7150
$Comp
L power:GND #PWR?
U 1 1 607B13B1
P 1500 7250
F 0 "#PWR?" H 1500 7000 50  0001 C CNN
F 1 "GND" H 1500 7077 50  0000 C CNN
F 2 "" H 1500 7250 50  0001 C CNN
F 3 "" H 1500 7250 50  0001 C CNN
	1    1500 7250
	1    0    0    -1  
$EndComp
Connection ~ 1500 7250
Text HLabel 1200 6850 0    50   Input ~ 0
PWR
Connection ~ 2800 6800
Wire Wire Line
	1900 6650 1900 6550
Text GLabel 1900 6400 0    50   Input ~ 0
PWRKEY
Wire Wire Line
	1900 6550 1900 6400
Connection ~ 1900 6550
Wire Wire Line
	1900 6550 2400 6550
Text GLabel 6650 3100 2    50   Input ~ 0
NLED
Text GLabel 10900 5150 2    50   Input ~ 0
NLED
Wire Wire Line
	10900 5150 10850 5150
Wire Wire Line
	10850 5150 10850 5250
Text GLabel 10300 5150 0    50   Input ~ 0
VBAT
$Comp
L Device:LED_Small D?
U 1 1 607DC59B
P 10400 5550
F 0 "D?" V 10446 5482 50  0000 R CNN
F 1 "RED" V 10355 5482 50  0000 R CNN
F 2 "" V 10400 5550 50  0001 C CNN
F 3 "~" V 10400 5550 50  0001 C CNN
	1    10400 5550
	0    -1   -1   0   
$EndComp
$Comp
L Device:R_Small R?
U 1 1 607DC5A1
P 10400 5350
F 0 "R?" H 10459 5396 50  0000 L CNN
F 1 "51" H 10459 5305 50  0000 L CNN
F 2 "" H 10400 5350 50  0001 C CNN
F 3 "~" H 10400 5350 50  0001 C CNN
	1    10400 5350
	1    0    0    -1  
$EndComp
Wire Wire Line
	10400 5150 10400 5250
$Comp
L power:GND #PWR?
U 1 1 607DED4F
P 10400 5650
F 0 "#PWR?" H 10400 5400 50  0001 C CNN
F 1 "GND" H 10400 5477 50  0000 C CNN
F 2 "" H 10400 5650 50  0001 C CNN
F 3 "" H 10400 5650 50  0001 C CNN
	1    10400 5650
	1    0    0    -1  
$EndComp
Wire Wire Line
	10300 5150 10400 5150
Text Notes 10000 6500 0    50   ~ 0
Led indicators
$Comp
L Device:Q_NPN_BEC Q?
U 1 1 607F1888
P 4450 6850
F 0 "Q?" H 4641 6896 50  0000 L CNN
F 1 "Q_NPN_BEC" H 4641 6805 50  0000 L CNN
F 2 "" H 4650 6950 50  0001 C CNN
F 3 "~" H 4450 6850 50  0001 C CNN
	1    4450 6850
	1    0    0    -1  
$EndComp
Text Notes 4650 7050 0    50   ~ 0
C2150
$Comp
L Device:R_Small R?
U 1 1 607F1893
P 4150 7050
F 0 "R?" H 4209 7096 50  0000 L CNN
F 1 "47k" H 4209 7005 50  0000 L CNN
F 2 "" H 4150 7050 50  0001 C CNN
F 3 "~" H 4150 7050 50  0001 C CNN
	1    4150 7050
	1    0    0    -1  
$EndComp
$Comp
L Device:R_Small R?
U 1 1 607F189D
P 3950 6850
F 0 "R?" V 3754 6850 50  0000 C CNN
F 1 "4k7" V 3845 6850 50  0000 C CNN
F 2 "" H 3950 6850 50  0001 C CNN
F 3 "~" H 3950 6850 50  0001 C CNN
	1    3950 6850
	0    1    1    0   
$EndComp
Wire Wire Line
	4050 6850 4150 6850
Wire Wire Line
	4150 6850 4150 6950
Wire Wire Line
	4150 6850 4250 6850
Connection ~ 4150 6850
Wire Wire Line
	4550 7050 4550 7250
Wire Wire Line
	4550 7250 4150 7250
Wire Wire Line
	4150 7250 4150 7150
$Comp
L power:GND #PWR?
U 1 1 607F18AE
P 4150 7250
F 0 "#PWR?" H 4150 7000 50  0001 C CNN
F 1 "GND" H 4150 7077 50  0000 C CNN
F 2 "" H 4150 7250 50  0001 C CNN
F 3 "" H 4150 7250 50  0001 C CNN
	1    4150 7250
	1    0    0    -1  
$EndComp
Connection ~ 4150 7250
Wire Wire Line
	4550 6400 4550 6650
Text HLabel 3850 6850 0    50   Input ~ 0
RST
Text GLabel 4500 6400 0    50   Input ~ 0
RESET
Wire Wire Line
	4500 6400 4550 6400
Text GLabel 5050 1600 0    50   Input ~ 0
RESET
Wire Notes Line
	5250 5850 500  5850
Wire Notes Line
	500  4400 11200 4400
Text Notes 500  7750 0    50   ~ 0
Power and reset
Text Notes 500  5800 0    50   ~ 0
Antenna
Wire Notes Line
	5250 4400 5250 7800
Wire Notes Line
	9950 4400 9950 6500
Text HLabel 5700 6750 2    50   Input ~ 0
GND
Wire Wire Line
	5650 6750 5700 6750
Connection ~ 5650 6750
$EndSCHEMATC
