(footprint "MODULE_MDBT40-256RV3" (version 20221018) (generator pcbnew)
  (layer "F.Cu")
  (attr smd)
  (fp_text reference "REF**" (at -0.555 -10.289) (layer "F.SilkS")
      (effects (font (size 1.4 1.4) (thickness 0.15)))
    (tstamp c68785c8-4ad3-4ad1-80a5-0a5177af1f6b)
  )
  (fp_text value "MODULE_MDBT40-256RV3" (at 12.78 10.511) (layer "F.Fab")
      (effects (font (size 1.4 1.4) (thickness 0.15)))
    (tstamp 9d881a91-2965-44b6-96a0-6e9729a377b0)
  )
  (fp_line (start -5 -9) (end 5 -9)
    (stroke (width 0.127) (type solid)) (layer "F.SilkS") (tstamp e1b62eff-274e-4420-9754-4f16b2bfd9d1))
  (fp_line (start -5 -4.52) (end -5 -9)
    (stroke (width 0.127) (type solid)) (layer "F.SilkS") (tstamp d5b20c2c-dae5-4b8d-ab74-977c1b7e9bba))
  (fp_line (start -5 -2.78) (end -5 0.38)
    (stroke (width 0.127) (type solid)) (layer "F.SilkS") (tstamp 677187a5-2a05-4fca-a531-7ceb3b4f378e))
  (fp_line (start -5 7.72) (end -5 9)
    (stroke (width 0.127) (type solid)) (layer "F.SilkS") (tstamp 0c0a5993-c19c-4757-8e9d-9a9bc5c47626))
  (fp_line (start 5 -9) (end 5 -4.52)
    (stroke (width 0.127) (type solid)) (layer "F.SilkS") (tstamp 8df42bff-d084-42d2-8644-b89b62fa2850))
  (fp_line (start 5 9) (end 5 7.72)
    (stroke (width 0.127) (type solid)) (layer "F.SilkS") (tstamp 92dac8a4-88bb-4f93-9af6-7accfb295c9f))
  (fp_circle (center -5.9 -4) (end -5.8 -4)
    (stroke (width 0.2) (type solid)) (fill none) (layer "F.SilkS") (tstamp 219c2083-32f8-4290-8d1e-d360c1f28921))
  (fp_line (start -5.55 -9.25) (end 5.55 -9.25)
    (stroke (width 0.05) (type solid)) (layer "F.CrtYd") (tstamp 8badc0d0-8a19-4e89-a9d4-870b92b9b3bc))
  (fp_line (start -5.55 9.55) (end -5.55 -9.25)
    (stroke (width 0.05) (type solid)) (layer "F.CrtYd") (tstamp 66cc67dc-c847-4738-8e08-49bd64cb41a5))
  (fp_line (start 5.55 -9.25) (end 5.55 9.55)
    (stroke (width 0.05) (type solid)) (layer "F.CrtYd") (tstamp ace4ab99-91fe-40ee-8a07-f2707e2ce6b6))
  (fp_line (start 5.55 9.55) (end -5.55 9.55)
    (stroke (width 0.05) (type solid)) (layer "F.CrtYd") (tstamp a3e9b4e1-abeb-443a-994c-c3d881965a05))
  (fp_line (start -5 -9) (end 5 -9)
    (stroke (width 0.127) (type solid)) (layer "F.Fab") (tstamp 60a10472-eb23-4cb0-9a7d-b04a71513c77))
  (fp_line (start -5 9) (end -5 -9)
    (stroke (width 0.127) (type solid)) (layer "F.Fab") (tstamp 89470af1-6244-43b0-8656-fc595c3145e8))
  (fp_line (start -5 9) (end 5 9)
    (stroke (width 0.127) (type solid)) (layer "F.Fab") (tstamp e7a1acde-4c0a-4eac-af81-2cd38072ba5a))
  (fp_line (start 5 9) (end 5 -9)
    (stroke (width 0.127) (type solid)) (layer "F.Fab") (tstamp c15a8096-fffd-4913-9b79-db1eee959d88))
  (fp_circle (center -5.9 -4) (end -5.8 -4)
    (stroke (width 0.2) (type solid)) (fill none) (layer "F.Fab") (tstamp b584af47-5b77-404a-a052-f8eb87f7e71e))
  (pad "1" smd rect (at -4.6 -4) (size 1.4 0.4) (layers "F.Cu" "F.Paste" "F.Mask") (tstamp 7206f3e0-57d2-4242-9e20-dc5641ce7414))
  (pad "2" smd rect (at -4.6 -3.3) (size 1.4 0.4) (layers "F.Cu" "F.Paste" "F.Mask") (tstamp 82c44d45-6a6b-4f4b-b9ff-d813dcdbcc1f))
  (pad "3" smd rect (at -4.6 0.9) (size 1.4 0.4) (layers "F.Cu" "F.Paste" "F.Mask") (tstamp 84f91c76-6004-42a4-9fae-1588b50ca477))
  (pad "4" smd rect (at -4.6 1.6) (size 1.4 0.4) (layers "F.Cu" "F.Paste" "F.Mask") (tstamp e9228e1a-a731-40aa-8427-bf52f1ad92a2))
  (pad "5" smd rect (at -4.6 2.3) (size 1.4 0.4) (layers "F.Cu" "F.Paste" "F.Mask") (tstamp 70980cfb-2adf-4a28-93a8-87079255e5db))
  (pad "6" smd rect (at -4.6 3) (size 1.4 0.4) (layers "F.Cu" "F.Paste" "F.Mask") (tstamp 9efd9419-8726-4a62-96e8-af845921ac58))
  (pad "7" smd rect (at -4.6 3.7) (size 1.4 0.4) (layers "F.Cu" "F.Paste" "F.Mask") (tstamp 5d19fcd5-eaf0-47e6-8371-ef8d8f59a4a4))
  (pad "8" smd rect (at -4.6 4.4) (size 1.4 0.4) (layers "F.Cu" "F.Paste" "F.Mask") (tstamp 8acf3b4e-16ca-4b53-9ba1-af5b26a3690d))
  (pad "9" smd rect (at -4.6 5.1) (size 1.4 0.4) (layers "F.Cu" "F.Paste" "F.Mask") (tstamp 1e2dec48-2578-455f-a02b-8f6f072056a7))
  (pad "10" smd rect (at -4.6 5.8) (size 1.4 0.4) (layers "F.Cu" "F.Paste" "F.Mask") (tstamp fc8338b8-6fb3-42a9-9089-9ec3562217a6))
  (pad "11" smd rect (at -4.6 6.5) (size 1.4 0.4) (layers "F.Cu" "F.Paste" "F.Mask") (tstamp b936fedf-e9fc-430f-a3d5-0334bcf76f23))
  (pad "12" smd rect (at -4.6 7.2) (size 1.4 0.4) (layers "F.Cu" "F.Paste" "F.Mask") (tstamp d7487a62-27b0-44dd-bbb9-386751ebf808))
  (pad "13" smd rect (at -4.2 8.6 90) (size 1.4 0.4) (layers "F.Cu" "F.Paste" "F.Mask") (tstamp 6aa4381a-1129-48eb-9e69-d86da2f5bdf7))
  (pad "14" smd rect (at -3.5 8.6 90) (size 1.4 0.4) (layers "F.Cu" "F.Paste" "F.Mask") (tstamp 5f63db3a-19a2-4093-9452-8c287ca87d64))
  (pad "15" smd rect (at -2.8 8.6 90) (size 1.4 0.4) (layers "F.Cu" "F.Paste" "F.Mask") (tstamp 08b5f3f4-b4a7-4cdd-b04f-8ba89cbc34e3))
  (pad "16" smd rect (at -2.1 8.6 90) (size 1.4 0.4) (layers "F.Cu" "F.Paste" "F.Mask") (tstamp de2ad9f8-b18f-4b1f-ac6c-8f34876541ca))
  (pad "17" smd rect (at -1.4 8.6 90) (size 1.4 0.4) (layers "F.Cu" "F.Paste" "F.Mask") (tstamp cb554f30-10e9-4c93-8245-fd964a5cb86f))
  (pad "18" smd rect (at -0.7 8.6 90) (size 1.4 0.4) (layers "F.Cu" "F.Paste" "F.Mask") (tstamp cc84b1b2-a47c-4639-945e-c8c7594e0b05))
  (pad "19" smd rect (at 0 8.6 90) (size 1.4 0.4) (layers "F.Cu" "F.Paste" "F.Mask") (tstamp 49244c9c-bbc7-4758-9d56-a2a192e64351))
  (pad "20" smd rect (at 0.7 8.6 90) (size 1.4 0.4) (layers "F.Cu" "F.Paste" "F.Mask") (tstamp 4d1d3e4b-3635-4bfd-9bbd-beaff2bce582))
  (pad "21" smd rect (at 1.4 8.6 90) (size 1.4 0.4) (layers "F.Cu" "F.Paste" "F.Mask") (tstamp c8be51cd-839e-4b37-8527-d78a68040131))
  (pad "22" smd rect (at 2.1 8.6 90) (size 1.4 0.4) (layers "F.Cu" "F.Paste" "F.Mask") (tstamp 0bac948a-be4c-4e95-ae81-868bfa1a788f))
  (pad "23" smd rect (at 2.8 8.6 90) (size 1.4 0.4) (layers "F.Cu" "F.Paste" "F.Mask") (tstamp c454d935-c361-4843-8b87-049c4f57995e))
  (pad "24" smd rect (at 3.5 8.6 90) (size 1.4 0.4) (layers "F.Cu" "F.Paste" "F.Mask") (tstamp cd84a237-b310-420e-8c13-9e898921598e))
  (pad "25" smd rect (at 4.2 8.6 90) (size 1.4 0.4) (layers "F.Cu" "F.Paste" "F.Mask") (tstamp 884008ae-647b-48da-9158-5000f710feae))
  (pad "26" smd rect (at 4.6 7.2) (size 1.4 0.4) (layers "F.Cu" "F.Paste" "F.Mask") (tstamp 99079644-5d67-4b9e-b8e3-1db4637fbd66))
  (pad "27" smd rect (at 4.6 6.5) (size 1.4 0.4) (layers "F.Cu" "F.Paste" "F.Mask") (tstamp 59b4aa8e-3467-4f97-aad5-b68e25231c15))
  (pad "28" smd rect (at 4.6 5.8) (size 1.4 0.4) (layers "F.Cu" "F.Paste" "F.Mask") (tstamp 0dc5a180-480e-47d0-91a6-083a4be6bb55))
  (pad "29" smd rect (at 4.6 5.1) (size 1.4 0.4) (layers "F.Cu" "F.Paste" "F.Mask") (tstamp 815b214a-324c-442f-bdda-7c88414be33a))
  (pad "30" smd rect (at 4.6 4.4) (size 1.4 0.4) (layers "F.Cu" "F.Paste" "F.Mask") (tstamp 764278d6-fe05-458b-af1e-d55db1c95693))
  (pad "31" smd rect (at 4.6 3.7) (size 1.4 0.4) (layers "F.Cu" "F.Paste" "F.Mask") (tstamp ea592b90-93be-4091-9ec3-f1595153d653))
  (pad "32" smd rect (at 4.6 3) (size 1.4 0.4) (layers "F.Cu" "F.Paste" "F.Mask") (tstamp e01b52db-d0f8-40ce-9ae0-dbd7145702c4))
  (pad "33" smd rect (at 4.6 2.3) (size 1.4 0.4) (layers "F.Cu" "F.Paste" "F.Mask") (tstamp 49736836-abd9-4c0a-a5d1-bdcdd44cc8ac))
  (pad "34" smd rect (at 4.6 1.6) (size 1.4 0.4) (layers "F.Cu" "F.Paste" "F.Mask") (tstamp 3fad7cf1-474e-4d30-b803-686ebcf88342))
  (pad "35" smd rect (at 4.6 0.9) (size 1.4 0.4) (layers "F.Cu" "F.Paste" "F.Mask") (tstamp 35cae006-5e64-441e-822f-0bf1b6130a94))
  (pad "36" smd rect (at 4.6 0.2) (size 1.4 0.4) (layers "F.Cu" "F.Paste" "F.Mask") (tstamp 58087ad8-b1e0-4eff-90ac-362ac2a8fb03))
  (pad "37" smd rect (at 4.6 -0.5) (size 1.4 0.4) (layers "F.Cu" "F.Paste" "F.Mask") (tstamp ce689fe6-18ff-4700-a44d-4e6fad33fc14))
  (pad "38" smd rect (at 4.6 -1.2) (size 1.4 0.4) (layers "F.Cu" "F.Paste" "F.Mask") (tstamp c58faf2c-d46a-4d5f-937a-caac0e8b6a5f))
  (pad "39" smd rect (at 4.6 -1.9) (size 1.4 0.4) (layers "F.Cu" "F.Paste" "F.Mask") (tstamp 9bb7f5a1-8b74-4958-8148-711ce4c72a52))
  (pad "40" smd rect (at 4.6 -2.6) (size 1.4 0.4) (layers "F.Cu" "F.Paste" "F.Mask") (tstamp 7d9a6603-f28f-44e3-98bb-89e275a1f956))
  (pad "41" smd rect (at 4.6 -3.3) (size 1.4 0.4) (layers "F.Cu" "F.Paste" "F.Mask") (tstamp 05890488-7d7f-4f5c-81e2-9a3bae317662))
  (pad "42" smd rect (at 4.6 -4) (size 1.4 0.4) (layers "F.Cu" "F.Paste" "F.Mask") (tstamp ef5538ff-3793-48a2-aca8-907b37a5d458))
  (zone (net 0) (net_name "") (layer "F.Cu") (tstamp 57ef3cb7-126a-49fd-8ab6-06207f468fe2) (hatch full 0.508)
    (connect_pads (clearance 0))
    (min_thickness 0.01) (filled_areas_thickness no)
    (keepout (tracks not_allowed) (vias not_allowed) (pads not_allowed) (copperpour not_allowed) (footprints allowed))
    (fill (thermal_gap 0.508) (thermal_bridge_width 0.508))
    (polygon
      (pts
        (xy -5.3 -9)
        (xy 5.3 -9)
        (xy 5.3 -4.2)
        (xy -5.3 -4.2)
      )
    )
  )
  (zone (net 0) (net_name "") (layer "F.Cu") (tstamp e0b0b6c0-242e-4c57-b142-7a0ebdf1dfd4) (hatch full 0.508)
    (connect_pads (clearance 0))
    (min_thickness 0.01) (filled_areas_thickness no)
    (keepout (tracks not_allowed) (vias not_allowed) (pads not_allowed) (copperpour not_allowed) (footprints allowed))
    (fill (thermal_gap 0.508) (thermal_bridge_width 0.508))
    (polygon
      (pts
        (xy -0.35 -4.2)
        (xy 1.65 -4.2)
        (xy 1.65 -3.1)
        (xy -0.35 -3.1)
      )
    )
  )
  (zone (net 0) (net_name "") (layers "*.Cu") (tstamp 60ef323c-fa55-4a9f-9f44-806f8270a0e5) (hatch full 0.508)
    (connect_pads (clearance 0))
    (min_thickness 0.01) (filled_areas_thickness no)
    (keepout (tracks allowed) (vias not_allowed) (pads allowed) (copperpour allowed) (footprints allowed))
    (fill (thermal_gap 0.508) (thermal_bridge_width 0.508))
    (polygon
      (pts
        (xy -5.3 -9)
        (xy 5.3 -9)
        (xy 5.3 -4.2)
        (xy -5.3 -4.2)
      )
    )
  )
  (zone (net 0) (net_name "") (layers "*.Cu") (tstamp cc032c65-a64b-405e-8f4e-90d77c145450) (hatch full 0.508)
    (connect_pads (clearance 0))
    (min_thickness 0.01) (filled_areas_thickness no)
    (keepout (tracks allowed) (vias not_allowed) (pads allowed) (copperpour allowed) (footprints allowed))
    (fill (thermal_gap 0.508) (thermal_bridge_width 0.508))
    (polygon
      (pts
        (xy -0.35 -4.2)
        (xy 1.65 -4.2)
        (xy 1.65 -3.1)
        (xy -0.35 -3.1)
      )
    )
  )
  (zone (net 0) (net_name "") (layer "B.Cu") (tstamp 96131cf8-55c3-4fdc-a3d8-c38aa2703520) (hatch full 0.508)
    (connect_pads (clearance 0))
    (min_thickness 0.01) (filled_areas_thickness no)
    (keepout (tracks not_allowed) (vias not_allowed) (pads not_allowed) (copperpour not_allowed) (footprints allowed))
    (fill (thermal_gap 0.508) (thermal_bridge_width 0.508))
    (polygon
      (pts
        (xy -5.3 -9)
        (xy 5.3 -9)
        (xy 5.3 -4.2)
        (xy -5.3 -4.2)
      )
    )
  )
  (model "C:/Users/saver/Documents/Kicad/kicad_gisa/3D/Modules/MDBT40-256RV3.STEP"
    (offset (xyz 0 0 0))
    (scale (xyz 1 1 1))
    (rotate (xyz 0 0 0))
  )
)
