(kicad_symbol_lib (version 20220914) (generator kicad_symbol_editor)
  (symbol "SolderPad_hole" (pin_names (offset 1.016)) (in_bom yes) (on_board yes)
    (property "Reference" "U" (at 6.35 0 0)
      (effects (font (size 1.27 1.27)))
    )
    (property "Value" "SolderPad_hole" (at 5.08 -2.54 0)
      (effects (font (size 1.27 1.27)))
    )
    (property "Footprint" "" (at 0 0 0)
      (effects (font (size 1.27 1.27)) hide)
    )
    (property "Datasheet" "" (at 0 0 0)
      (effects (font (size 1.27 1.27)) hide)
    )
  )
)
