
(footprint AMPHENOL_10103594-0001LF (layer F.Cu) (tedit 64CE33BB)
  (descr "")
  (attr smd)
  (fp_text reference REF** (at -0.825 -6.885 0) (layer F.SilkS)
    (effects (font (size 1.0 1.0) (thickness 0.15)))
  )
  (fp_text value AMPHENOL_10103594-0001LF (at 11.24 -5.385 0) (layer F.Fab)
    (effects (font (size 1.0 1.0) (thickness 0.15)))
  )
  (pad 1 smd rect (at -1.3 -2.825 90.0) (size 1.75 0.4) (layers F.Cu F.Mask F.Paste))
  (pad 2 smd rect (at -0.65 -2.825 90.0) (size 1.75 0.4) (layers F.Cu F.Mask F.Paste))
  (pad 3 smd rect (at 0.0 -2.825 90.0) (size 1.75 0.4) (layers F.Cu F.Mask F.Paste))
  (pad 4 smd rect (at 0.65 -2.825 90.0) (size 1.75 0.4) (layers F.Cu F.Mask F.Paste))
  (pad 5 smd rect (at 1.3 -2.825 90.0) (size 1.75 0.4) (layers F.Cu F.Mask F.Paste))
  (pad S1 smd rect (at -0.9625 0.25 180.0) (size 1.425 2.5) (layers F.Cu F.Mask F.Paste))
  (pad S2 smd rect (at 0.9625 0.25) (size 1.425 2.5) (layers F.Cu F.Mask F.Paste))
  (pad 6 thru_hole oval (at -2.425 -3.03) (size 0.73 1.46) (drill oval 0.65 1.05) (layers *.Cu))
  (pad 7 thru_hole oval (at 2.425 -3.03) (size 0.73 1.46) (drill oval 0.65 1.05) (layers *.Cu))
  (pad 8 thru_hole oval (at -2.725 0.0) (size 1.2 2.4) (drill oval 0.7 1.2) (layers *.Cu *.Mask))
  (pad 9 thru_hole oval (at 2.725 0.0) (size 1.2 2.4) (drill oval 0.7 1.2) (layers *.Cu *.Mask))
  (pad 10 smd oval (at -2.425 -3.03) (size 1.05 2.1) (layers B.Cu B.Mask))
  (pad 11 smd oval (at 2.425 -3.03) (size 1.05 2.1) (layers B.Cu B.Mask))
  (fp_poly
    (pts
      (xy -1.9 -2.3)
      (xy -1.9 -3.76)
      (xy -3.9 -3.76)
      (xy -3.9 -2.3)
    ) (layer F.Cu) (width 0.01)
  )
  (fp_poly
    (pts
      (xy 1.9 -2.3)
      (xy 1.9 -3.76)
      (xy 3.9 -3.76)
      (xy 3.9 -2.3)
    ) (layer F.Cu) (width 0.01)
  )
  (fp_poly
    (pts
      (xy -3.9 -2.05)
      (xy -3.9 -1.35)
      (xy -3.375 -1.35)
      (xy -3.375 0.8)
      (xy -3.374 0.821)
      (xy -3.373 0.842)
      (xy -3.37 0.863)
      (xy -3.366 0.883)
      (xy -3.361 0.904)
      (xy -3.355 0.924)
      (xy -3.348 0.943)
      (xy -3.34 0.963)
      (xy -3.331 0.982)
      (xy -3.321 1.0)
      (xy -3.31 1.018)
      (xy -3.299 1.035)
      (xy -3.286 1.052)
      (xy -3.272 1.068)
      (xy -3.258 1.083)
      (xy -3.243 1.097)
      (xy -3.227 1.111)
      (xy -3.21 1.124)
      (xy -3.193 1.135)
      (xy -3.175 1.146)
      (xy -3.157 1.156)
      (xy -3.138 1.165)
      (xy -3.118 1.173)
      (xy -3.099 1.18)
      (xy -3.079 1.186)
      (xy -3.058 1.191)
      (xy -3.038 1.195)
      (xy -3.017 1.198)
      (xy -2.996 1.199)
      (xy -2.975 1.2)
      (xy -2.475 1.2)
      (xy -2.454 1.199)
      (xy -2.433 1.198)
      (xy -2.412 1.195)
      (xy -2.392 1.191)
      (xy -2.371 1.186)
      (xy -2.351 1.18)
      (xy -2.332 1.173)
      (xy -2.312 1.165)
      (xy -2.293 1.156)
      (xy -2.275 1.146)
      (xy -2.257 1.135)
      (xy -2.24 1.124)
      (xy -2.223 1.111)
      (xy -2.207 1.097)
      (xy -2.192 1.083)
      (xy -2.178 1.068)
      (xy -2.164 1.052)
      (xy -2.151 1.035)
      (xy -2.14 1.018)
      (xy -2.129 1.0)
      (xy -2.119 0.982)
      (xy -2.11 0.963)
      (xy -2.102 0.943)
      (xy -2.095 0.924)
      (xy -2.089 0.904)
      (xy -2.084 0.883)
      (xy -2.08 0.863)
      (xy -2.077 0.842)
      (xy -2.076 0.821)
      (xy -2.075 0.8)
      (xy -2.075 -2.05)
      (xy -3.9 -2.05)
    ) (layer F.Cu) (width 0.01)
  )
  (fp_poly
    (pts
      (xy 3.9 -2.05)
      (xy 3.9 -1.35)
      (xy 3.375 -1.35)
      (xy 3.375 0.8)
      (xy 3.374 0.821)
      (xy 3.373 0.842)
      (xy 3.37 0.863)
      (xy 3.366 0.883)
      (xy 3.361 0.904)
      (xy 3.355 0.924)
      (xy 3.348 0.943)
      (xy 3.34 0.963)
      (xy 3.331 0.982)
      (xy 3.321 1.0)
      (xy 3.31 1.018)
      (xy 3.299 1.035)
      (xy 3.286 1.052)
      (xy 3.272 1.068)
      (xy 3.258 1.083)
      (xy 3.243 1.097)
      (xy 3.227 1.111)
      (xy 3.21 1.124)
      (xy 3.193 1.135)
      (xy 3.175 1.146)
      (xy 3.157 1.156)
      (xy 3.138 1.165)
      (xy 3.118 1.173)
      (xy 3.099 1.18)
      (xy 3.079 1.186)
      (xy 3.058 1.191)
      (xy 3.038 1.195)
      (xy 3.017 1.198)
      (xy 2.996 1.199)
      (xy 2.975 1.2)
      (xy 2.475 1.2)
      (xy 2.454 1.199)
      (xy 2.433 1.198)
      (xy 2.412 1.195)
      (xy 2.392 1.191)
      (xy 2.371 1.186)
      (xy 2.351 1.18)
      (xy 2.332 1.173)
      (xy 2.312 1.165)
      (xy 2.293 1.156)
      (xy 2.275 1.146)
      (xy 2.257 1.135)
      (xy 2.24 1.124)
      (xy 2.223 1.111)
      (xy 2.207 1.097)
      (xy 2.192 1.083)
      (xy 2.178 1.068)
      (xy 2.164 1.052)
      (xy 2.151 1.035)
      (xy 2.14 1.018)
      (xy 2.129 1.0)
      (xy 2.119 0.982)
      (xy 2.11 0.963)
      (xy 2.102 0.943)
      (xy 2.095 0.924)
      (xy 2.089 0.904)
      (xy 2.084 0.883)
      (xy 2.08 0.863)
      (xy 2.077 0.842)
      (xy 2.076 0.821)
      (xy 2.075 0.8)
      (xy 2.075 -2.05)
      (xy 3.9 -2.05)
    ) (layer F.Cu) (width 0.01)
  )
  (fp_text user "PCB EDGE" (at 4.5 1.5) (layer F.Fab)
    (effects (font (size 0.64 0.64) (thickness 0.15)))
  )
  (fp_poly
    (pts
      (xy -4.0 -2.15)
      (xy -1.975 -2.15)
      (xy -1.975 0.8)
      (xy -1.976 0.826)
      (xy -1.978 0.852)
      (xy -1.981 0.878)
      (xy -1.986 0.904)
      (xy -1.992 0.929)
      (xy -1.999 0.955)
      (xy -2.008 0.979)
      (xy -2.018 1.003)
      (xy -2.029 1.027)
      (xy -2.042 1.05)
      (xy -2.056 1.072)
      (xy -2.07 1.094)
      (xy -2.086 1.115)
      (xy -2.103 1.135)
      (xy -2.121 1.154)
      (xy -2.14 1.172)
      (xy -2.16 1.189)
      (xy -2.181 1.205)
      (xy -2.203 1.219)
      (xy -2.225 1.233)
      (xy -2.248 1.246)
      (xy -2.272 1.257)
      (xy -2.296 1.267)
      (xy -2.32 1.276)
      (xy -2.346 1.283)
      (xy -2.371 1.289)
      (xy -2.397 1.294)
      (xy -2.423 1.297)
      (xy -2.449 1.299)
      (xy -2.475 1.3)
      (xy -2.975 1.3)
      (xy -3.001 1.299)
      (xy -3.027 1.297)
      (xy -3.053 1.294)
      (xy -3.079 1.289)
      (xy -3.104 1.283)
      (xy -3.13 1.276)
      (xy -3.154 1.267)
      (xy -3.178 1.257)
      (xy -3.202 1.246)
      (xy -3.225 1.233)
      (xy -3.247 1.219)
      (xy -3.269 1.205)
      (xy -3.29 1.189)
      (xy -3.31 1.172)
      (xy -3.329 1.154)
      (xy -3.347 1.135)
      (xy -3.364 1.115)
      (xy -3.38 1.094)
      (xy -3.394 1.072)
      (xy -3.408 1.05)
      (xy -3.421 1.027)
      (xy -3.432 1.003)
      (xy -3.442 0.979)
      (xy -3.451 0.955)
      (xy -3.458 0.929)
      (xy -3.464 0.904)
      (xy -3.469 0.878)
      (xy -3.472 0.852)
      (xy -3.474 0.826)
      (xy -3.475 0.8)
      (xy -3.475 -1.25)
      (xy -4.0 -1.25)
      (xy -4.0 -2.15)
    ) (layer F.Mask) (width 0.01)
  )
  (fp_poly
    (pts
      (xy -4.0 -3.86)
      (xy -1.8 -3.86)
      (xy -1.8 -2.2)
      (xy -4.0 -2.2)
    ) (layer F.Mask) (width 0.01)
  )
  (fp_poly
    (pts
      (xy 1.8 -3.86)
      (xy 4.0 -3.86)
      (xy 4.0 -2.2)
      (xy 1.8 -2.2)
    ) (layer F.Mask) (width 0.01)
  )
  (fp_poly
    (pts
      (xy 4.0 -2.15)
      (xy 1.975 -2.15)
      (xy 1.975 0.8)
      (xy 1.976 0.826)
      (xy 1.978 0.852)
      (xy 1.981 0.878)
      (xy 1.986 0.904)
      (xy 1.992 0.929)
      (xy 1.999 0.955)
      (xy 2.008 0.979)
      (xy 2.018 1.003)
      (xy 2.029 1.027)
      (xy 2.042 1.05)
      (xy 2.056 1.072)
      (xy 2.07 1.094)
      (xy 2.086 1.115)
      (xy 2.103 1.135)
      (xy 2.121 1.154)
      (xy 2.14 1.172)
      (xy 2.16 1.189)
      (xy 2.181 1.205)
      (xy 2.203 1.219)
      (xy 2.225 1.233)
      (xy 2.248 1.246)
      (xy 2.272 1.257)
      (xy 2.296 1.267)
      (xy 2.32 1.276)
      (xy 2.346 1.283)
      (xy 2.371 1.289)
      (xy 2.397 1.294)
      (xy 2.423 1.297)
      (xy 2.449 1.299)
      (xy 2.475 1.3)
      (xy 2.975 1.3)
      (xy 3.001 1.299)
      (xy 3.027 1.297)
      (xy 3.053 1.294)
      (xy 3.079 1.289)
      (xy 3.104 1.283)
      (xy 3.13 1.276)
      (xy 3.154 1.267)
      (xy 3.178 1.257)
      (xy 3.202 1.246)
      (xy 3.225 1.233)
      (xy 3.247 1.219)
      (xy 3.269 1.205)
      (xy 3.29 1.189)
      (xy 3.31 1.172)
      (xy 3.329 1.154)
      (xy 3.347 1.135)
      (xy 3.364 1.115)
      (xy 3.38 1.094)
      (xy 3.394 1.072)
      (xy 3.408 1.05)
      (xy 3.421 1.027)
      (xy 3.432 1.003)
      (xy 3.442 0.979)
      (xy 3.451 0.955)
      (xy 3.458 0.929)
      (xy 3.464 0.904)
      (xy 3.469 0.878)
      (xy 3.472 0.852)
      (xy 3.474 0.826)
      (xy 3.475 0.8)
      (xy 3.475 -1.25)
      (xy 4.0 -1.25)
      (xy 4.0 -2.15)
    ) (layer F.Mask) (width 0.01)
  )
  (fp_line (start -3.75 -3.11) (end 3.75 -3.11) (layer F.Fab) (width 0.127))
  (fp_line (start -3.75 -3.11) (end -3.75 1.7) (layer F.Fab) (width 0.127))
  (fp_line (start -3.75 1.7) (end -3.75 2.2) (layer F.Fab) (width 0.127))
  (fp_line (start 3.75 -3.11) (end 3.75 2.2) (layer F.Fab) (width 0.127))
  (fp_line (start 3.75 -1.0) (end 3.75 1.7) (layer F.SilkS) (width 0.127))
  (fp_line (start -3.75 -1.0) (end -3.75 1.7) (layer F.SilkS) (width 0.127))
  (fp_line (start -4.15 -4.01) (end 4.15 -4.01) (layer F.CrtYd) (width 0.05))
  (fp_line (start 4.15 -4.01) (end 4.15 2.2) (layer F.CrtYd) (width 0.05))
  (fp_line (start -4.15 2.2) (end -4.15 -4.01) (layer F.CrtYd) (width 0.05))
  (fp_circle (center -1.3 -4.4) (end -1.2 -4.4) (layer F.Fab) (width 0.2))
  (fp_circle (center -1.3 -4.4) (end -1.2 -4.4) (layer F.SilkS) (width 0.2))
  (fp_line (start -4.02 2.82) (end -3.75 2.2) (layer F.Fab) (width 0.127))
  (fp_line (start 4.02 2.82) (end 3.75 2.2) (layer F.Fab) (width 0.127))
  (fp_line (start -4.02 2.82) (end 4.02 2.82) (layer F.Fab) (width 0.127))
  (fp_line (start -3.75 1.7) (end 5.0 1.7) (layer F.Fab) (width 0.127))
  (fp_line (start -3.75 1.7) (end -1.995 1.7) (layer F.SilkS) (width 0.127))
  (fp_line (start 3.75 1.7) (end 1.995 1.7) (layer F.SilkS) (width 0.127))
  (fp_line (start -4.545 3.07) (end 4.545 3.07) (layer F.CrtYd) (width 0.05))
  (fp_line (start -4.545 3.07) (end -4.15 2.2) (layer F.CrtYd) (width 0.05))
  (fp_line (start 4.545 3.07) (end 4.15 2.2) (layer F.CrtYd) (width 0.05))
)