(footprint "R_0805_2012Metric_Pad1.20x1.40mm_HandSolder" (version 20211014) (generator pcbnew)
  (layer "F.Cu")
  (tedit 636905A6)
  (descr "Resistor SMD 0805 (2012 Metric), square (rectangular) end terminal, IPC_7351 nominal with elongated pad for handsoldering. (Body size source: IPC-SM-782 page 72, https://www.pcb-3d.com/wordpress/wp-content/uploads/ipc-sm-782a_amendment_1_and_2.pdf), generated with kicad-footprint-generator")
  (tags "resistor handsolder")
  (attr smd)
  (fp_text reference "REF**" (at 0 -1.65) (layer "F.SilkS")
    (effects (font (size 1 1) (thickness 0.15)))
    (tstamp ea8a26ea-3a6d-4dab-baac-2b7813101d69)
  )
  (fp_text value "R_0805_2012Metric_Pad1.20x1.40mm_HandSolder" (at 0 1.65) (layer "F.Fab")
    (effects (font (size 1 1) (thickness 0.15)))
    (tstamp 6264eead-45d6-41c5-8b9f-173ccc59d3cf)
  )
  (fp_text user "${REFERENCE}" (at 0 0) (layer "F.Fab")
    (effects (font (size 0.5 0.5) (thickness 0.08)))
    (tstamp 2a12e1fe-6583-480f-b520-69f04005c491)
  )
  (fp_line (start -0.227064 -0.735) (end 0.227064 -0.735) (layer "F.SilkS") (width 0.12) (tstamp 48271d98-12d9-4f33-af9f-2d7831085097))
  (fp_line (start -0.227064 0.735) (end 0.227064 0.735) (layer "F.SilkS") (width 0.12) (tstamp d034902c-e5b7-4c79-bf4e-2234fd7562ae))
  (fp_line (start -1.85 -0.95) (end 1.85 -0.95) (layer "F.CrtYd") (width 0.05) (tstamp 2682e825-0d85-467f-aecf-eb3fab925831))
  (fp_line (start 1.85 0.95) (end -1.85 0.95) (layer "F.CrtYd") (width 0.05) (tstamp 49a5eb84-1cdf-4972-a826-169f72a58314))
  (fp_line (start -1.85 0.95) (end -1.85 -0.95) (layer "F.CrtYd") (width 0.05) (tstamp bb3b7d94-9d6d-4731-99fd-aafb11e8ce69))
  (fp_line (start 1.85 -0.95) (end 1.85 0.95) (layer "F.CrtYd") (width 0.05) (tstamp fa83aaae-a6ae-4d28-9a0c-5c24aa106cda))
  (fp_line (start -1 0.625) (end -1 -0.625) (layer "F.Fab") (width 0.1) (tstamp 8a128ae7-eb37-424e-8c0e-2536ba19e311))
  (fp_line (start 1 -0.625) (end 1 0.625) (layer "F.Fab") (width 0.1) (tstamp a7969011-0845-48e1-9690-b137beca65d7))
  (fp_line (start -1 -0.625) (end 1 -0.625) (layer "F.Fab") (width 0.1) (tstamp f97d0d99-13fa-4988-85ec-df5e924cab3a))
  (fp_line (start 1 0.625) (end -1 0.625) (layer "F.Fab") (width 0.1) (tstamp fe9d62b8-c669-40f7-9f74-a73c83a94bab))
  (pad "1" smd roundrect (at -1 0) (size 1.2 1.4) (layers "F.Cu" "F.Paste" "F.Mask") (roundrect_rratio 0.208333) (tstamp 4937d829-fe33-4310-b24e-1c4f5b5702fa))
  (pad "2" smd roundrect (at 1 0) (size 1.2 1.4) (layers "F.Cu" "F.Paste" "F.Mask") (roundrect_rratio 0.208333) (tstamp 1bdfed4a-fb38-4162-b692-6c86bd617303))
  (model "${KICAD6_3DMODEL_DIR}/Resistor_SMD.3dshapes/R_0805_2012Metric.wrl"
    (offset (xyz 0 0 0))
    (scale (xyz 1 1 1))
    (rotate (xyz 0 0 0))
  )
  (model "C:/Users/girardis/OneDrive - Röchling/Documents/Kicad/kicad_gisa/3D/SMD_Passives/SMD_0805.STEP"
    (offset (xyz 0 0 0))
    (scale (xyz 1 1 1))
    (rotate (xyz 0 0 0))
  )
)
