EESchema Schematic File Version 4
EELAYER 30 0
EELAYER END
$Descr A4 11693 8268
encoding utf-8
Sheet 3 3
Title "STM32L432 bare minimum"
Date "2021-04-08"
Rev "0.1"
Comp ""
Comment1 "Saverio Girardi"
Comment2 "Design By:"
Comment3 ""
Comment4 ""
$EndDescr
$Comp
L MCU_ST_STM32L4:STM32L432KCUx U2
U 1 1 606FFBC6
P 4200 4400
F 0 "U2" H 3850 5250 50  0000 C CNN
F 1 "STM32L432KBU6" H 4650 5250 50  0000 C CNN
F 2 "Package_DFN_QFN:QFN-32-1EP_5x5mm_P0.5mm_EP3.45x3.45mm" H 3800 3500 50  0001 R CNN
F 3 "http://www.st.com/st-web-ui/static/active/en/resource/technical/document/datasheet/DM00257205.pdf" H 4200 4400 50  0001 C CNN
F 4 "ST Microelectronic" H 4200 4400 50  0001 C CNN "Manuf."
F 5 "STM32L432KCU6" H 4200 4400 50  0001 C CNN "Manuf. code"
F 6 "10" H 4200 4400 50  0001 C CNN "Min. purchase"
F 7 "497-16578-ND" H 4200 4400 50  0001 C CNN "Sup. code"
F 8 "Digikey" H 4200 4400 50  0001 C CNN "Supplier"
F 9 "4.792" H 4200 4400 50  0001 C CNN "Unit price"
	1    4200 4400
	1    0    0    -1  
$EndComp
Wire Wire Line
	4100 5400 4100 5450
Wire Wire Line
	4100 5450 4200 5450
Wire Wire Line
	4300 5400 4300 5450
Wire Wire Line
	4300 5450 4200 5450
Connection ~ 4200 5450
Wire Wire Line
	4200 5400 4200 5450
Wire Wire Line
	4200 3500 4200 3400
Wire Wire Line
	4100 3500 4100 3400
Wire Wire Line
	4100 3400 4150 3400
$Comp
L Device:C_Small C4
U 1 1 60704B7D
P 1100 1400
F 0 "C4" H 1008 1354 50  0000 R CNN
F 1 "100n" H 1008 1445 50  0000 R CNN
F 2 "Capacitor_SMD:C_0603_1608Metric" H 1100 1400 50  0001 C CNN
F 3 "~" H 1100 1400 50  0001 C CNN
F 4 "yes" H 1100 1400 50  0001 C CNN "Basic"
F 5 "YAGEO" H 1100 1400 50  0001 C CNN "Manuf."
F 6 "CC0603KRX7R9BB104" H 1100 1400 50  0001 C CNN "Manuf. code"
F 7 "20" H 1100 1400 50  0001 C CNN "Min. purchase"
F 8 "C14663" H 1100 1400 50  0001 C CNN "Sup. code"
F 9 "JLCPCB" H 1100 1400 50  0001 C CNN "Supplier"
F 10 "0.0071" H 1100 1400 50  0001 C CNN "Unit price"
	1    1100 1400
	-1   0    0    1   
$EndComp
$Comp
L Device:C_Small C5
U 1 1 60704FFE
P 1450 1400
F 0 "C5" H 1358 1354 50  0000 R CNN
F 1 "100n" H 1358 1445 50  0000 R CNN
F 2 "Capacitor_SMD:C_0603_1608Metric" H 1450 1400 50  0001 C CNN
F 3 "~" H 1450 1400 50  0001 C CNN
F 4 "yes" H 1450 1400 50  0001 C CNN "Basic"
F 5 "YAGEO" H 1450 1400 50  0001 C CNN "Manuf."
F 6 "CC0603KRX7R9BB104" H 1450 1400 50  0001 C CNN "Manuf. code"
F 7 "20" H 1450 1400 50  0001 C CNN "Min. purchase"
F 8 "C14663" H 1450 1400 50  0001 C CNN "Sup. code"
F 9 "JLCPCB" H 1450 1400 50  0001 C CNN "Supplier"
F 10 "0.0071" H 1450 1400 50  0001 C CNN "Unit price"
	1    1450 1400
	-1   0    0    1   
$EndComp
$Comp
L Device:C_Small C6
U 1 1 6070543E
P 1800 1400
F 0 "C6" H 1892 1446 50  0000 L CNN
F 1 "4u7" H 1892 1355 50  0000 L CNN
F 2 "Capacitor_SMD:C_0805_2012Metric" H 1800 1400 50  0001 C CNN
F 3 "~" H 1800 1400 50  0001 C CNN
F 4 "yes" H 1800 1400 50  0001 C CNN "Basic"
F 5 "Samsung EM" H 1800 1400 50  0001 C CNN "Manuf."
F 6 "CL21A475KAQNNNE" H 1800 1400 50  0001 C CNN "Manuf. code"
F 7 "20" H 1800 1400 50  0001 C CNN "Min. purchase"
F 8 "C1779" H 1800 1400 50  0001 C CNN "Sup. code"
F 9 "JLCPCB" H 1800 1400 50  0001 C CNN "Supplier"
F 10 "0.0431" H 1800 1400 50  0001 C CNN "Unit price"
	1    1800 1400
	1    0    0    -1  
$EndComp
Wire Wire Line
	1800 1250 1800 1300
Wire Wire Line
	1450 1300 1450 1250
Connection ~ 1450 1250
Wire Wire Line
	1450 1250 1800 1250
Wire Wire Line
	1100 1300 1100 1250
Wire Wire Line
	1800 1550 1800 1500
Wire Wire Line
	1450 1500 1450 1550
Connection ~ 1450 1550
Wire Wire Line
	1450 1550 1800 1550
Wire Wire Line
	1100 1500 1100 1550
$Comp
L power:GND #PWR019
U 1 1 60701F99
P 4200 5450
F 0 "#PWR019" H 4200 5200 50  0001 C CNN
F 1 "GND" H 4200 5277 50  0000 C CNN
F 2 "" H 4200 5450 50  0001 C CNN
F 3 "" H 4200 5450 50  0001 C CNN
	1    4200 5450
	1    0    0    -1  
$EndComp
$Comp
L Switch:SW_SPDT SW2
U 1 1 6070E1B6
P 5400 1400
F 0 "SW2" H 5400 1685 50  0000 C CNN
F 1 "SW_SPDT" H 5400 1594 50  0000 C CNN
F 2 "Connector_PinHeader_2.54mm:PinHeader_1x03_P2.54mm_Vertical" H 5400 1400 50  0001 C CNN
F 3 "~" H 5400 1400 50  0001 C CNN
F 4 "-" H 5400 1400 50  0001 C CNN "Basic"
F 5 "-" H 5400 1400 50  0001 C CNN "Manuf."
F 6 "-" H 5400 1400 50  0001 C CNN "Manuf. code"
F 7 "1" H 5400 1400 50  0001 C CNN "Min. purchase"
F 8 "-" H 5400 1400 50  0001 C CNN "Sup. code"
F 9 "-" H 5400 1400 50  0001 C CNN "Supplier"
F 10 "0" H 5400 1400 50  0001 C CNN "Unit price"
	1    5400 1400
	1    0    0    -1  
$EndComp
$Comp
L Device:R_Small R5
U 1 1 6070E971
P 5100 1400
F 0 "R5" V 4904 1400 50  0000 C CNN
F 1 "10k" V 4995 1400 50  0000 C CNN
F 2 "Capacitor_SMD:C_0603_1608Metric" H 5100 1400 50  0001 C CNN
F 3 "~" H 5100 1400 50  0001 C CNN
F 4 "yes" H 5100 1400 50  0001 C CNN "Basic"
F 5 "Uniroyal Elec" H 5100 1400 50  0001 C CNN "Manuf."
F 6 "0603WAF1002T5E" H 5100 1400 50  0001 C CNN "Manuf. code"
F 7 "20" H 5100 1400 50  0001 C CNN "Min. purchase"
F 8 "C25804" H 5100 1400 50  0001 C CNN "Sup. code"
F 9 "JLCPCB" H 5100 1400 50  0001 C CNN "Supplier"
F 10 "0.0026" H 5100 1400 50  0001 C CNN "Unit price"
	1    5100 1400
	0    1    1    0   
$EndComp
Text GLabel 3700 4100 0    50   Input ~ 0
BOOT0
Text GLabel 5000 1400 0    50   Input ~ 0
BOOT0
$Comp
L power:+3V3 #PWR011
U 1 1 6070F21D
P 5650 1250
F 0 "#PWR011" H 5650 1100 50  0001 C CNN
F 1 "+3V3" H 5665 1423 50  0000 C CNN
F 2 "" H 5650 1250 50  0001 C CNN
F 3 "" H 5650 1250 50  0001 C CNN
	1    5650 1250
	1    0    0    -1  
$EndComp
$Comp
L power:GND #PWR014
U 1 1 6070F7AC
P 5650 1550
F 0 "#PWR014" H 5650 1300 50  0001 C CNN
F 1 "GND" H 5650 1377 50  0000 C CNN
F 2 "" H 5650 1550 50  0001 C CNN
F 3 "" H 5650 1550 50  0001 C CNN
	1    5650 1550
	1    0    0    -1  
$EndComp
Wire Wire Line
	5600 1500 5650 1500
Wire Wire Line
	5650 1500 5650 1550
Wire Wire Line
	5650 1300 5650 1250
Wire Wire Line
	5600 1300 5650 1300
$Comp
L power:+3V3 #PWR016
U 1 1 60702CEE
P 4150 3400
F 0 "#PWR016" H 4150 3250 50  0001 C CNN
F 1 "+3V3" H 4100 3550 50  0000 C CNN
F 2 "" H 4150 3400 50  0001 C CNN
F 3 "" H 4150 3400 50  0001 C CNN
	1    4150 3400
	1    0    0    -1  
$EndComp
Connection ~ 4150 3400
Wire Wire Line
	4150 3400 4200 3400
Wire Wire Line
	4300 3500 4300 3400
$Comp
L power:+3V3 #PWR09
U 1 1 6070707E
P 1450 1200
F 0 "#PWR09" H 1450 1050 50  0001 C CNN
F 1 "+3V3" H 1465 1373 50  0000 C CNN
F 2 "" H 1450 1200 50  0001 C CNN
F 3 "" H 1450 1200 50  0001 C CNN
	1    1450 1200
	1    0    0    -1  
$EndComp
Wire Wire Line
	1100 1250 1450 1250
Wire Wire Line
	1100 1550 1450 1550
$Comp
L Device:L_Small L1
U 1 1 6071C1BD
P 3000 1250
F 0 "L1" V 2950 1250 50  0000 C CNN
F 1 "39n" V 3100 1250 50  0000 C CNN
F 2 "Inductor_SMD:L_0402_1005Metric" H 3000 1250 50  0001 C CNN
F 3 "~" H 3000 1250 50  0001 C CNN
F 4 "yes" H 3000 1250 50  0001 C CNN "Basic"
F 5 "Sunlord" H 3000 1250 50  0001 C CNN "Manuf."
F 6 "SDCL1005C39NJTDF" H 3000 1250 50  0001 C CNN "Manuf. code"
F 7 "20" H 3000 1250 50  0001 C CNN "Min. purchase"
F 8 "C26443" H 3000 1250 50  0001 C CNN "Sup. code"
F 9 "JLCPCB" H 3000 1250 50  0001 C CNN "Supplier"
F 10 "0.0087" H 3000 1250 50  0001 C CNN "Unit price"
	1    3000 1250
	0    -1   -1   0   
$EndComp
$Comp
L power:+3V3 #PWR010
U 1 1 6071CDD3
P 2800 1200
F 0 "#PWR010" H 2800 1050 50  0001 C CNN
F 1 "+3V3" H 2815 1373 50  0000 C CNN
F 2 "" H 2800 1200 50  0001 C CNN
F 3 "" H 2800 1200 50  0001 C CNN
	1    2800 1200
	1    0    0    -1  
$EndComp
Wire Wire Line
	2800 1200 2800 1250
Wire Wire Line
	2800 1250 2900 1250
$Comp
L Device:C_Small C7
U 1 1 6071DC3A
P 3150 1400
F 0 "C7" H 3242 1446 50  0000 L CNN
F 1 "1u" H 3242 1355 50  0000 L CNN
F 2 "Capacitor_SMD:C_0805_2012Metric" H 3150 1400 50  0001 C CNN
F 3 "~" H 3150 1400 50  0001 C CNN
F 4 "yes" H 3150 1400 50  0001 C CNN "Basic"
F 5 "Samsung EM" H 3150 1400 50  0001 C CNN "Manuf."
F 6 "CL21B105KBFNNNE" H 3150 1400 50  0001 C CNN "Manuf. code"
F 7 "20" H 3150 1400 50  0001 C CNN "Min. purchase"
F 8 "C28323" H 3150 1400 50  0001 C CNN "Sup. code"
F 9 "JLCPCB" H 3150 1400 50  0001 C CNN "Supplier"
F 10 "0.0202" H 3150 1400 50  0001 C CNN "Unit price"
	1    3150 1400
	1    0    0    -1  
$EndComp
$Comp
L power:GND #PWR012
U 1 1 6070800B
P 1450 1550
F 0 "#PWR012" H 1450 1300 50  0001 C CNN
F 1 "GND" H 1450 1377 50  0000 C CNN
F 2 "" H 1450 1550 50  0001 C CNN
F 3 "" H 1450 1550 50  0001 C CNN
	1    1450 1550
	1    0    0    -1  
$EndComp
$Comp
L power:GND #PWR013
U 1 1 60720103
P 3350 1550
F 0 "#PWR013" H 3350 1300 50  0001 C CNN
F 1 "GND" H 3350 1377 50  0000 C CNN
F 2 "" H 3350 1550 50  0001 C CNN
F 3 "" H 3350 1550 50  0001 C CNN
	1    3350 1550
	1    0    0    -1  
$EndComp
Wire Wire Line
	3150 1500 3150 1550
Wire Wire Line
	3150 1550 3350 1550
Wire Wire Line
	3350 1550 3500 1550
Wire Wire Line
	3500 1550 3500 1500
Connection ~ 3350 1550
Wire Wire Line
	3100 1250 3150 1250
Wire Wire Line
	3500 1300 3500 1250
Connection ~ 3500 1250
Wire Wire Line
	3150 1300 3150 1250
Connection ~ 3150 1250
Wire Wire Line
	3150 1250 3500 1250
$Comp
L Device:C_Small C8
U 1 1 6071EED6
P 3500 1400
F 0 "C8" H 3592 1446 50  0000 L CNN
F 1 "10n" H 3592 1355 50  0000 L CNN
F 2 "Capacitor_SMD:C_0603_1608Metric" H 3500 1400 50  0001 C CNN
F 3 "~" H 3500 1400 50  0001 C CNN
F 4 "yes" H 3500 1400 50  0001 C CNN "Basic"
F 5 "Guangdong Fenghua Advanced Tech" H 3500 1400 50  0001 C CNN "Manuf."
F 6 "0603B103K500NT" H 3500 1400 50  0001 C CNN "Manuf. code"
F 7 "20" H 3500 1400 50  0001 C CNN "Min. purchase"
F 8 "C57112" H 3500 1400 50  0001 C CNN "Sup. code"
F 9 "JLCPCB" H 3500 1400 50  0001 C CNN "Supplier"
F 10 "0.0056" H 3500 1400 50  0001 C CNN "Unit price"
	1    3500 1400
	1    0    0    -1  
$EndComp
Wire Wire Line
	3500 1250 3500 1150
$Comp
L power:+3.3VA #PWR08
U 1 1 6071CA92
P 3500 1150
F 0 "#PWR08" H 3500 1000 50  0001 C CNN
F 1 "+3.3VA" H 3600 1300 50  0000 C CNN
F 2 "" H 3500 1150 50  0001 C CNN
F 3 "" H 3500 1150 50  0001 C CNN
	1    3500 1150
	1    0    0    -1  
$EndComp
$Comp
L power:+3.3VA #PWR017
U 1 1 60723D4B
P 4300 3400
F 0 "#PWR017" H 4300 3250 50  0001 C CNN
F 1 "+3.3VA" H 4400 3550 50  0000 C CNN
F 2 "" H 4300 3400 50  0001 C CNN
F 3 "" H 4300 3400 50  0001 C CNN
	1    4300 3400
	1    0    0    -1  
$EndComp
Text GLabel 3550 3700 0    50   Input ~ 0
NRST
Text GLabel 3700 4300 0    50   Input ~ 0
LSE_IN
Text GLabel 3700 4400 0    50   Input ~ 0
LSE_OUT
$Comp
L Device:Crystal_Small Y1
U 1 1 60725413
P 9650 3350
F 0 "Y1" H 9650 3575 50  0000 C CNN
F 1 "32.768" H 9650 3484 50  0000 C CNN
F 2 "Crystal:Crystal_SMD_3215-2Pin_3.2x1.5mm" H 9650 3350 50  0001 C CNN
F 3 "~" H 9650 3350 50  0001 C CNN
F 4 "yes" H 9650 3350 50  0001 C CNN "Basic"
F 5 "Seiko Epson" H 9650 3350 50  0001 C CNN "Manuf."
F 6 "Q13FC1350000400" H 9650 3350 50  0001 C CNN "Manuf. code"
F 7 "15" H 9650 3350 50  0001 C CNN "Min. purchase"
F 8 "C32346" H 9650 3350 50  0001 C CNN "Sup. code"
F 9 "JLCPCB" H 9650 3350 50  0001 C CNN "Supplier"
F 10 "0.4535" H 9650 3350 50  0001 C CNN "Unit price"
	1    9650 3350
	1    0    0    -1  
$EndComp
$Comp
L Device:C_Small C11
U 1 1 60725DAA
P 9850 3550
F 0 "C11" H 9758 3504 50  0000 R CNN
F 1 "12p" H 9758 3595 50  0000 R CNN
F 2 "Capacitor_SMD:C_0603_1608Metric" H 9850 3550 50  0001 C CNN
F 3 "~" H 9850 3550 50  0001 C CNN
F 4 "yes" H 9850 3550 50  0001 C CNN "Basic"
F 5 "Samsung Electro-Mechanics" H 9850 3550 50  0001 C CNN "Manuf."
F 6 "CL10C120JB8NNNC" H 9850 3550 50  0001 C CNN "Manuf. code"
F 7 "20" H 9850 3550 50  0001 C CNN "Min. purchase"
F 8 "C38523" H 9850 3550 50  0001 C CNN "Sup. code"
F 9 "JLCPCB" H 9850 3550 50  0001 C CNN "Supplier"
F 10 "0.0077" H 9850 3550 50  0001 C CNN "Unit price"
	1    9850 3550
	-1   0    0    1   
$EndComp
$Comp
L Device:C_Small C10
U 1 1 6072798E
P 9450 3550
F 0 "C10" H 9358 3504 50  0000 R CNN
F 1 "12p" H 9358 3595 50  0000 R CNN
F 2 "Capacitor_SMD:C_0603_1608Metric" H 9450 3550 50  0001 C CNN
F 3 "~" H 9450 3550 50  0001 C CNN
F 4 "yes" H 9450 3550 50  0001 C CNN "Basic"
F 5 "Samsung Electro-Mechanics" H 9450 3550 50  0001 C CNN "Manuf."
F 6 "CL10C120JB8NNNC" H 9450 3550 50  0001 C CNN "Manuf. code"
F 7 "20" H 9450 3550 50  0001 C CNN "Min. purchase"
F 8 "C38523" H 9450 3550 50  0001 C CNN "Sup. code"
F 9 "JLCPCB" H 9450 3550 50  0001 C CNN "Supplier"
F 10 "0.0077" H 9450 3550 50  0001 C CNN "Unit price"
	1    9450 3550
	-1   0    0    1   
$EndComp
Wire Wire Line
	9550 3350 9450 3350
Wire Wire Line
	9450 3350 9450 3450
Wire Wire Line
	9450 3650 9450 3750
Wire Wire Line
	9450 3750 9650 3750
Wire Wire Line
	9850 3750 9850 3650
Wire Wire Line
	9850 3450 9850 3350
Wire Wire Line
	9850 3350 9750 3350
Text GLabel 9950 2900 2    50   Input ~ 0
LSE_IN
Text GLabel 9950 3000 2    50   Input ~ 0
LSE_OUT
$Comp
L power:GND #PWR018
U 1 1 6072B2CB
P 9650 3750
F 0 "#PWR018" H 9650 3500 50  0001 C CNN
F 1 "GND" H 9650 3577 50  0000 C CNN
F 2 "" H 9650 3750 50  0001 C CNN
F 3 "" H 9650 3750 50  0001 C CNN
	1    9650 3750
	1    0    0    -1  
$EndComp
Connection ~ 9650 3750
Wire Wire Line
	9650 3750 9850 3750
$Comp
L Switch:SW_Push_Dual SW1
U 1 1 6072DAEA
P 7150 1250
F 0 "SW1" H 7150 1535 50  0000 C CNN
F 1 "RESET" H 7150 1444 50  0000 C CNN
F 2 "Gisa_FP_connectors:Tactile_SPST_6x6" H 7150 1450 50  0001 C CNN
F 3 "~" H 7150 1450 50  0001 C CNN
F 4 "-" H 7150 1250 50  0001 C CNN "Basic"
F 5 "TE Connectivity" H 7150 1250 50  0001 C CNN "Manuf."
F 6 "4-1437565-1" H 7150 1250 50  0001 C CNN "Manuf. code"
F 7 "20" H 7150 1250 50  0001 C CNN "Min. purchase"
F 8 "4791508" H 7150 1250 50  0001 C CNN "Sup. code"
F 9 "RS" H 7150 1250 50  0001 C CNN "Supplier"
F 10 "0.224" H 7150 1250 50  0001 C CNN "Unit price"
	1    7150 1250
	1    0    0    -1  
$EndComp
Wire Wire Line
	6950 1250 6900 1250
Wire Wire Line
	6900 1250 6900 1450
Wire Wire Line
	6900 1450 6950 1450
Wire Wire Line
	7350 1250 7400 1250
Wire Wire Line
	7400 1250 7400 1450
Wire Wire Line
	7400 1450 7350 1450
$Comp
L Device:C_Small C9
U 1 1 60730082
P 7150 1600
F 0 "C9" V 6900 1600 50  0000 C CNN
F 1 "100n" V 7000 1600 50  0000 C CNN
F 2 "Capacitor_SMD:C_0603_1608Metric" H 7150 1600 50  0001 C CNN
F 3 "~" H 7150 1600 50  0001 C CNN
F 4 "yes" H 7150 1600 50  0001 C CNN "Basic"
F 5 "YAGEO" H 7150 1600 50  0001 C CNN "Manuf."
F 6 "CC0603KRX7R9BB104" H 7150 1600 50  0001 C CNN "Manuf. code"
F 7 "20" H 7150 1600 50  0001 C CNN "Min. purchase"
F 8 "C14663" H 7150 1600 50  0001 C CNN "Sup. code"
F 9 "JLCPCB" H 7150 1600 50  0001 C CNN "Supplier"
F 10 "0.0071" H 7150 1600 50  0001 C CNN "Unit price"
	1    7150 1600
	0    -1   -1   0   
$EndComp
Text GLabel 6850 1250 0    50   Input ~ 0
NRST
Wire Wire Line
	6850 1250 6900 1250
Connection ~ 6900 1250
Wire Wire Line
	7050 1600 6900 1600
Wire Wire Line
	6900 1600 6900 1450
Connection ~ 6900 1450
Wire Wire Line
	7250 1600 7400 1600
Wire Wire Line
	7400 1600 7400 1450
Connection ~ 7400 1450
$Comp
L power:GND #PWR015
U 1 1 60738320
P 7400 1650
F 0 "#PWR015" H 7400 1400 50  0001 C CNN
F 1 "GND" H 7400 1477 50  0000 C CNN
F 2 "" H 7400 1650 50  0001 C CNN
F 3 "" H 7400 1650 50  0001 C CNN
	1    7400 1650
	1    0    0    -1  
$EndComp
Wire Wire Line
	7400 1600 7400 1650
Connection ~ 7400 1600
Text GLabel 4700 5100 2    50   Input ~ 0
SW_CLK
Text GLabel 4700 5000 2    50   Input ~ 0
SW_DIO
$Comp
L Connector:Conn_01x05_Male J2
U 1 1 6073D625
P 10050 1500
F 0 "J2" H 10158 1881 50  0000 C CNN
F 1 "PROG" H 10158 1790 50  0000 C CNN
F 2 "Connector_PinHeader_2.54mm:PinHeader_1x05_P2.54mm_Vertical" H 10050 1500 50  0001 C CNN
F 3 "~" H 10050 1500 50  0001 C CNN
F 4 "-" H 10050 1500 50  0001 C CNN "Basic"
F 5 "-" H 10050 1500 50  0001 C CNN "Manuf."
F 6 "-" H 10050 1500 50  0001 C CNN "Manuf. code"
F 7 "1" H 10050 1500 50  0001 C CNN "Min. purchase"
F 8 "-" H 10050 1500 50  0001 C CNN "Sup. code"
F 9 "-" H 10050 1500 50  0001 C CNN "Supplier"
F 10 "0" H 10050 1500 50  0001 C CNN "Unit price"
	1    10050 1500
	1    0    0    -1  
$EndComp
Text GLabel 10250 1300 2    50   Input ~ 0
3V3
Text GLabel 10250 1400 2    50   Input ~ 0
SW_CLK
Text GLabel 10250 1500 2    50   Input ~ 0
GND
Text GLabel 5750 7150 2    50   Input ~ 0
3V3
$Comp
L power:+3V3 #PWR020
U 1 1 6073EE82
P 5700 7000
F 0 "#PWR020" H 5700 6850 50  0001 C CNN
F 1 "+3V3" H 5715 7173 50  0000 C CNN
F 2 "" H 5700 7000 50  0001 C CNN
F 3 "" H 5700 7000 50  0001 C CNN
	1    5700 7000
	1    0    0    -1  
$EndComp
$Comp
L power:GND #PWR021
U 1 1 6073F6D4
P 6600 7000
F 0 "#PWR021" H 6600 6750 50  0001 C CNN
F 1 "GND" H 6600 6827 50  0000 C CNN
F 2 "" H 6600 7000 50  0001 C CNN
F 3 "" H 6600 7000 50  0001 C CNN
	1    6600 7000
	1    0    0    -1  
$EndComp
Text GLabel 10250 1600 2    50   Input ~ 0
SW_DIO
Text GLabel 10250 1700 2    50   Input ~ 0
NRST
Text HLabel 5650 7150 0    50   Input ~ 0
3V3
Wire Wire Line
	5650 7150 5700 7150
Wire Wire Line
	5700 7000 5700 7150
Connection ~ 5700 7150
Wire Wire Line
	5700 7150 5750 7150
Text HLabel 6550 6950 0    50   Input ~ 0
GND
Wire Wire Line
	6550 6950 6600 6950
Wire Wire Line
	6600 6950 6600 7000
Text HLabel 4700 3700 2    50   Input ~ 0
PA0
Text HLabel 4700 3800 2    50   Input ~ 0
PA1
Text HLabel 4700 3900 2    50   Input ~ 0
PA2
Text HLabel 4700 4000 2    50   Input ~ 0
PA3
Text HLabel 4700 4100 2    50   Input ~ 0
PA4
Text HLabel 4700 4200 2    50   Input ~ 0
PA5
Text HLabel 4700 4300 2    50   Input ~ 0
PA6
Text HLabel 4700 4400 2    50   Input ~ 0
PA7
Text HLabel 4700 4500 2    50   Input ~ 0
PA8
Text HLabel 4700 4600 2    50   Input ~ 0
PA9
Text HLabel 4700 4700 2    50   Input ~ 0
PA10
Text HLabel 4700 4800 2    50   Input ~ 0
PA11
Text HLabel 4700 4900 2    50   Input ~ 0
PA12
Text HLabel 3700 4600 0    50   Input ~ 0
PB0
Text HLabel 3700 4700 0    50   Input ~ 0
PB1
Text HLabel 3700 4800 0    50   Input ~ 0
PB3
Text HLabel 3700 4900 0    50   Input ~ 0
PB4
Text HLabel 3700 5000 0    50   Input ~ 0
PB5
Text HLabel 3700 5100 0    50   Input ~ 0
PB6
Text HLabel 3700 5200 0    50   Input ~ 0
PB7
Text Notes 750  1500 0    50   ~ 0
 C49678
Text Notes 3550 1550 0    50   ~ 0
 C15195
Text Notes 2800 1550 0    50   ~ 0
C15849
Text Notes 1850 1550 0    50   ~ 0
 C29823
Text Notes 4900 1550 0    50   ~ 0
 C25744
Wire Notes Line
	4350 2350 4350 500 
Wire Notes Line
	500  2350 11200 2350
Wire Notes Line
	8250 500  8250 6500
Text Notes 550  2300 0    50   ~ 0
Power supply filtering
Text Notes 4400 2300 0    50   ~ 0
Boot and reset
Text Notes 8300 2300 0    50   ~ 0
Programming and debugging
Text Notes 8300 6500 0    50   ~ 0
Oscillators
Text Notes 8450 3400 0    50   ~ 0
RTC LSE
Text Notes 8450 5150 0    50   ~ 0
HSE
Wire Notes Line
	6950 6550 5250 6550
Wire Notes Line
	5250 6550 5250 7750
Text Notes 5300 7750 0    50   ~ 0
Power port
Text Notes 500  7750 0    50   ~ 0
Microcontroller
$Comp
L Device:R_Small R6
U 1 1 60862680
P 9850 3200
F 0 "R6" H 9909 3246 50  0000 L CNN
F 1 "0R" H 9909 3155 50  0000 L CNN
F 2 "Resistor_SMD:R_0805_2012Metric" H 9850 3200 50  0001 C CNN
F 3 "~" H 9850 3200 50  0001 C CNN
F 4 "yes" H 9850 3200 50  0001 C CNN "Basic"
F 5 "Uniroyal Elec" H 9850 3200 50  0001 C CNN "Manuf."
F 6 "0805W8F0000T5E" H 9850 3200 50  0001 C CNN "Manuf. code"
F 7 "20" H 9850 3200 50  0001 C CNN "Min. purchase"
F 8 "C17477" H 9850 3200 50  0001 C CNN "Sup. code"
F 9 "JLCPCB" H 9850 3200 50  0001 C CNN "Supplier"
F 10 "0.0047" H 9850 3200 50  0001 C CNN "Unit price"
	1    9850 3200
	1    0    0    -1  
$EndComp
Wire Wire Line
	9850 3300 9850 3350
Connection ~ 9850 3350
Wire Wire Line
	9950 3000 9850 3000
Wire Wire Line
	9850 3000 9850 3100
Wire Wire Line
	9950 2900 9450 2900
Wire Wire Line
	9450 2900 9450 3350
Connection ~ 9450 3350
$Comp
L Device:R_Small R7
U 1 1 60869603
P 3650 3550
F 0 "R7" H 3500 3600 50  0000 L CNN
F 1 "0R" H 3500 3500 50  0000 L CNN
F 2 "Resistor_SMD:R_0805_2012Metric" H 3650 3550 50  0001 C CNN
F 3 "~" H 3650 3550 50  0001 C CNN
F 4 "-" H 3650 3550 50  0001 C CNN "Basic"
F 5 "-" H 3650 3550 50  0001 C CNN "Manuf."
F 6 "-" H 3650 3550 50  0001 C CNN "Manuf. code"
F 7 "1" H 3650 3550 50  0001 C CNN "Min. purchase"
F 8 "-" H 3650 3550 50  0001 C CNN "Sup. code"
F 9 "-" H 3650 3550 50  0001 C CNN "Supplier"
F 10 "0" H 3650 3550 50  0001 C CNN "Unit price"
	1    3650 3550
	1    0    0    -1  
$EndComp
Wire Wire Line
	3550 3700 3650 3700
Wire Wire Line
	3650 3650 3650 3700
Connection ~ 3650 3700
Wire Wire Line
	3650 3700 3700 3700
$Comp
L power:+3V3 #PWR?
U 1 1 6086F7D6
P 3650 3450
F 0 "#PWR?" H 3650 3300 50  0001 C CNN
F 1 "+3V3" H 3600 3600 50  0000 C CNN
F 2 "" H 3650 3450 50  0001 C CNN
F 3 "" H 3650 3450 50  0001 C CNN
	1    3650 3450
	1    0    0    -1  
$EndComp
$EndSCHEMATC
