EESchema Schematic File Version 4
EELAYER 30 0
EELAYER END
$Descr A4 11693 8268
encoding utf-8
Sheet 4 5
Title "BMS single cell solar charger"
Date "2021-04-05"
Rev "0.1"
Comp ""
Comment1 "Saverio Girardi"
Comment2 "Design by:"
Comment3 ""
Comment4 ""
$EndDescr
$Comp
L Device:C_Small C13
U 1 1 602F32DE
P 9550 2550
F 0 "C13" H 9642 2596 50  0000 L CNN
F 1 "1uF" H 9642 2505 50  0000 L CNN
F 2 "Capacitor_SMD:C_0805_2012Metric" H 9550 2550 50  0001 C CNN
F 3 "~" H 9550 2550 50  0001 C CNN
F 4 "yes" H 9550 2550 50  0001 C CNN "Basic"
F 5 "Samsung Electro-Mechanics" H 9550 2550 50  0001 C CNN "Manuf."
F 6 "CL21B105KBFNNNE" H 9550 2550 50  0001 C CNN "Manuf. code"
F 7 "20" H 9550 2550 50  0001 C CNN "Min. purchase"
F 8 "C28323" H 9550 2550 50  0001 C CNN "Sup. code"
F 9 "JLCPCB" H 9550 2550 50  0001 C CNN "Supplier"
F 10 "0.0202" H 9550 2550 50  0001 C CNN "Unit price"
	1    9550 2550
	1    0    0    -1  
$EndComp
$Comp
L Device:C_Small C12
U 1 1 602F38BF
P 9100 2550
F 0 "C12" H 9192 2596 50  0000 L CNN
F 1 "820uF" H 9192 2505 50  0000 L CNN
F 2 "Capacitor_THT:CP_Radial_D6.3mm_P2.50mm" H 9100 2550 50  0001 C CNN
F 3 "~" H 9100 2550 50  0001 C CNN
F 4 "no" H 9100 2550 50  0001 C CNN "Basic"
F 5 "AISHI" H 9100 2550 50  0001 C CNN "Manuf."
F 6 "SPZ0QM821E10O00R" H 9100 2550 50  0001 C CNN "Manuf. code"
F 7 "1" H 9100 2550 50  0001 C CNN "Min. purchase"
F 8 "C112529" H 9100 2550 50  0001 C CNN "Sup. code"
F 9 "KLCPCB" H 9100 2550 50  0001 C CNN "Supplier"
F 10 "0.1093" H 9100 2550 50  0001 C CNN "Unit price"
	1    9100 2550
	1    0    0    -1  
$EndComp
Wire Wire Line
	9750 2400 9550 2400
Wire Wire Line
	9100 2450 9100 2400
Connection ~ 9100 2400
Wire Wire Line
	9550 2450 9550 2400
Connection ~ 9550 2400
Wire Wire Line
	9550 2400 9100 2400
Wire Wire Line
	10050 2700 10050 2750
Wire Wire Line
	10050 2750 9550 2750
Wire Wire Line
	9100 2750 9100 2650
Wire Wire Line
	9550 2650 9550 2750
Connection ~ 9550 2750
Wire Wire Line
	9550 2750 9100 2750
$Comp
L Device:C_Small C14
U 1 1 602F9496
P 10450 2550
F 0 "C14" H 10542 2596 50  0000 L CNN
F 1 "1uF" H 10542 2505 50  0000 L CNN
F 2 "Capacitor_SMD:C_0805_2012Metric" H 10450 2550 50  0001 C CNN
F 3 "~" H 10450 2550 50  0001 C CNN
F 4 "yes" H 10450 2550 50  0001 C CNN "Basic"
F 5 "Samsung Electro-Mechanics" H 10450 2550 50  0001 C CNN "Manuf."
F 6 "CL21B105KBFNNNE" H 10450 2550 50  0001 C CNN "Manuf. code"
F 7 "20" H 10450 2550 50  0001 C CNN "Min. purchase"
F 8 "C28323" H 10450 2550 50  0001 C CNN "Sup. code"
F 9 "JLCPCB" H 10450 2550 50  0001 C CNN "Supplier"
F 10 "0.0202" H 10450 2550 50  0001 C CNN "Unit price"
	1    10450 2550
	1    0    0    -1  
$EndComp
Wire Wire Line
	10350 2400 10450 2400
Wire Wire Line
	10450 2400 10450 2450
Wire Wire Line
	10450 2650 10450 2750
Wire Wire Line
	10450 2750 10050 2750
Connection ~ 10050 2750
Text HLabel 10750 2400 2    50   Input ~ 0
3V3
Connection ~ 10450 2400
$Comp
L power:GND #PWR024
U 1 1 60304487
P 10050 2800
F 0 "#PWR024" H 10050 2550 50  0001 C CNN
F 1 "GND" H 10050 2627 50  0000 C CNN
F 2 "" H 10050 2800 50  0001 C CNN
F 3 "" H 10050 2800 50  0001 C CNN
	1    10050 2800
	1    0    0    -1  
$EndComp
Wire Wire Line
	10050 2800 10050 2750
$Comp
L Regulator_Linear:MCP1703A-3302_SOT89 U3
U 1 1 606B56BA
P 10050 2400
F 0 "U3" H 10050 2642 50  0000 C CNN
F 1 "MCP1703A-3302_SOT89" H 10050 2551 50  0000 C CNN
F 2 "Package_TO_SOT_SMD:SOT-89-3" H 10050 2600 50  0001 C CNN
F 3 "http://ww1.microchip.com/downloads/en/DeviceDoc/20005122B.pdf" H 10050 2350 50  0001 C CNN
F 4 "-" H 10050 2400 50  0001 C CNN "Basic"
F 5 "Microchip" H 10050 2400 50  0001 C CNN "Manuf."
F 6 "MCP1703A-3302E/DB" H 10050 2400 50  0001 C CNN "Manuf. code"
F 7 "6" H 10050 2400 50  0001 C CNN "Min. purchase"
F 8 "770-9486" H 10050 2400 50  0001 C CNN "Sup. code"
F 9 "RS Components" H 10050 2400 50  0001 C CNN "Supplier"
F 10 "0.673" H 10050 2400 50  0001 C CNN "Unit price"
	1    10050 2400
	1    0    0    -1  
$EndComp
$Comp
L Battery_Management:BQ24074RGT U4
U 1 1 60905D25
P 5450 3450
F 0 "U4" H 5750 2900 50  0000 C CNN
F 1 "BQ24074RGT" H 5750 4000 50  0000 C CNN
F 2 "Package_DFN_QFN:VQFN-16-1EP_3x3mm_P0.5mm_EP1.6x1.6mm" H 5750 2900 50  0001 L CNN
F 3 "http://www.ti.com/lit/ds/symlink/bq24074.pdf" H 5750 3650 50  0001 C CNN
F 4 "no" H 5450 3450 50  0001 C CNN "Basic"
F 5 "Texas Instruments" H 5450 3450 50  0001 C CNN "Manuf."
F 6 "BQ24074RGTR" H 5450 3450 50  0001 C CNN "Manuf. code"
F 7 "15" H 5450 3450 50  0001 C CNN "Min. purchase"
F 8 "54313" H 5450 3450 50  0001 C CNN "Sup. code"
F 9 "JLCPCB" H 5450 3450 50  0001 C CNN "Supplier"
F 10 "0.8052" H 5450 3450 50  0001 C CNN "Unit price"
	1    5450 3450
	1    0    0    -1  
$EndComp
$Comp
L Device:R_Small R10
U 1 1 60906B2A
P 1050 1000
F 0 "R10" H 991 954 50  0000 R CNN
F 1 "1k" H 991 1045 50  0000 R CNN
F 2 "Resistor_SMD:R_0603_1608Metric" H 1050 1000 50  0001 C CNN
F 3 "~" H 1050 1000 50  0001 C CNN
F 4 "yes" H 1050 1000 50  0001 C CNN "Basic"
F 5 "Uniroyal Elec" H 1050 1000 50  0001 C CNN "Manuf."
F 6 "0603WAF1001T5E" H 1050 1000 50  0001 C CNN "Manuf. code"
F 7 "20" H 1050 1000 50  0001 C CNN "Min. purchase"
F 8 "C21190" H 1050 1000 50  0001 C CNN "Sup. code"
F 9 "JLCPCB" H 1050 1000 50  0001 C CNN "Supplier"
F 10 "0.0026" H 1050 1000 50  0001 C CNN "Unit price"
	1    1050 1000
	-1   0    0    1   
$EndComp
Text Label 4750 3750 0    50   ~ 0
ILIM
Text Label 4750 3050 0    50   ~ 0
ITRM
Text Label 4750 3250 0    50   ~ 0
CE
Wire Wire Line
	4750 3750 4950 3750
Wire Wire Line
	4750 3850 4950 3850
Wire Wire Line
	4750 3250 4950 3250
$Comp
L Device:R_Small R12
U 1 1 60908FA5
P 1400 1000
F 0 "R12" H 1341 954 50  0000 R CNN
F 1 "10k" H 1341 1045 50  0000 R CNN
F 2 "Resistor_SMD:R_0603_1608Metric" H 1400 1000 50  0001 C CNN
F 3 "~" H 1400 1000 50  0001 C CNN
F 4 "yes" H 1400 1000 50  0001 C CNN "Basic"
F 5 "Uniroyal Elec" H 1400 1000 50  0001 C CNN "Manuf."
F 6 "0603WAF1002T5E" H 1400 1000 50  0001 C CNN "Manuf. code"
F 7 "20" H 1400 1000 50  0001 C CNN "Min. purchase"
F 8 "C25804" H 1400 1000 50  0001 C CNN "Sup. code"
F 9 "JLCPCB" H 1400 1000 50  0001 C CNN "Supplier"
F 10 "0.0026" H 1400 1000 50  0001 C CNN "Unit price"
	1    1400 1000
	-1   0    0    1   
$EndComp
Text Label 1050 850  0    50   ~ 0
ILIM
Wire Wire Line
	1400 850  1400 900 
Wire Wire Line
	1050 900  1050 850 
$Comp
L power:GND #PWR030
U 1 1 6090A087
P 1400 1150
F 0 "#PWR030" H 1400 900 50  0001 C CNN
F 1 "GND" H 1400 977 50  0000 C CNN
F 2 "" H 1400 1150 50  0001 C CNN
F 3 "" H 1400 1150 50  0001 C CNN
	1    1400 1150
	1    0    0    -1  
$EndComp
$Comp
L power:GND #PWR027
U 1 1 6090A477
P 1050 1150
F 0 "#PWR027" H 1050 900 50  0001 C CNN
F 1 "GND" H 1050 977 50  0000 C CNN
F 2 "" H 1050 1150 50  0001 C CNN
F 3 "" H 1050 1150 50  0001 C CNN
	1    1050 1150
	1    0    0    -1  
$EndComp
Wire Wire Line
	1050 1100 1050 1150
Wire Wire Line
	1400 1150 1400 1100
$Comp
L Device:R_Small R14
U 1 1 6090CBB2
P 1950 1150
F 0 "R14" H 1891 1104 50  0000 R CNN
F 1 "10k" H 1891 1195 50  0000 R CNN
F 2 "Resistor_SMD:R_0603_1608Metric" H 1950 1150 50  0001 C CNN
F 3 "~" H 1950 1150 50  0001 C CNN
F 4 "yes" H 1950 1150 50  0001 C CNN "Basic"
F 5 "Uniroyal Elec" H 1950 1150 50  0001 C CNN "Manuf."
F 6 "0603WAF1002T5E" H 1950 1150 50  0001 C CNN "Manuf. code"
F 7 "20" H 1950 1150 50  0001 C CNN "Min. purchase"
F 8 "C25804" H 1950 1150 50  0001 C CNN "Sup. code"
F 9 "JLCPCB" H 1950 1150 50  0001 C CNN "Supplier"
F 10 "0.0026" H 1950 1150 50  0001 C CNN "Unit price"
	1    1950 1150
	-1   0    0    1   
$EndComp
$Comp
L Device:R_Small R16
U 1 1 6090D24B
P 2550 1150
F 0 "R16" H 2609 1196 50  0000 L CNN
F 1 "10k" H 2609 1105 50  0000 L CNN
F 2 "Resistor_SMD:R_0603_1608Metric" H 2550 1150 50  0001 C CNN
F 3 "~" H 2550 1150 50  0001 C CNN
F 4 "yes" H 2550 1150 50  0001 C CNN "Basic"
F 5 "Uniroyal Elec" H 2550 1150 50  0001 C CNN "Manuf."
F 6 "0603WAF1002T5E" H 2550 1150 50  0001 C CNN "Manuf. code"
F 7 "20" H 2550 1150 50  0001 C CNN "Min. purchase"
F 8 "C25804" H 2550 1150 50  0001 C CNN "Sup. code"
F 9 "JLCPCB" H 2550 1150 50  0001 C CNN "Supplier"
F 10 "0.0026" H 2550 1150 50  0001 C CNN "Unit price"
	1    2550 1150
	1    0    0    -1  
$EndComp
$Comp
L Device:LED_Small D3
U 1 1 6090D6AD
P 1950 950
F 0 "D3" V 1996 882 50  0000 R CNN
F 1 "GREEN" V 1905 882 50  0000 R CNN
F 2 "LED_SMD:LED_0805_2012Metric" V 1950 950 50  0001 C CNN
F 3 "~" V 1950 950 50  0001 C CNN
F 4 "no" H 1950 950 50  0001 C CNN "Basic"
F 5 "Orient" H 1950 950 50  0001 C CNN "Manuf."
F 6 "ORH-G35A" H 1950 950 50  0001 C CNN "Manuf. code"
F 7 "20" H 1950 950 50  0001 C CNN "Min. purchase"
F 8 "C205442" H 1950 950 50  0001 C CNN "Sup. code"
F 9 "JLCPCB" H 1950 950 50  0001 C CNN "Supplier"
F 10 "0.0269" H 1950 950 50  0001 C CNN "Unit price"
	1    1950 950 
	0    -1   -1   0   
$EndComp
$Comp
L Device:LED_Small D5
U 1 1 6090EF89
P 2550 950
F 0 "D5" V 2596 882 50  0000 R CNN
F 1 "RED" V 2505 882 50  0000 R CNN
F 2 "LED_SMD:LED_0603_1608Metric" V 2550 950 50  0001 C CNN
F 3 "~" V 2550 950 50  0001 C CNN
F 4 "no" H 2550 950 50  0001 C CNN "Basic"
F 5 "Lite-On" H 2550 950 50  0001 C CNN "Manuf."
F 6 "LTST-C191KRKT" H 2550 950 50  0001 C CNN "Manuf. code"
F 7 "20" H 2550 950 50  0001 C CNN "Min. purchase"
F 8 "C125099" H 2550 950 50  0001 C CNN "Sup. code"
F 9 "JLCPCB" H 2550 950 50  0001 C CNN "Supplier"
F 10 "0.0122" H 2550 950 50  0001 C CNN "Unit price"
	1    2550 950 
	0    -1   -1   0   
$EndComp
Text Label 6000 3750 0    50   ~ 0
PGOOD
Text Label 6000 3850 0    50   ~ 0
CHG
Wire Wire Line
	5950 3850 6000 3850
Wire Wire Line
	5950 3750 6000 3750
Text Label 1950 1350 0    50   ~ 0
PGOOD
Wire Wire Line
	1950 1250 1950 1350
Text Label 2550 1350 0    50   ~ 0
CHG
Wire Wire Line
	2550 1250 2550 1350
Wire Wire Line
	4750 3350 4950 3350
Text Label 1400 850  0    50   ~ 0
ITRM
$Comp
L Jumper:SolderJumper_3_Open JP2
U 1 1 6091519B
P 1100 2000
F 0 "JP2" V 1146 2067 50  0000 L CNN
F 1 "JEN1" V 1055 2067 50  0000 L CNN
F 2 "Jumper:SolderJumper-3_P2.0mm_Open_TrianglePad1.0x1.5mm" H 1100 2000 50  0001 C CNN
F 3 "~" H 1100 2000 50  0001 C CNN
F 4 "-" H 1100 2000 50  0001 C CNN "Basic"
F 5 "-" H 1100 2000 50  0001 C CNN "Manuf."
F 6 "-" H 1100 2000 50  0001 C CNN "Manuf. code"
F 7 "-" H 1100 2000 50  0001 C CNN "Min. purchase"
F 8 "-" H 1100 2000 50  0001 C CNN "Sup. code"
F 9 "-" H 1100 2000 50  0001 C CNN "Supplier"
F 10 "0" H 1100 2000 50  0001 C CNN "Unit price"
	1    1100 2000
	0    -1   -1   0   
$EndComp
$Comp
L Jumper:SolderJumper_3_Open JP5
U 1 1 60917379
P 2200 2000
F 0 "JP5" V 2246 2067 50  0000 L CNN
F 1 "JEN2" V 2155 2067 50  0000 L CNN
F 2 "Jumper:SolderJumper-3_P2.0mm_Open_TrianglePad1.0x1.5mm" H 2200 2000 50  0001 C CNN
F 3 "~" H 2200 2000 50  0001 C CNN
F 4 "-" H 2200 2000 50  0001 C CNN "Basic"
F 5 "-" H 2200 2000 50  0001 C CNN "Manuf."
F 6 "-" H 2200 2000 50  0001 C CNN "Manuf. code"
F 7 "-" H 2200 2000 50  0001 C CNN "Min. purchase"
F 8 "-" H 2200 2000 50  0001 C CNN "Sup. code"
F 9 "-" H 2200 2000 50  0001 C CNN "Supplier"
F 10 "0" H 2200 2000 50  0001 C CNN "Unit price"
	1    2200 2000
	0    -1   -1   0   
$EndComp
$Comp
L power:GND #PWR028
U 1 1 60917A70
P 1100 2200
F 0 "#PWR028" H 1100 1950 50  0001 C CNN
F 1 "GND" H 1100 2027 50  0000 C CNN
F 2 "" H 1100 2200 50  0001 C CNN
F 3 "" H 1100 2200 50  0001 C CNN
	1    1100 2200
	1    0    0    -1  
$EndComp
$Comp
L power:GND #PWR031
U 1 1 609180FF
P 2200 2200
F 0 "#PWR031" H 2200 1950 50  0001 C CNN
F 1 "GND" H 2200 2027 50  0000 C CNN
F 2 "" H 2200 2200 50  0001 C CNN
F 3 "" H 2200 2200 50  0001 C CNN
	1    2200 2200
	1    0    0    -1  
$EndComp
Text Label 6000 3050 0    50   ~ 0
OUT
Wire Wire Line
	5950 3050 6000 3050
Text Label 1950 800  0    50   ~ 0
OUT
Text Label 2550 800  0    50   ~ 0
OUT
Wire Wire Line
	2550 800  2550 850 
Wire Wire Line
	1950 800  1950 850 
$Comp
L power:GND #PWR035
U 1 1 6091A293
P 5450 4050
F 0 "#PWR035" H 5450 3800 50  0001 C CNN
F 1 "GND" H 5450 3877 50  0000 C CNN
F 2 "" H 5450 4050 50  0001 C CNN
F 3 "" H 5450 4050 50  0001 C CNN
	1    5450 4050
	1    0    0    -1  
$EndComp
Text Label 1100 1750 0    50   ~ 0
OUT
Text Label 2200 1750 0    50   ~ 0
OUT
Wire Wire Line
	2200 1750 2200 1800
Wire Wire Line
	1100 1750 1100 1800
Text Label 4750 3450 0    50   ~ 0
EN1
Text Label 4750 3550 0    50   ~ 0
EN2
Wire Wire Line
	4750 3550 4950 3550
Wire Wire Line
	4750 3450 4950 3450
Text Label 1350 2000 0    50   ~ 0
EN1
Wire Wire Line
	1250 2000 1350 2000
Text Label 2450 2000 0    50   ~ 0
EN2
Wire Wire Line
	2450 2000 2350 2000
$Comp
L Jumper:SolderJumper_2_Open JP3
U 1 1 609291E1
P 1300 3300
F 0 "JP3" V 1254 3368 50  0000 L CNN
F 1 "1A" V 1345 3368 50  0000 L CNN
F 2 "Jumper:SolderJumper-2_P1.3mm_Open_TrianglePad1.0x1.5mm" H 1300 3300 50  0001 C CNN
F 3 "~" H 1300 3300 50  0001 C CNN
F 4 "-" H 1300 3300 50  0001 C CNN "Basic"
F 5 "-" H 1300 3300 50  0001 C CNN "Manuf."
F 6 "-" H 1300 3300 50  0001 C CNN "Manuf. code"
F 7 "-" H 1300 3300 50  0001 C CNN "Min. purchase"
F 8 "-" H 1300 3300 50  0001 C CNN "Sup. code"
F 9 "-" H 1300 3300 50  0001 C CNN "Supplier"
F 10 "0" H 1300 3300 50  0001 C CNN "Unit price"
	1    1300 3300
	0    1    1    0   
$EndComp
$Comp
L Jumper:SolderJumper_2_Open JP4
U 1 1 6092BDF8
P 1700 3300
F 0 "JP4" V 1654 3368 50  0000 L CNN
F 1 "0.5A" V 1745 3368 50  0000 L CNN
F 2 "Jumper:SolderJumper-2_P1.3mm_Open_TrianglePad1.0x1.5mm" H 1700 3300 50  0001 C CNN
F 3 "~" H 1700 3300 50  0001 C CNN
F 4 "-" H 1700 3300 50  0001 C CNN "Basic"
F 5 "-" H 1700 3300 50  0001 C CNN "Manuf."
F 6 "-" H 1700 3300 50  0001 C CNN "Manuf. code"
F 7 "-" H 1700 3300 50  0001 C CNN "Min. purchase"
F 8 "-" H 1700 3300 50  0001 C CNN "Sup. code"
F 9 "-" H 1700 3300 50  0001 C CNN "Supplier"
F 10 "0" H 1700 3300 50  0001 C CNN "Unit price"
	1    1700 3300
	0    1    1    0   
$EndComp
Text Label 4750 3850 0    50   ~ 0
ISET
$Comp
L Device:R_Small R11
U 1 1 6092F784
P 1300 3050
F 0 "R11" H 1241 3004 50  0000 R CNN
F 1 "1k" H 1241 3095 50  0000 R CNN
F 2 "Resistor_SMD:R_0603_1608Metric" H 1300 3050 50  0001 C CNN
F 3 "~" H 1300 3050 50  0001 C CNN
F 4 "yes" H 1300 3050 50  0001 C CNN "Basic"
F 5 "Uniroyal Elec" H 1300 3050 50  0001 C CNN "Manuf."
F 6 "0603WAF1001T5E" H 1300 3050 50  0001 C CNN "Manuf. code"
F 7 "20" H 1300 3050 50  0001 C CNN "Min. purchase"
F 8 "C21190" H 1300 3050 50  0001 C CNN "Sup. code"
F 9 "JLCPCB" H 1300 3050 50  0001 C CNN "Supplier"
F 10 "0.0026" H 1300 3050 50  0001 C CNN "Unit price"
	1    1300 3050
	-1   0    0    1   
$EndComp
$Comp
L Device:R_Small R13
U 1 1 6092FB8E
P 1700 3050
F 0 "R13" H 1641 3004 50  0000 R CNN
F 1 "2k" H 1641 3095 50  0000 R CNN
F 2 "Resistor_SMD:R_0603_1608Metric" H 1700 3050 50  0001 C CNN
F 3 "~" H 1700 3050 50  0001 C CNN
F 4 "yes" H 1700 3050 50  0001 C CNN "Basic"
F 5 "Uniroyal Elec" H 1700 3050 50  0001 C CNN "Manuf."
F 6 "0603WAF2001T5E" H 1700 3050 50  0001 C CNN "Manuf. code"
F 7 "20" H 1700 3050 50  0001 C CNN "Min. purchase"
F 8 "C22975" H 1700 3050 50  0001 C CNN "Sup. code"
F 9 "JLCPCB" H 1700 3050 50  0001 C CNN "Supplier"
F 10 "0.0026" H 1700 3050 50  0001 C CNN "Unit price"
	1    1700 3050
	-1   0    0    1   
$EndComp
Wire Wire Line
	1300 2850 1300 2950
Wire Wire Line
	1300 2850 1700 2850
Wire Wire Line
	1700 2850 1700 2950
Connection ~ 1300 2850
Wire Wire Line
	1300 2850 1300 2800
Text Label 1300 2800 0    50   ~ 0
ISET
Wire Wire Line
	1700 3550 1700 3450
Wire Wire Line
	1300 3450 1300 3550
Wire Wire Line
	1300 3550 1500 3550
$Comp
L power:GND #PWR029
U 1 1 60936425
P 1500 3600
F 0 "#PWR029" H 1500 3350 50  0001 C CNN
F 1 "GND" H 1500 3427 50  0000 C CNN
F 2 "" H 1500 3600 50  0001 C CNN
F 3 "" H 1500 3600 50  0001 C CNN
	1    1500 3600
	1    0    0    -1  
$EndComp
Wire Wire Line
	4750 3050 4950 3050
Text HLabel 6500 7500 0    50   Input ~ 0
GND
Text Label 6600 7500 0    50   ~ 0
GND
$Comp
L power:GND #PWR036
U 1 1 6093815F
P 6550 7550
F 0 "#PWR036" H 6550 7300 50  0001 C CNN
F 1 "GND" H 6550 7377 50  0000 C CNN
F 2 "" H 6550 7550 50  0001 C CNN
F 3 "" H 6550 7550 50  0001 C CNN
	1    6550 7550
	1    0    0    -1  
$EndComp
Wire Wire Line
	6500 7500 6550 7500
Wire Wire Line
	6550 7500 6550 7550
Wire Wire Line
	6550 7500 6600 7500
Connection ~ 6550 7500
Text Label 4750 3350 0    50   ~ 0
GND
$Comp
L Device:R_Small R8
U 1 1 6093B2FE
P 700 1000
F 0 "R8" H 641 954 50  0000 R CNN
F 1 "10k" H 641 1045 50  0000 R CNN
F 2 "Resistor_SMD:R_0603_1608Metric" H 700 1000 50  0001 C CNN
F 3 "~" H 700 1000 50  0001 C CNN
F 4 "yes" H 700 1000 50  0001 C CNN "Basic"
F 5 "Uniroyal Elec" H 700 1000 50  0001 C CNN "Manuf."
F 6 "0603WAF1002T5E" H 700 1000 50  0001 C CNN "Manuf. code"
F 7 "20" H 700 1000 50  0001 C CNN "Min. purchase"
F 8 "C25804" H 700 1000 50  0001 C CNN "Sup. code"
F 9 "JLCPCB" H 700 1000 50  0001 C CNN "Supplier"
F 10 "0.0026" H 700 1000 50  0001 C CNN "Unit price"
	1    700  1000
	-1   0    0    1   
$EndComp
Wire Wire Line
	700  850  700  900 
$Comp
L power:GND #PWR026
U 1 1 6093B309
P 700 1150
F 0 "#PWR026" H 700 900 50  0001 C CNN
F 1 "GND" H 700 977 50  0000 C CNN
F 2 "" H 700 1150 50  0001 C CNN
F 3 "" H 700 1150 50  0001 C CNN
	1    700  1150
	1    0    0    -1  
$EndComp
Wire Wire Line
	700  1150 700  1100
Text Label 700  850  0    50   ~ 0
CE
Text Label 5450 2800 0    50   ~ 0
VBUS
Wire Wire Line
	5450 2800 5450 2850
Text Label 6000 3550 0    50   ~ 0
THERM
Wire Wire Line
	5950 3550 6000 3550
Text Label 2300 2850 0    50   ~ 0
THERM
$Comp
L Jumper:SolderJumper_2_Open JP6
U 1 1 6094323B
P 2300 3050
F 0 "JP6" V 2254 3118 50  0000 L CNN
F 1 "THERM" V 2345 3118 50  0000 L CNN
F 2 "Jumper:SolderJumper-2_P1.3mm_Open_TrianglePad1.0x1.5mm" H 2300 3050 50  0001 C CNN
F 3 "~" H 2300 3050 50  0001 C CNN
F 4 "-" H 2300 3050 50  0001 C CNN "Basic"
F 5 "-" H 2300 3050 50  0001 C CNN "Manuf."
F 6 "-" H 2300 3050 50  0001 C CNN "Manuf. code"
F 7 "-" H 2300 3050 50  0001 C CNN "Min. purchase"
F 8 "-" H 2300 3050 50  0001 C CNN "Sup. code"
F 9 "-" H 2300 3050 50  0001 C CNN "Supplier"
F 10 "0" H 2300 3050 50  0001 C CNN "Unit price"
	1    2300 3050
	0    1    1    0   
$EndComp
Wire Wire Line
	2300 2850 2300 2900
$Comp
L power:GND #PWR032
U 1 1 60945AF4
P 2300 3400
F 0 "#PWR032" H 2300 3150 50  0001 C CNN
F 1 "GND" H 2300 3227 50  0000 C CNN
F 2 "" H 2300 3400 50  0001 C CNN
F 3 "" H 2300 3400 50  0001 C CNN
	1    2300 3400
	1    0    0    -1  
$EndComp
$Comp
L Device:R_Small R15
U 1 1 6094658A
P 2300 3300
F 0 "R15" H 2359 3346 50  0000 L CNN
F 1 "10k" H 2359 3255 50  0000 L CNN
F 2 "Resistor_SMD:R_0603_1608Metric" H 2300 3300 50  0001 C CNN
F 3 "~" H 2300 3300 50  0001 C CNN
F 4 "yes" H 2300 3300 50  0001 C CNN "Basic"
F 5 "Uniroyal Elec" H 2300 3300 50  0001 C CNN "Manuf."
F 6 "0603WAF1002T5E" H 2300 3300 50  0001 C CNN "Manuf. code"
F 7 "20" H 2300 3300 50  0001 C CNN "Min. purchase"
F 8 "C25804" H 2300 3300 50  0001 C CNN "Sup. code"
F 9 "JLCPCB" H 2300 3300 50  0001 C CNN "Supplier"
F 10 "0.0026" H 2300 3300 50  0001 C CNN "Unit price"
	1    2300 3300
	1    0    0    -1  
$EndComp
Text Label 6000 3350 0    50   ~ 0
VLIPO
Wire Wire Line
	5950 3350 6000 3350
Text Label 4050 950  0    50   ~ 0
OUT
$Comp
L Device:C_Small C23
U 1 1 609529AE
P 5000 1100
F 0 "C23" H 5092 1146 50  0000 L CNN
F 1 "10uF" H 5092 1055 50  0000 L CNN
F 2 "Capacitor_SMD:C_0603_1608Metric" H 5000 1100 50  0001 C CNN
F 3 "~" H 5000 1100 50  0001 C CNN
F 4 "no" H 5000 1100 50  0001 C CNN "Basic"
F 5 "YAGEO" H 5000 1100 50  0001 C CNN "Manuf."
F 6 "CC0603KRX5R6BB106" H 5000 1100 50  0001 C CNN "Manuf. code"
F 7 "20" H 5000 1100 50  0001 C CNN "Min. purchase"
F 8 "C326057" H 5000 1100 50  0001 C CNN "Sup. code"
F 9 "JLCPCB" H 5000 1100 50  0001 C CNN "Supplier"
F 10 "0.0282" H 5000 1100 50  0001 C CNN "Unit price"
	1    5000 1100
	1    0    0    -1  
$EndComp
$Comp
L Device:C_Small C21
U 1 1 60953B41
P 4600 1100
F 0 "C21" H 4692 1146 50  0000 L CNN
F 1 "10uF" H 4692 1055 50  0000 L CNN
F 2 "Capacitor_SMD:C_0603_1608Metric" H 4600 1100 50  0001 C CNN
F 3 "~" H 4600 1100 50  0001 C CNN
F 4 "no" H 4600 1100 50  0001 C CNN "Basic"
F 5 "YAGEO" H 4600 1100 50  0001 C CNN "Manuf."
F 6 "CC0603KRX5R6BB106" H 4600 1100 50  0001 C CNN "Manuf. code"
F 7 "20" H 4600 1100 50  0001 C CNN "Min. purchase"
F 8 "C326057" H 4600 1100 50  0001 C CNN "Sup. code"
F 9 "JLCPCB" H 4600 1100 50  0001 C CNN "Supplier"
F 10 "0.0282" H 4600 1100 50  0001 C CNN "Unit price"
	1    4600 1100
	1    0    0    -1  
$EndComp
$Comp
L Device:C_Small C19
U 1 1 60954041
P 4200 1100
F 0 "C19" H 4292 1146 50  0000 L CNN
F 1 "10uF" H 4292 1055 50  0000 L CNN
F 2 "Capacitor_SMD:C_0603_1608Metric" H 4200 1100 50  0001 C CNN
F 3 "~" H 4200 1100 50  0001 C CNN
F 4 "no" H 4200 1100 50  0001 C CNN "Basic"
F 5 "YAGEO" H 4200 1100 50  0001 C CNN "Manuf."
F 6 "CC0603KRX5R6BB106" H 4200 1100 50  0001 C CNN "Manuf. code"
F 7 "20" H 4200 1100 50  0001 C CNN "Min. purchase"
F 8 "C326057" H 4200 1100 50  0001 C CNN "Sup. code"
F 9 "JLCPCB" H 4200 1100 50  0001 C CNN "Supplier"
F 10 "0.0282" H 4200 1100 50  0001 C CNN "Unit price"
	1    4200 1100
	1    0    0    -1  
$EndComp
Wire Wire Line
	5300 950  5000 950 
Wire Wire Line
	4200 950  4200 1000
Wire Wire Line
	4600 1000 4600 950 
Connection ~ 4600 950 
Wire Wire Line
	4600 950  4200 950 
Wire Wire Line
	5000 1000 5000 950 
Connection ~ 5000 950 
Wire Wire Line
	5000 950  4600 950 
Wire Wire Line
	4200 1200 4200 1300
Wire Wire Line
	4200 1300 4600 1300
Wire Wire Line
	5000 1300 5000 1200
Wire Wire Line
	4600 1200 4600 1300
Connection ~ 4600 1300
Wire Wire Line
	4600 1300 5000 1300
$Comp
L power:GND #PWR033
U 1 1 6095D23B
P 4600 1350
F 0 "#PWR033" H 4600 1100 50  0001 C CNN
F 1 "GND" H 4600 1177 50  0000 C CNN
F 2 "" H 4600 1350 50  0001 C CNN
F 3 "" H 4600 1350 50  0001 C CNN
	1    4600 1350
	1    0    0    -1  
$EndComp
Wire Wire Line
	4600 1350 4600 1300
Wire Wire Line
	4050 950  4200 950 
Connection ~ 4200 950 
Text HLabel 5300 950  2    50   Input ~ 0
VOUT_NR
Text Label 4150 1650 0    50   ~ 0
VLIPO
Wire Wire Line
	4150 1650 4400 1650
Wire Wire Line
	4400 1650 4400 1700
$Comp
L Device:C_Small C22
U 1 1 60964C7A
P 4800 1800
F 0 "C22" H 4892 1846 50  0000 L CNN
F 1 "10uF" H 4892 1755 50  0000 L CNN
F 2 "Capacitor_SMD:C_0603_1608Metric" H 4800 1800 50  0001 C CNN
F 3 "~" H 4800 1800 50  0001 C CNN
F 4 "no" H 4800 1800 50  0001 C CNN "Basic"
F 5 "YAGEO" H 4800 1800 50  0001 C CNN "Manuf."
F 6 "CC0603KRX5R6BB106" H 4800 1800 50  0001 C CNN "Manuf. code"
F 7 "20" H 4800 1800 50  0001 C CNN "Min. purchase"
F 8 "C326057" H 4800 1800 50  0001 C CNN "Sup. code"
F 9 "JLCPCB" H 4800 1800 50  0001 C CNN "Supplier"
F 10 "0.0282" H 4800 1800 50  0001 C CNN "Unit price"
	1    4800 1800
	1    0    0    -1  
$EndComp
Wire Wire Line
	4400 1650 4800 1650
Wire Wire Line
	4800 1650 4800 1700
Connection ~ 4400 1650
Wire Wire Line
	4400 1900 4400 1950
Wire Wire Line
	4400 1950 4600 1950
Wire Wire Line
	4800 1950 4800 1900
$Comp
L power:GND #PWR034
U 1 1 60969CD7
P 4600 2000
F 0 "#PWR034" H 4600 1750 50  0001 C CNN
F 1 "GND" H 4600 1827 50  0000 C CNN
F 2 "" H 4600 2000 50  0001 C CNN
F 3 "" H 4600 2000 50  0001 C CNN
	1    4600 2000
	1    0    0    -1  
$EndComp
Wire Wire Line
	4600 2000 4600 1950
Connection ~ 4600 1950
Wire Wire Line
	4600 1950 4800 1950
Text HLabel 4900 1650 2    50   Input ~ 0
VLIPO
Wire Wire Line
	4800 1650 4900 1650
Connection ~ 4800 1650
Text HLabel 1800 5150 0    50   Input ~ 0
VUSB
$Comp
L Device:D_Schottky_Small D4
U 1 1 6097824E
P 1950 5150
F 0 "D4" H 1950 4945 50  0000 C CNN
F 1 "SS34" H 1950 5036 50  0000 C CNN
F 2 "Diode_SMD:D_SMA" V 1950 5150 50  0001 C CNN
F 3 "~" V 1950 5150 50  0001 C CNN
F 4 "yes" H 1950 5150 50  0001 C CNN "Basic"
F 5 "MDD" H 1950 5150 50  0001 C CNN "Manuf."
F 6 "SS34" H 1950 5150 50  0001 C CNN "Manuf. code"
F 7 "5" H 1950 5150 50  0001 C CNN "Min. purchase"
F 8 "C8678" H 1950 5150 50  0001 C CNN "Sup. code"
F 9 "JLCPCB" H 1950 5150 50  0001 C CNN "Supplier"
F 10 "0.0405" H 1950 5150 50  0001 C CNN "Unit price"
	1    1950 5150
	-1   0    0    1   
$EndComp
Wire Wire Line
	1800 5150 1850 5150
Wire Wire Line
	2050 5150 2100 5150
Text Label 2650 5150 0    50   ~ 0
VBUS
$Comp
L Device:C_Small C20
U 1 1 60961FF9
P 4400 1800
F 0 "C20" H 4492 1846 50  0000 L CNN
F 1 "10uF" H 4492 1755 50  0000 L CNN
F 2 "Capacitor_SMD:C_0603_1608Metric" H 4400 1800 50  0001 C CNN
F 3 "~" H 4400 1800 50  0001 C CNN
F 4 "no" H 4400 1800 50  0001 C CNN "Basic"
F 5 "YAGEO" H 4400 1800 50  0001 C CNN "Manuf."
F 6 "CC0603KRX5R6BB106" H 4400 1800 50  0001 C CNN "Manuf. code"
F 7 "20" H 4400 1800 50  0001 C CNN "Min. purchase"
F 8 "C326057" H 4400 1800 50  0001 C CNN "Sup. code"
F 9 "JLCPCB" H 4400 1800 50  0001 C CNN "Supplier"
F 10 "0.0282" H 4400 1800 50  0001 C CNN "Unit price"
	1    4400 1800
	1    0    0    -1  
$EndComp
$Comp
L Device:C_Small C24
U 1 1 60982547
P 2100 5300
F 0 "C24" H 2192 5346 50  0000 L CNN
F 1 "10uF" H 2192 5255 50  0000 L CNN
F 2 "Capacitor_SMD:C_0603_1608Metric" H 2100 5300 50  0001 C CNN
F 3 "~" H 2100 5300 50  0001 C CNN
F 4 "no" H 2100 5300 50  0001 C CNN "Basic"
F 5 "YAGEO" H 2100 5300 50  0001 C CNN "Manuf."
F 6 "CC0603KRX5R6BB106" H 2100 5300 50  0001 C CNN "Manuf. code"
F 7 "20" H 2100 5300 50  0001 C CNN "Min. purchase"
F 8 "C326057" H 2100 5300 50  0001 C CNN "Sup. code"
F 9 "JLCPCB" H 2100 5300 50  0001 C CNN "Supplier"
F 10 "0.0282" H 2100 5300 50  0001 C CNN "Unit price"
	1    2100 5300
	1    0    0    -1  
$EndComp
$Comp
L Device:C_Small C25
U 1 1 60982E8E
P 2500 5300
F 0 "C25" H 2592 5346 50  0000 L CNN
F 1 "10uF" H 2592 5255 50  0000 L CNN
F 2 "Capacitor_SMD:C_0603_1608Metric" H 2500 5300 50  0001 C CNN
F 3 "~" H 2500 5300 50  0001 C CNN
F 4 "no" H 2500 5300 50  0001 C CNN "Basic"
F 5 "YAGEO" H 2500 5300 50  0001 C CNN "Manuf."
F 6 "CC0603KRX5R6BB106" H 2500 5300 50  0001 C CNN "Manuf. code"
F 7 "20" H 2500 5300 50  0001 C CNN "Min. purchase"
F 8 "C326057" H 2500 5300 50  0001 C CNN "Sup. code"
F 9 "JLCPCB" H 2500 5300 50  0001 C CNN "Supplier"
F 10 "0.0282" H 2500 5300 50  0001 C CNN "Unit price"
	1    2500 5300
	1    0    0    -1  
$EndComp
Wire Wire Line
	2100 5200 2100 5150
Connection ~ 2100 5150
Wire Wire Line
	2100 5150 2500 5150
Wire Wire Line
	2500 5200 2500 5150
Connection ~ 2500 5150
Wire Wire Line
	2500 5150 2650 5150
Wire Wire Line
	2100 5400 2100 5500
Wire Wire Line
	2500 5400 2500 5500
Wire Wire Line
	2100 5500 2300 5500
$Comp
L power:GND #PWR037
U 1 1 60992305
P 2300 5500
F 0 "#PWR037" H 2300 5250 50  0001 C CNN
F 1 "GND" H 2300 5327 50  0000 C CNN
F 2 "" H 2300 5500 50  0001 C CNN
F 3 "" H 2300 5500 50  0001 C CNN
	1    2300 5500
	1    0    0    -1  
$EndComp
Connection ~ 2300 5500
Wire Wire Line
	2300 5500 2500 5500
Text HLabel 1800 5800 0    50   Input ~ 0
SOLAR_IN
Text Label 1850 5800 0    50   ~ 0
VBUS
Wire Wire Line
	1800 5800 1850 5800
$Comp
L Connector:Conn_01x02_Male J3
U 1 1 609975B2
P 2000 6350
F 0 "J3" H 2108 6531 50  0000 C CNN
F 1 "EXT_PS" H 2108 6440 50  0000 C CNN
F 2 "Connector_PinHeader_2.54mm:PinHeader_1x02_P2.54mm_Vertical" H 2000 6350 50  0001 C CNN
F 3 "~" H 2000 6350 50  0001 C CNN
F 4 "-" H 2000 6350 50  0001 C CNN "Basic"
F 5 "-" H 2000 6350 50  0001 C CNN "Manuf."
F 6 "-" H 2000 6350 50  0001 C CNN "Manuf. code"
F 7 "-" H 2000 6350 50  0001 C CNN "Min. purchase"
F 8 "-" H 2000 6350 50  0001 C CNN "Sup. code"
F 9 "-" H 2000 6350 50  0001 C CNN "Supplier"
F 10 "0" H 2000 6350 50  0001 C CNN "Unit price"
	1    2000 6350
	1    0    0    -1  
$EndComp
$Comp
L Device:D_Schottky_Small D1
U 1 1 60998050
P 2400 6350
F 0 "D1" H 2400 6145 50  0000 C CNN
F 1 "SS34" H 2400 6236 50  0000 C CNN
F 2 "Diode_SMD:D_SMA" V 2400 6350 50  0001 C CNN
F 3 "~" V 2400 6350 50  0001 C CNN
F 4 "yes" H 2400 6350 50  0001 C CNN "Basic"
F 5 "MDD" H 2400 6350 50  0001 C CNN "Manuf."
F 6 "SS34" H 2400 6350 50  0001 C CNN "Manuf. code"
F 7 "5" H 2400 6350 50  0001 C CNN "Min. purchase"
F 8 "C8678" H 2400 6350 50  0001 C CNN "Sup. code"
F 9 "JLCPCB" H 2400 6350 50  0001 C CNN "Supplier"
F 10 "0.0405" H 2400 6350 50  0001 C CNN "Unit price"
	1    2400 6350
	-1   0    0    1   
$EndComp
Wire Wire Line
	2200 6350 2300 6350
Text Label 2550 6350 0    50   ~ 0
VBUS
Wire Wire Line
	2500 6350 2550 6350
$Comp
L power:GND #PWR023
U 1 1 6099FB14
P 2250 6500
F 0 "#PWR023" H 2250 6250 50  0001 C CNN
F 1 "GND" H 2250 6327 50  0000 C CNN
F 2 "" H 2250 6500 50  0001 C CNN
F 3 "" H 2250 6500 50  0001 C CNN
	1    2250 6500
	1    0    0    -1  
$EndComp
Wire Wire Line
	2200 6450 2250 6450
Wire Wire Line
	2250 6450 2250 6500
Text HLabel 3650 5950 0    50   Input ~ 0
THERM
Text HLabel 3650 6050 0    50   Input ~ 0
ISET
Text HLabel 3650 6150 0    50   Input ~ 0
CE
Text HLabel 3650 6250 0    50   Input ~ 0
PGOOD
Text HLabel 3650 6350 0    50   Input ~ 0
CHG
Text Label 3750 5950 0    50   ~ 0
THERM
Text Label 3750 6050 0    50   ~ 0
ISET
Text Label 3750 6150 0    50   ~ 0
CE
Text Label 3750 6250 0    50   ~ 0
PGOOD
Text Label 3750 6350 0    50   ~ 0
CHG
Wire Wire Line
	3650 5950 3750 5950
Wire Wire Line
	3650 6050 3750 6050
Wire Wire Line
	3650 6150 3750 6150
Wire Wire Line
	3650 6250 3750 6250
Wire Wire Line
	3650 6350 3750 6350
Wire Wire Line
	10450 2400 10750 2400
Text Label 8600 2400 0    50   ~ 0
OUT
Wire Wire Line
	1500 3600 1500 3550
Connection ~ 1500 3550
Wire Wire Line
	1500 3550 1700 3550
Wire Wire Line
	8600 2400 9100 2400
$EndSCHEMATC
