[
    {
       "id":1,
       "price":"50",
       "article":154786,
       "color":"black",
       "title":"1",
       "Url":"https://d1csarkz8obe9u.cloudfront.net/posterpreviews/artistic-album-cover-design-template-d12ef0296af80b58363dc0deef077ecc_screen.jpg?ts=1561488440",
       "isFavorite":false
    },
    {
        "id":2,
        "price":"25",
        "article":155447,
        "color":"black",
        "title":"2",
        "Url":"https://cs6.pikabu.ru/post_img/big/2015/06/01/4/1433136480_1070513002.jpg",
        "isFavorite":false
    },
    {
        "id":3,
        "price":"45",
        "article":156145,
        "color":"black",
        "title":"3",
        "Url":"https://d1csarkz8obe9u.cloudfront.net/posterpreviews/album-cover-island-design-template-dcda7c5ddb5fffcc09b68b577f3f9f50.jpg?ts=1614365718",
        "isFavorite":false
    },
    {
        "id":4,
        "price":"97",
        "article":154543,
        "color":"black",
        "title":"4",
        "Url":"https://d1csarkz8obe9u.cloudfront.net/posterpreviews/summer-vibes-compilation-the-mixtape-cd-cover-design-template-7b3f9a01334fb3485461a4279ba394cd_screen.jpg?ts=1598090987",
        "isFavorite":false
    },
    {
        "id":5,
        "price":"65",
        "article":154455,
        "color":"black",
        "title":"5",
        "Url":"https://d1csarkz8obe9u.cloudfront.net/posterpreviews/basketball-mixtape-album-cover-art-template-design-a91c1cb0d5fde3c0b459a8ab2604a96a_screen.jpg?ts=1598299880",
        "isFavorite":false
    },
    {
        "id":6,
        "price":"75",
        "article":154453,
        "color":"black",
        "title":"6",
        "Url":"https://d1csarkz8obe9u.cloudfront.net/posterpreviews/album-cover-book-cover-design-template-1d0c67dfcf55af72abf6f018216e9e3f_screen.jpg?ts=1614364994",
        "isFavorite":false
    },
    {
        "id":7,
        "price":"68",
        "article":154127,
        "color":"black",
        "title":"7",
        "Url":"https://d1csarkz8obe9u.cloudfront.net/posterpreviews/album-cover-design-template-5d2ec0f675b7d8ef3691c91557365462_screen.jpg?ts=1614363798",
        "isFavorite":false
    },
    {
        "id":8,
        "price":"135",
        "article":154456,
        "color":"black",
        "title":"8",
        "Url":"https://d1csarkz8obe9u.cloudfront.net/posterpreviews/noah-withrow-booking-flyer-design-template-93f8d76cb2ea091ede6564bfbdf99a1d_screen.jpg?ts=1561415234",
        "isFavorite":false
    },
    {
        "id":9,
        "price":"45",
        "article":154721,
        "color":"black",
        "title":"9",
        "Url":"https://d1csarkz8obe9u.cloudfront.net/posterpreviews/%22new-single%22-announcement-design-template-f7185b7dccea15637003a8c03842cc21_screen.jpg?ts=1572359448",
        "isFavorite":false
    },
    {
        "id":10,
        "price":"64",
        "article":157864,
        "color":"black",
        "title":"10",
        "Url":"https://d1csarkz8obe9u.cloudfront.net/posterpreviews/mixtape-album-cover-art-design-template-68450756e786f85861314fa7d49d8366_screen.jpg?ts=1586223871",
        "isFavorite":false
    }
]