{
  "pluginsFile": "plugins/index.js",
  "testFiles": "**/*.spec.ts",
  "video": false,
  "reporter": "cypress-multi-reporters",
  "reporterOptions": {
    "reporterEnabled": "mocha-junit-reporter, mochawesome",
    "mochaJunitReporterReporterOptions": {
      "mochaFile": "junit.xml"
    },
    "mochawesomeReporterOptions": {
      "reportDir": "results/mocha",
      "quite": true,
      "overwrite": false,
      "html": false,
      "json": true
    }
  }
}
