<?xml version="1.0" encoding="UTF-8"?>
<svg version="1.1" viewBox="0 0 24 24" xmlns="http://www.w3.org/2000/svg">
<g fill="#fff">
<path d="m7 17v2h3v-2z"/>
<path d="m4 16.5c-0.82843 0-1.5 0.67157-1.5 1.5s0.67157 1.5 1.5 1.5 1.5-0.67157 1.5-1.5-0.67157-1.5-1.5-1.5z"/>
<path d="m7 11v2h4l0.10938-2z"/>
<path d="m4 10.5c-0.82843 0-1.5 0.67157-1.5 1.5s0.67157 1.5 1.5 1.5 1.5-0.67157 1.5-1.5-0.67157-1.5-1.5-1.5z"/>
<path d="m7 5v2h14v-2z"/>
<path d="m4 4.5c-0.82843 0-1.5 0.67157-1.5 1.5s0.67157 1.5 1.5 1.5 1.5-0.67157 1.5-1.5-0.67157-1.5-1.5-1.5z"/>
<path d="m9 16c0 3.866 3.134 7 7 7s7-3.134 7-7-3.1429-7-7.0285-6.9744c-3.8945 0.025645-6.9718 3.1447-6.9715 6.9744zm7-5c2.7614 0 5 2.2386 5 5s-2.2386 5-5 5-5-2.2386-5-5 2.2386-5 5-5z"/>
<path d="m16.5 15.82 2.44 1.41-0.75 1.3-3.19-1.84v-3.69h1.5z"/>
</g>
</svg>
