Division,WeightClassKg,Place,Name,Team,BodyweightKg,Best3SquatKg,Best3BenchKg,Best3DeadliftKg,TotalKg,Equipment,Event,Sex
Boys,51.71,1,Uriel Rodriguez,Crawford,51.07,147.42,92.99,165.56,405.97,Single-ply,SBD,M
Boys,55.79,2,Cameron Carpenter,McGregor,51.94,131.54,65.77,154.22,351.53,Single-ply,SBD,M
Boys,51.71,3,Tracer Toten,Mart,49.8,113.4,54.43,122.47,290.3,Single-ply,SBD,M
Boys,51.71,4,Hunter Uptmor,West,42.64,92.99,47.63,86.18,226.8,Single-ply,SBD,M
Boys,55.79,1,Cody Villa,Crawford,55.79,172.37,111.13,219.99,503.49,Single-ply,SBD,M
Boys,55.79,2,Dalton Wiethorn,West,55.07,145.15,77.11,154.22,376.48,Single-ply,SBD,M
Boys,59.87,3,Alex Amador,Rosebud-Lott,55.97,122.47,77.11,158.76,358.34,Single-ply,SBD,M
Boys,55.79,4,Josh Burkhalter,Caldwell,55.52,138.35,63.5,140.61,342.46,Single-ply,SBD,M
Boys,55.79,5,Ricardo Dela Rosa,Waco La Vega,53.61,74.84,58.97,136.08,269.89,Single-ply,SBD,M
Boys,55.79,6,Jonathan Whalen,Whitney,53.71,81.65,45.36,95.25,222.26,Single-ply,SBD,M
Boys,55.79,7,Ryland Holt,Whitney,53.16,83.91,43.09,86.18,213.19,Single-ply,SBD,M
Boys,59.87,DQ,Osvaldo Antunez,Hillsboro,55.97,,,,,Single-ply,SBD,M
Boys,59.87,1,David Carboni,Hillsboro,56.15,154.22,92.99,151.95,399.16,Single-ply,SBD,M
Boys,59.87,2,David Villafona,McGregor,59.51,145.15,74.84,156.49,376.48,Single-ply,SBD,M
Boys,59.87,3,Alex Reynoso,West,59.33,138.35,79.38,149.69,367.41,Single-ply,SBD,M
Boys,59.87,4,Greg Norman,Grandview,57.88,122.47,68.04,133.81,324.32,Single-ply,SBD,M
Boys,59.87,5,Jacoby Fortson,Groesbeck,57.42,113.4,81.65,122.47,317.51,Single-ply,SBD,M
Boys,59.87,6,Stephen McNaught,Meridian,57.15,92.99,54.43,113.4,260.82,Single-ply,SBD,M
Boys,67.13,1,James Davis,Waco Connally,66.22,188.24,124.74,204.12,517.1,Single-ply,SBD,M
Boys,74.84,2,Adolfo Rodriguez,West,67.22,199.58,124.74,176.9,501.22,Single-ply,SBD,M
Boys,67.13,3,Jessie Pena,Waco La Vega,61.6,161.03,88.45,195.04,444.52,Single-ply,SBD,M
Boys,67.13,4,Josh Turner,McGregor,66.95,170.1,95.25,167.83,433.18,Single-ply,SBD,M
Boys,67.13,5,Joseph Bryant,Waco La Vega,65.5,149.69,88.45,174.63,412.77,Single-ply,SBD,M
Boys,67.13,6,Dalton Baker,West,66.32,142.88,90.72,163.29,396.89,Single-ply,SBD,M
Boys,67.13,7,Brady Arnett,West,66.04,149.69,86.18,156.49,392.36,Single-ply,SBD,M
Boys,67.13,8,Armando Castaneda,Hillsboro,65.23,133.81,88.45,161.03,383.29,Single-ply,SBD,M
Boys,67.13,9,Joshua Bryant,Waco La Vega,66.59,140.61,74.84,156.49,371.95,Single-ply,SBD,M
Boys,67.13,10,Christian Bares,Whitney,64.77,120.2,83.91,142.88,347,Single-ply,SBD,M
Boys,67.13,11,Patrick Saucedo,Bosqueville,66.68,133.81,74.84,122.47,331.12,Single-ply,SBD,M
Boys,67.13,12,Traetin Turrubiarte,Groesbeck,62.14,88.45,61.23,131.54,281.23,Single-ply,SBD,M
Boys,67.13,DQ,Jalyn Holloway,Waco Connally,62.6,,,,,Single-ply,SBD,M
Boys,74.84,1,Devyn Hebbe,Axtell,73.75,254.01,102.06,217.72,573.79,Single-ply,SBD,M
Boys,74.84,2,Camry Garner,Hillsboro,74.84,204.12,120.2,219.99,544.31,Single-ply,SBD,M
Boys,74.84,3,Nate Seale,McGregor,72.94,190.51,111.13,213.19,514.83,Single-ply,SBD,M
Boys,74.84,4,Jeremy Hall,Rio Vista,74.48,181.44,102.06,181.44,464.93,Single-ply,SBD,M
Boys,74.84,5,Alex Smith #9,Bosqueville,74.84,181.44,102.06,170.1,453.59,Single-ply,SBD,M
Boys,74.84,6,Eric Salazar,West,72.85,158.76,113.4,170.1,442.25,Single-ply,SBD,M
Boys,74.84,7,Clayton Wilson #2,West,71.03,163.29,77.11,140.61,381.02,Single-ply,SBD,M
Boys,74.84,8,Mariano Perez,West,73.66,140.61,77.11,147.42,365.14,Single-ply,SBD,M
Boys,74.84,9,Dustin Richter,Bosqueville,68.31,142.88,70.31,145.15,358.34,Single-ply,SBD,M
Boys,74.84,10,Brendan Roark,Groesbeck,70.94,122.47,63.5,136.08,322.05,Single-ply,SBD,M
Boys,74.84,DQ,CJ Smith #2,Crawford,72.48,172.37,,,,Single-ply,SBD,M
Boys,74.84,DQ,Deontre Richardson,Hillsboro,69.49,167.83,,,,Single-ply,SBD,M
Boys,74.84,DQ,Angel Torres #4,Whitney,70.76,154.22,102.06,,,Single-ply,SBD,M
Boys,82.1,1,Barclay Brunson,Crawford,77.84,204.12,117.93,199.58,521.63,Single-ply,SBD,M
Boys,82.1,2,Aaron Harralson,West,79.65,195.04,129.27,183.7,508.02,Single-ply,SBD,M
Boys,82.1,3,Desmond Harris,Waco Connally,78.2,195.04,102.06,183.7,480.81,Single-ply,SBD,M
Boys,82.1,4,Chris Flores,Hillsboro,79.11,176.9,97.52,174.63,449.06,Single-ply,SBD,M
Boys,82.1,5,Jamaica Doyle,Waco Connally,80.2,174.63,92.99,163.29,430.91,Single-ply,SBD,M
Boys,82.1,6,Lance Bracco,Crawford,79.11,145.15,97.52,145.15,387.82,Single-ply,SBD,M
Boys,82.1,7,Dane Mace,McGregor,76.57,138.35,88.45,145.15,371.95,Single-ply,SBD,M
Boys,82.1,8,Dusty Roberts,Groesbeck,78.38,145.15,68.04,138.35,351.53,Single-ply,SBD,M
Boys,82.1,DQ,Myles McGruder,Groesbeck,79.11,195.04,83.91,,,Single-ply,SBD,M
Boys,89.81,DQ,Robert Lammers,Whitney,82.19,161.03,,,,Single-ply,SBD,M
Boys,82.1,DQ,Lorenzo Vargas,Waco Reicher Catholic,80.74,147.42,,,,Single-ply,SBD,M
Boys,99.79,1,Esteban Nunez,Caldwell,89.99,256.28,117.93,249.48,623.69,Single-ply,SBD,M
Boys,89.81,2,Ricky Thompson #1,Robinson,88.54,231.33,127.01,263.08,621.42,Single-ply,SBD,M
Boys,89.81,3,Logan Willenborg,West,84.82,213.19,127.01,226.8,566.99,Single-ply,SBD,M
Boys,89.81,4,Mikey Castillo,McGregor,86.18,215.46,115.67,222.26,553.38,Single-ply,SBD,M
Boys,99.79,5,Corey Kemp,Waco La Vega,90.04,215.46,129.27,188.24,532.97,Single-ply,SBD,M
Boys,89.81,6,Daniel Fraire,West,86.27,217.72,113.4,176.9,508.02,Single-ply,SBD,M
Boys,89.81,7,Dustin Brown,Waco La Vega,89.09,181.44,122.47,188.24,492.15,Single-ply,SBD,M
Boys,89.81,8,Taivunn Briscoe,Waco Connally,88.63,176.9,111.13,197.31,485.34,Single-ply,SBD,M
Boys,89.81,9,Timothy Thomas,Whitney,85.55,195.04,90.72,188.24,474,Single-ply,SBD,M
Boys,89.81,10,Matt Sparks,West,88.63,156.49,77.11,131.54,365.14,Single-ply,SBD,M
Boys,89.81,11,Rogelio Vavara,Caldwell,87.36,136.08,65.77,136.08,337.93,Single-ply,SBD,M
Boys,89.81,12,Garrett Underwood,Caldwell,87.36,104.33,58.97,120.2,283.5,Single-ply,SBD,M
Boys,89.81,DQ,Ethan Lopez,Waco La Vega,88.36,204.12,,,,Single-ply,SBD,M
Boys,99.79,1,Erick Marton,Axtell,95.07,224.53,108.86,226.8,560.19,Single-ply,SBD,M
Boys,99.79,2,Alex Parsons,McGregor,90.99,213.19,124.74,199.58,537.51,Single-ply,SBD,M
Boys,99.79,3,Eric Rosson,Grandview,90.54,204.12,99.79,161.03,464.93,Single-ply,SBD,M
Boys,99.79,4,Will Worrell,Crawford,91.99,195.04,99.79,165.56,460.4,Single-ply,SBD,M
Boys,99.79,5,Luis Reyes,McGregor,94.08,181.44,97.52,172.37,451.32,Single-ply,SBD,M
Boys,99.79,6,Blake Picha,West,99.25,165.56,97.52,156.49,419.57,Single-ply,SBD,M
Boys,109.77,7,Spencer Lammons,Groesbeck,99.97,172.37,86.18,158.76,417.3,Single-ply,SBD,M
Boys,99.79,8,Dalton Zander,Bosqueville,97.79,140.61,79.38,136.08,356.07,Single-ply,SBD,M
Boys,99.79,DQ,Jason Marroquin,Axtell,94.62,215.46,,,,Single-ply,SBD,M
Boys,99.79,DQ,Eduarado Cruz,Hillsboro,92.08,258.55,,,,Single-ply,SBD,M
Boys,99.79,DQ,Justin Wardlow,Whitney,92.71,165.56,,,,Single-ply,SBD,M
Boys,99.79,DQ,Chaas Firth,Whitney,94.98,,,,,Single-ply,SBD,M
Boys,109.77,1,Jason Harris,West,104.69,272.16,145.15,231.33,648.64,Single-ply,SBD,M
Boys,109.77,2,Bryan Villa,Grandview,106.32,222.26,151.95,208.65,582.87,Single-ply,SBD,M
Boys,109.77,3,Robert Gober,Waco Connally,106.5,238.14,124.74,199.58,562.45,Single-ply,SBD,M
Boys,109.77,4,Logan Prock,Mart,100.97,235.87,124.74,181.44,542.04,Single-ply,SBD,M
Boys,109.77,5,Jared Camp,Grandview,106.23,204.12,120.2,208.65,532.97,Single-ply,SBD,M
Boys,109.77,6,Derrick Oliver,Whitney,109.04,215.46,102.06,188.24,505.76,Single-ply,SBD,M
Boys,109.77,7,Joe Fallwell,Whitney,109.04,165.56,113.4,167.83,446.79,Single-ply,SBD,M
Boys,109.77,8,Tanner Sparks,West,108.68,165.56,97.52,163.29,426.38,Single-ply,SBD,M
Boys,109.77,9,Payton Price #1,Grandview,102.51,163.29,102.06,142.88,408.23,Single-ply,SBD,M
Boys,109.77,10,Travis Ferrare,Hillsboro,102.69,147.42,88.45,154.22,390.09,Single-ply,SBD,M
Boys,109.77,11,Jacob Etheredge,McGregor,104.14,145.15,90.72,138.35,374.21,Single-ply,SBD,M
Boys,124.74,1,Byron Bryant,Waco La Vega,121.83,308.44,167.83,258.55,734.82,Single-ply,SBD,M
Boys,124.74,2,Jordan Rivera,Waco La Vega,115.39,265.35,181.44,231.33,678.12,Single-ply,SBD,M
Boys,124.74,3,Roberto Requena,Caldwell,118.12,260.82,154.22,254.01,669.05,Single-ply,SBD,M
Boys,124.74,4,Colton Robinett,Groesbeck,115.39,240.4,136.08,222.26,598.74,Single-ply,SBD,M
Boys,124.74,5,Ishmael Ramirez,Hillsboro,113.58,219.99,129.27,210.92,560.19,Single-ply,SBD,M
Boys,124.74,6,Charles Chrietzberg,Caldwell,111.67,199.58,129.27,174.63,503.49,Single-ply,SBD,M
Boys,124.74,7,Jairo Rodriguez,Waco La Vega,119.29,195.04,104.33,190.51,489.88,Single-ply,SBD,M
Boys,124.74,8,Ricardo Martinez #5,Rio Vista,112.85,165.56,90.72,170.1,426.38,Single-ply,SBD,M
Boys,124.74,DQ,Gustavo Bonilla,Robinson,124.01,294.84,151.95,,,Single-ply,SBD,M
Boys,124.74,DQ,Andrew Escobedo,Waco La Vega,119.84,244.94,,,,Single-ply,SBD,M
Boys,124.74,DQ,Tyler Flowers,Bosqueville,124.74,222.26,,,,Single-ply,SBD,M
Boys,124.74,DQ,Nate Martin,Whitney,112.49,142.88,79.38,,,Single-ply,SBD,M
Boys,124.74+,1,Chiddy Nwaeze,Waco Connally,135.17,258.55,151.95,210.92,621.42,Single-ply,SBD,M
Boys,124.74+,2,Narciso Molina,Waco Connally,140.34,242.67,122.47,197.31,562.45,Single-ply,SBD,M
Boys,124.74+,3,Jaylen Tobler,Waco Connally,159.76,249.48,104.33,136.08,489.88,Single-ply,SBD,M
