Division,WeightClassKg,Place,Name,Team,BodyweightKg,Best3SquatKg,Best3BenchKg,Best3DeadliftKg,TotalKg,Equipment,Event,Sex
Boys,51.71,1,Hector Villegas,Roma,50.98,151.95,74.84,163.29,390.09,Single-ply,SBD,M
Boys,51.71,2,Nikalus Rosell,Laredo Alexander,46.9,104.33,56.7,111.13,272.16,Single-ply,SBD,M
Boys,55.79,1,Edgar Barbosa,Laredo Cigarroa,55.57,185.97,111.13,179.17,476.27,Single-ply,SBD,M
Boys,55.79,2,Jesus Trevino,Zapata,55.02,124.74,70.31,151.95,347,Single-ply,SBD,M
Boys,59.87,3,Luis Garza,Laredo Nixon,55.93,90.72,52.16,124.74,267.62,Single-ply,SBD,M
Boys,55.79,DQ,Roger Lozano,Roma,55.79,,,,,Single-ply,SBD,M
Boys,55.79,DQ,Diego Cantu,Roma,55.79,,,,,Single-ply,SBD,M
Boys,59.87,1,Jerry Alaniz,Laredo Alexander,58.97,235.87,131.54,210.92,578.33,Single-ply,SBD,M
Boys,59.87,2,Eric Oliva,Laredo United South,57.92,181.44,108.86,190.51,480.81,Single-ply,SBD,M
Boys,59.87,3,Jonathan Pena,Laredo United South,59.19,163.29,102.06,176.9,442.25,Single-ply,SBD,M
Boys,59.87,4,Isaac Castillo,Laredo Cigarroa,59.69,161.03,79.38,172.37,412.77,Single-ply,SBD,M
Boys,59.87,5,Maclovio Gomez,Zapata,58.38,122.47,70.31,151.95,344.73,Single-ply,SBD,M
Boys,74.84,1,Cesar Alfaro,Laredo United South,67.27,199.58,145.15,222.26,566.99,Single-ply,SBD,M
Boys,67.13,2,David Lopez,Laredo United South,64.68,199.58,138.35,222.26,560.19,Single-ply,SBD,M
Boys,67.13,3,Juan Gonzalez,Alice,66.54,197.31,113.4,192.78,503.49,Single-ply,SBD,M
Boys,67.13,4,Jesus A Gomez,Roma,67.09,165.56,106.59,192.78,464.93,Single-ply,SBD,M
Boys,67.13,5,Jairo Morales,Laredo Cigarroa,61.14,174.63,95.25,192.78,462.66,Single-ply,SBD,M
Boys,67.13,6,Daniel Hernandez,Laredo Nixon,64.68,158.76,81.65,190.51,430.91,Single-ply,SBD,M
Boys,67.13,7,Ricardo Espinoza,Laredo Cigarroa,66.63,151.95,83.91,170.1,405.97,Single-ply,SBD,M
Boys,67.13,8,Adrian Garcia,Roma,66.32,167.83,81.65,151.95,401.43,Single-ply,SBD,M
Boys,67.13,9,Albert Estrada,Laredo Martin,65.14,133.81,113.4,145.15,392.36,Single-ply,SBD,M
Boys,67.13,10,Peter Cavazos,Laredo Nixon,64.68,136.08,74.84,179.17,390.09,Single-ply,SBD,M
Boys,67.13,11,Juan Carmona,Laredo Nixon,61.51,124.74,79.38,154.22,358.34,Single-ply,SBD,M
Boys,67.13,12,Jose Rodriguez #1,Laredo Nixon,65.09,115.67,68.04,108.86,292.57,Single-ply,SBD,M
Boys,67.13,DQ,Leroy Sustaita,Laredo Martin,67.13,,,,,Single-ply,SBD,M
Boys,67.13,DQ,Alfredo Resendiz,Zapata,62.32,,,,,Single-ply,SBD,M
Boys,74.84,1,Josue Valdez,Zapata,73.39,226.8,131.54,219.99,578.33,Single-ply,SBD,M
Boys,74.84,2,Felipe Ramirez,Laredo Johnson,73.35,195.04,106.59,217.72,519.36,Single-ply,SBD,M
Boys,74.84,3,Mike Alvarez,Zapata,67.86,183.7,104.33,195.04,483.08,Single-ply,SBD,M
Boys,74.84,4,Xavione Skaggs,Laredo Alexander,71.49,190.51,108.86,183.7,483.08,Single-ply,SBD,M
Boys,74.84,5,Mark Molina,Laredo Cigarroa,71.44,147.42,65.77,174.63,387.82,Single-ply,SBD,M
Boys,74.84,6,Raul Cabrera,Laredo Cigarroa,73.66,140.61,81.65,163.29,385.55,Single-ply,SBD,M
Boys,74.84,7,Danny Sanchez,Laredo Alexander,69.72,151.95,72.57,156.49,381.02,Single-ply,SBD,M
Boys,74.84,8,Danny DeLeon,Laredo Nixon,70.35,129.27,72.57,154.22,356.07,Single-ply,SBD,M
Boys,74.84,DQ,Edgar Trejo,Laredo United South,74.84,,,,,Single-ply,SBD,M
Boys,74.84,DQ,Jose Mosqueda,Laredo Cigarroa,74.84,,,,,Single-ply,SBD,M
Boys,74.84,DQ,Jose Paredes,Zapata,67.95,,,,,Single-ply,SBD,M
Boys,74.84,DQ,Eric Estrada,Roma,71.21,165.56,108.86,,,Single-ply,SBD,M
Boys,82.1,1,Joel Elizondo,Zapata,79.06,215.46,127.01,219.99,562.45,Single-ply,SBD,M
Boys,89.81,2,Daniel Briones,Laredo United South,82.33,206.38,127.01,222.26,555.65,Single-ply,SBD,M
Boys,82.1,3,Felipe Hernández #4,Laredo United,81.87,222.26,127.01,195.04,544.31,Single-ply,SBD,M
Boys,89.81,4,Marco DeLuna,Laredo United South,82.15,206.38,117.93,208.65,532.97,Single-ply,SBD,M
Boys,82.1,5,Jesus Carrasco,Alice,80.88,192.78,106.59,229.06,528.44,Single-ply,SBD,M
Boys,82.1,6,Frank Garcia,Laredo Martin,81.37,206.38,104.33,208.65,519.36,Single-ply,SBD,M
Boys,82.1,7,Pedro Diaz,Laredo Alexander,81.69,179.17,122.47,174.63,476.27,Single-ply,SBD,M
Boys,82.1,8,Randal Hinojosa,Laredo Alexander,80.15,181.44,102.06,174.63,458.13,Single-ply,SBD,M
Boys,82.1,9,Jaime Hinojosa,Laredo Alexander,80.47,179.17,81.65,179.17,439.98,Single-ply,SBD,M
Boys,89.81,10,Javier Botello,Laredo Nixon,82.28,138.35,92.99,172.37,403.7,Single-ply,SBD,M
Boys,82.1,11,Norman Madrigal,Laredo Johnson,75.25,120.2,74.84,154.22,349.27,Single-ply,SBD,M
Boys,99.79,1,Leo Adams,Alice,89.86,210.92,156.49,208.65,576.06,Single-ply,SBD,M
Boys,89.81,2,Victor Ramos,Laredo United South,84.59,219.99,127.01,226.8,573.79,Single-ply,SBD,M
Boys,89.81,3,Jonathan Vela,Roma,88.41,210.92,129.27,208.65,548.85,Single-ply,SBD,M
Boys,89.81,4,Tony Zapata,Alice,89.45,208.65,113.4,188.24,510.29,Single-ply,SBD,M
Boys,89.81,5,Jose Anaya,Laredo United South,88,204.12,97.52,190.51,492.15,Single-ply,SBD,M
Boys,89.81,6,Benito Orozco,Laredo Martin,84.41,183.7,120.2,179.17,483.08,Single-ply,SBD,M
Boys,89.81,7,Eugenio Perez,Laredo Alexander,87.82,181.44,120.2,181.44,483.08,Single-ply,SBD,M
Boys,89.81,8,Marte Guerra,Roma,88.99,170.1,102.06,174.63,446.79,Single-ply,SBD,M
Boys,89.81,9,Cecilio Garcia,Laredo Nixon,88.59,149.69,97.52,163.29,410.5,Single-ply,SBD,M
Boys,89.81,10,Joshua Juarez,Laredo Johnson,84.96,122.47,81.65,147.42,351.53,Single-ply,SBD,M
Boys,99.79,1,Mark Duron,Laredo Martin,96.66,265.35,172.37,238.14,675.85,Single-ply,SBD,M
Boys,99.79,2,Marco Banda,Laredo Nixon,95.12,260.82,138.35,235.87,635.03,Single-ply,SBD,M
Boys,99.79,3,Paul Gonzalez,Laredo United South,99.25,229.06,151.95,217.72,598.74,Single-ply,SBD,M
Boys,99.79,4,Isael Claudio,Laredo Cigarroa,96.98,206.38,131.54,226.8,564.72,Single-ply,SBD,M
Boys,99.79,5,Joseph Guerra,Laredo Alexander,96.66,204.12,149.69,199.58,553.38,Single-ply,SBD,M
Boys,99.79,6,Rogelio Rodriguez,Zapata,99.79,190.51,113.4,217.72,521.63,Single-ply,SBD,M
Boys,99.79,7,Juan Chavez,Laredo Martin,91.53,183.7,95.25,199.58,478.54,Single-ply,SBD,M
Boys,99.79,8,Lucio Melo,Zapata,99.06,190.51,88.45,183.7,462.66,Single-ply,SBD,M
Boys,99.79,9,Danny Cardona,Laredo United,97.75,165.56,99.79,195.04,460.4,Single-ply,SBD,M
Boys,99.79,10,Jose Lugo,Laredo United South,90.45,185.97,102.06,158.76,446.79,Single-ply,SBD,M
Boys,99.79,11,Valentin Palomares,Laredo Johnson,98.66,172.37,70.31,190.51,433.18,Single-ply,SBD,M
Boys,99.79,12,Apolonio Andrade,Roma,99.61,181.44,92.99,154.22,428.64,Single-ply,SBD,M
Boys,99.79,DQ,Luis Martinez,Zapata,99.29,,,,,Single-ply,SBD,M
Boys,99.79,DQ,Jordy Velasquez,Laredo Johnson,95.35,,90.72,,,Single-ply,SBD,M
Boys,99.79,DQ,Eduardo Lopez,Laredo Johnson,94.35,,92.99,,,Single-ply,SBD,M
Boys,109.77,1,Santos Alvarado,Laredo United,109.18,249.48,147.42,226.8,623.69,Single-ply,SBD,M
Boys,109.77,2,Elhim Hernandez,Laredo United,109,242.67,151.95,222.26,616.89,Single-ply,SBD,M
Boys,109.77,3,Christian Rosas,Laredo Alexander,105.23,226.8,140.61,229.06,596.47,Single-ply,SBD,M
Boys,109.77,4,Warren Oaks,Alice,107.46,213.19,165.56,213.19,591.94,Single-ply,SBD,M
Boys,109.77,5,Silvestre Bustamante,Zapata,101.02,204.12,140.61,190.51,535.24,Single-ply,SBD,M
Boys,109.77,6,Orly Rodriguez,Laredo Cigarroa,102.24,183.7,108.86,222.26,514.83,Single-ply,SBD,M
Boys,109.77,7,Victor Daniel Nenque,Laredo Nixon,106.59,206.38,115.67,183.7,505.76,Single-ply,SBD,M
Boys,109.77,8,Jesus Lopez,Laredo Johnson,105.91,174.63,117.93,181.44,474,Single-ply,SBD,M
Boys,109.77,9,Mario Torres,Laredo Johnson,107.55,174.63,72.57,185.97,433.18,Single-ply,SBD,M
Boys,109.77,10,Jose Barbarena,Laredo Nixon,103.56,163.29,99.79,163.29,426.38,Single-ply,SBD,M
Boys,109.77,11,Jorge Rodriguez,Zapata,107.68,124.74,83.91,142.88,351.53,Single-ply,SBD,M
Boys,124.74,1,Frank Moreno,Zapata,123.29,290.3,156.49,258.55,705.34,Single-ply,SBD,M
Boys,124.74,2,Juan Macias,Alice,116.66,249.48,156.49,210.92,616.89,Single-ply,SBD,M
Boys,124.74,3,Ruben Hinojosa,Roma,124.69,249.48,120.2,222.26,591.94,Single-ply,SBD,M
Boys,124.74,4,Manuel Navarro,Zapata,124.28,226.8,149.69,199.58,576.06,Single-ply,SBD,M
Boys,124.74,5,Gilbert Hernandez,Laredo Cigarroa,116.57,226.8,136.08,204.12,566.99,Single-ply,SBD,M
Boys,124.74,6,Jacob Chapa,Bruni,111.13,231.33,122.47,197.31,551.11,Single-ply,SBD,M
Boys,124.74,7,Jerry Gonzalez,Laredo Nixon,122.97,208.65,127.01,195.04,530.7,Single-ply,SBD,M
Boys,124.74,DQ,Faustino Beltran,Roma,124.74,,,,,Single-ply,SBD,M
Boys,124.74,DQ,Alvaro Ramos,Laredo Johnson,110.9,167.83,79.38,,,Single-ply,SBD,M
Boys,124.74+,1,Rudy Flores,Laredo United South,138.35,283.5,163.29,260.82,707.6,Single-ply,SBD,M
Boys,124.74+,2,Jose Flores #2,Laredo Cigarroa,130.68,256.28,170.1,274.42,700.8,Single-ply,SBD,M
Boys,124.74+,3,Eduardo Sanchez,Zapata,138.57,249.48,165.56,219.99,635.03,Single-ply,SBD,M
Boys,124.74+,4,Jerry Urdiales,Laredo Nixon,140.07,242.67,113.4,219.99,576.06,Single-ply,SBD,M
Boys,124.74+,5,Leo Espinoza,Laredo Martin,141.88,183.7,111.13,213.19,508.02,Single-ply,SBD,M
Boys,124.74+,6,Hector Velasquez,Laredo Johnson,137.71,161.03,102.06,183.7,446.79,Single-ply,SBD,M
Boys,124.74+,7,Omar Santos,Laredo Johnson,131.95,145.15,99.79,172.37,417.3,Single-ply,SBD,M
