Division,WeightClassKg,Place,Name,Team,BodyweightKg,Best3SquatKg,Best3BenchKg,Best3DeadliftKg,TotalKg,Equipment,Event,Sex,BirthDate
Boys,51.71,1,Adam Gage,East Bernard,40.91,63.5,31.75,72.57,167.83,Single-ply,SBD,M,
Boys,59.87,1,Diego Manteca,Waller,59.6,167.83,92.99,151.95,412.77,Single-ply,SBD,M,
Boys,59.87,2,Troy Hubbard,Waller,59.87,145.15,79.38,147.42,371.95,Single-ply,SBD,M,
Boys,67.13,1,Evan Wilson,East Bernard,64.05,122.47,74.84,136.08,333.39,Single-ply,SBD,M,
Boys,67.13,2,Caden Zarate,East Bernard,66.09,120.2,79.38,124.74,324.32,Single-ply,SBD,M,
Boys,67.13,3,Connor Gertson,East Bernard,67.13,106.59,47.63,113.4,267.62,Single-ply,SBD,M,
Boys,74.84,1,Miguel Garcia-Garcia,Waller,71.58,183.7,117.93,174.63,476.27,Single-ply,SBD,M,
Boys,74.84,2,Cooper Potts,East Bernard,71.94,120.2,68.04,127.01,315.25,Single-ply,SBD,M,
Boys,82.1,1,Jacob Dains,Waller,80.47,183.7,106.59,206.38,496.68,Single-ply,SBD,M,
Boys,82.1,2,Braden Turner,Katy Mayde Creek,82.1,170.1,102.06,181.44,453.59,Single-ply,SBD,M,
Boys,82.1,3,Luis Sanchez,Katy Mayde Creek,78.38,158.76,104.33,147.42,410.5,Single-ply,SBD,M,
Boys,82.1,4,Sam Potts,East Bernard,81.56,102.06,68.04,145.15,315.25,Single-ply,SBD,M,
Boys,82.1,DQ,Zach Phipps,Waller,79.97,210.92,,197.31,,Single-ply,SBD,M,
Boys,89.81,1,Ryan Garcia,Waller,89.13,192.78,136.08,174.63,503.49,Single-ply,SBD,M,
Boys,89.81,2,Kolby Karsteter,Waller,87.86,174.63,108.86,176.9,460.4,Single-ply,SBD,M,
Boys,89.81,3,Joshua Simpson,Waller,87.82,167.83,97.52,183.7,449.06,Single-ply,SBD,M,
Boys,99.79,1,Erik Cornejo,Waller,96.66,226.8,111.13,192.78,530.7,Single-ply,SBD,M,
Boys,99.79,2,Jairo Garcia,Waller,97.3,183.7,117.93,201.85,503.49,Single-ply,SBD,M,
Boys,99.79,3,Zachary Zimmerman,East Bernard,90.49,111.13,83.91,142.88,337.93,Single-ply,SBD,M,
Boys,99.79,4,Rocky Ruiz,East Bernard,99.02,108.86,68.04,120.2,297.1,Single-ply,SBD,M,
Boys,99.79,DQ,Nicolas Buena,Katy Mayde Creek,96.62,195.04,,183.7,,Single-ply,SBD,M,
Boys,109.77,1,Chidi Adighibe,Katy Mayde Creek,105.6,240.4,142.88,204.12,587.4,Single-ply,SBD,M,
Boys,109.77,2,Leighton Geiman,Waller,109.23,172.37,97.52,183.7,453.59,Single-ply,SBD,M,
Boys,109.77,3,Chris Morales,Katy Mayde Creek,106.14,165.56,90.72,165.56,421.84,Single-ply,SBD,M,
Boys,109.77,DQ,Tamarcus Sanders,East Bernard,107.68,124.74,,102.06,,Single-ply,SBD,M,
Boys,124.74,1,Manuel Acosta,Katy Mayde Creek,111.49,190.51,113.4,185.97,489.88,Single-ply,SBD,M,
Boys,124.74,2,Jaiden Stevens,Waller,114.58,181.44,97.52,204.12,483.08,Single-ply,SBD,M,
Boys,124.74,3,Ahmad Sneed,Katy Mayde Creek,115.58,149.69,86.18,124.74,360.61,Single-ply,SBD,M,
Boys,124.74,DQ,James Leguerre,Katy Mayde Creek,116.39,188.24,,156.49,,Single-ply,SBD,M,
Boys,139.71,1,Jonathan Price,Katy Mayde Creek,135.35,170.1,124.74,183.7,478.54,Single-ply,SBD,M,
