Division,WeightClassKg,Place,Name,Team,BodyweightKg,Best3SquatKg,Best3BenchKg,Best3DeadliftKg,TotalKg,Equipment,Event,Sex,BirthDate
Boys,55.79,1,Caleb Webb,Wills Point,55.34,145.15,90.72,147.42,383.29,Single-ply,SBD,M,
Boys,55.79,2,Minh Nguyen,Mabank,55.79,113.4,52.16,117.93,283.5,Single-ply,SBD,M,
Boys,59.87,DQ,Sheldon Taylor,Wills Point,59.69,102.06,,,,Single-ply,SBD,M,
Boys,67.13,1,Ruger Cates,Wills Point,66.95,188.24,111.13,158.76,458.13,Single-ply,SBD,M,
Boys,67.13,2,Alex Gonzalez #3,Mabank,66.95,181.44,102.06,165.56,449.06,Single-ply,SBD,M,
Boys,74.84,1,Monty Vandemeer,Wills Point,70.67,170.1,99.79,170.1,439.98,Single-ply,SBD,M,
Boys,82.1,1,Brandon Browning,Mabank,79.02,226.8,138.35,199.58,564.72,Single-ply,SBD,M,
Boys,82.1,2,Christian Morales,Mabank,81.74,185.97,145.15,179.17,510.29,Single-ply,SBD,M,
Boys,89.81,1,Caleb Chase,Mabank,86.09,217.72,131.54,185.97,535.24,Single-ply,SBD,M,
Boys,89.81,2,Dylan Stairs,Mabank,88.9,199.58,136.08,190.51,526.17,Single-ply,SBD,M,
Boys,99.79,1,Kaizen Burrows,Mabank,95.53,229.06,136.08,192.78,557.92,Single-ply,SBD,M,
Boys,99.79,2,Braylon Vick,Terrell,97.89,229.06,115.67,192.78,537.51,Single-ply,SBD,M,
Boys,99.79,3,Damon Dunbar,Terrell,99.52,229.06,92.99,197.31,519.36,Single-ply,SBD,M,
Boys,109.77,1,Brayden Smith,Midlothian,109.04,247.21,161.03,249.48,657.71,Single-ply,SBD,M,
Boys,109.77,2,Dakota Ryder,Wills Point,106.23,213.19,131.54,188.24,532.97,Single-ply,SBD,M,
Boys,109.77,3,Hearsey McGrady,Terrell,108.14,197.31,111.13,183.7,492.15,Single-ply,SBD,M,
Boys,109.77,4,Dean Henderson,Terrell,103.33,188.24,92.99,204.12,485.34,Single-ply,SBD,M,
Boys,124.74,1,Rafael Page,Mabank,124.56,229.06,124.74,190.51,544.31,Single-ply,SBD,M,
Boys,124.74,2,Anthony Wynne,Terrell,122.92,176.9,106.59,183.7,467.2,Single-ply,SBD,M,
Boys,139.71,1,Kade Tompkins,Midlothian,134.81,226.8,151.95,226.8,605.55,Single-ply,SBD,M,
Boys,139.71+,1,Kenneth Teters,Midlothian,183.07,281.23,147.42,226.8,655.44,Single-ply,SBD,M,
Boys,139.71+,2,Josh Nwanka,Terrell,157.4,174.63,142.88,192.78,510.29,Single-ply,SBD,M,
