Division,WeightClassKg,Place,Name,Team,BodyweightKg,Best3SquatKg,Best3BenchKg,Best3DeadliftKg,TotalKg,Equipment,Event,Sex,BirthDate
Boys,51.71,1,Tyler Vu,Dickinson,49.99,115.67,58.97,113.4,288.03,Single-ply,SBD,M,
Boys,55.79,1,Mason Myers,Santa Fe,55.79,111.13,65.77,136.08,312.98,Single-ply,SBD,M,
Boys,59.87,1,Anthony Garcia,Alvin,59.87,195.04,83.91,183.7,462.66,Single-ply,SBD,M,
Boys,59.87,2,Jim Gomez,Dickinson,59.87,167.83,79.38,183.7,430.91,Single-ply,SBD,M,
Boys,59.87,3,Josyah Dekelaita,Dickinson,59.87,147.42,74.84,158.76,381.02,Single-ply,SBD,M,
Boys,59.87,4,Oscar Cruz,Alvin Shadow Creek,58.33,115.67,70.31,142.88,328.85,Single-ply,SBD,M,
Boys,59.87,DQ,Aiden Pless,Santa Fe,59.06,115.67,,124.74,,Single-ply,SBD,M,
Boys,67.13,1,Daniel García,Dickinson,66.22,188.24,117.93,226.8,532.97,Single-ply,SBD,M,
Boys,67.13,2,Jesus Alaniz,Alvin,65.59,199.58,77.11,192.78,469.47,Single-ply,SBD,M,
Boys,67.13,3,David Jimenez,Alvin Shadow Creek,63.5,183.7,90.72,183.7,458.13,Single-ply,SBD,M,
Boys,67.13,4,Xzavier Guerro,Alvin,65.5,179.17,97.52,176.9,453.59,Single-ply,SBD,M,
Boys,67.13,5,Jayden DeKelaita,Dickinson,66.5,174.63,88.45,183.7,446.79,Single-ply,SBD,M,
Boys,67.13,6,Mehkyi Carman,Pearland Dawson,66.68,151.95,97.52,156.49,405.97,Single-ply,SBD,M,
Boys,67.13,7,Jaden Beck,Alvin Shadow Creek,65.59,142.88,95.25,138.35,376.48,Single-ply,SBD,M,
Boys,67.13,8,Jordyn Crouch,Santa Fe,66.77,120.2,88.45,129.27,337.93,Single-ply,SBD,M,
Boys,67.13,9,Jaxson Hicks,Santa Fe,67.13,124.74,83.91,117.93,326.59,Single-ply,SBD,M,
Boys,67.13,10,Vincent Mai,Pearland Dawson,67.13,106.59,43.09,102.06,251.74,Single-ply,SBD,M,
Boys,67.13,DQ,Nicholas Cobos,Santa Fe,67.13,111.13,,,,Single-ply,SBD,M,
Boys,74.84,1,Bladdin Hill,Dickinson,74.48,219.99,131.54,215.46,566.99,Single-ply,SBD,M,
Boys,74.84,2,Chris Garcia,Santa Fe,74.84,190.51,113.4,192.78,496.68,Single-ply,SBD,M,
Boys,74.84,3,Joshua Murphy,Alvin,71.67,188.24,120.2,183.7,492.15,Single-ply,SBD,M,
Boys,74.84,4,Logan Alegria,Alvin,70.22,174.63,95.25,195.04,464.93,Single-ply,SBD,M,
Boys,74.84,5,Michael Aguirre,Alvin,69.76,161.03,102.06,174.63,437.72,Single-ply,SBD,M,
Boys,74.84,6,Diego Battles,Texas City,68.4,138.35,83.91,142.88,365.14,Single-ply,SBD,M,
Boys,74.84,7,Samuel Fernandez,Alvin,74.48,140.61,81.65,127.01,349.27,Single-ply,SBD,M,
Boys,82.1,1,LaMarcus Owens,Manvel,80.47,229.06,131.54,244.94,605.55,Single-ply,SBD,M,
Boys,82.1,2,Cace Jones,Dickinson,80.65,235.87,117.93,233.6,587.4,Single-ply,SBD,M,
Boys,82.1,3,Aden Arredondo,Dickinson,81.74,226.8,138.35,217.72,582.87,Single-ply,SBD,M,
Boys,82.1,4,Zayne Shepherd,Texas City,80.01,204.12,120.2,208.65,532.97,Single-ply,SBD,M,
Boys,82.1,5,Brent Najera,Pearland,81.83,174.63,120.2,213.19,508.02,Single-ply,SBD,M,
Boys,82.1,6,Joseph Floyd,Santa Fe,78.47,183.7,113.4,192.78,489.88,Single-ply,SBD,M,
Boys,82.1,7,Nick Devasier,Texas City,75.84,192.78,111.13,172.37,476.27,Single-ply,SBD,M,
Boys,82.1,8,Hakeem Shitta-Bey,Pearland Dawson,81.19,140.61,113.4,215.46,469.47,Single-ply,SBD,M,
Boys,82.1,9,Joshua Roberson,Alvin Shadow Creek,80.01,165.56,92.99,201.85,460.4,Single-ply,SBD,M,
Boys,82.1,10,Brendan Herrera,Pearland,81.37,161.03,104.33,174.63,439.98,Single-ply,SBD,M,
Boys,82.1,11,Angel Hernandez #5,Alvin,78.47,167.83,90.72,172.37,430.91,Single-ply,SBD,M,
Boys,82.1,12,Carlos Ibarra,Alvin,82.1,151.95,83.91,165.56,401.43,Single-ply,SBD,M,
Boys,82.1,13,Benjamin Cherian,Alvin Shadow Creek,76.38,138.35,63.5,165.56,367.41,Single-ply,SBD,M,
Boys,82.1,14,Ethan Oliver,Santa Fe,81.65,127.01,56.7,149.69,333.39,Single-ply,SBD,M,
Boys,82.1,DQ,Roman Lopez,Texas City,82.1,183.7,,,,Single-ply,SBD,M,
Boys,89.81,1,Nicholas Stoughton,Alvin,87,224.53,151.95,224.53,601.01,Single-ply,SBD,M,
Boys,89.81,2,Jonathan Sagastizado,Dickinson,85.73,235.87,129.27,226.8,591.94,Single-ply,SBD,M,
Boys,89.81,3,Eddie Parker,Alvin,89.72,204.12,161.03,206.38,571.53,Single-ply,SBD,M,
Boys,89.81,4,Jonathan Nation,Pearland Dawson,88.9,215.46,120.2,226.8,562.45,Single-ply,SBD,M,
Boys,89.81,5,Garrett Sassin,Alvin Shadow Creek,89.27,192.78,129.27,208.65,530.7,Single-ply,SBD,M,
Boys,89.81,6,Reese Lehmann,Pearland Dawson,89.45,192.78,97.52,192.78,483.08,Single-ply,SBD,M,
Boys,89.81,7,Bryce Leal,Santa Fe,85.28,142.88,113.4,183.7,439.98,Single-ply,SBD,M,
Boys,89.81,8,Raynaldo Razo,Alvin,87.09,151.95,92.99,190.51,435.45,Single-ply,SBD,M,
Boys,89.81,9,Kie Cicherski,Pearland,89.81,142.88,86.18,206.38,435.45,Single-ply,SBD,M,
Boys,89.81,10,Gaven Guillen,Santa Fe,84.82,129.27,102.06,183.7,415.04,Single-ply,SBD,M,
Boys,89.81,11,Tytus Vertz,Alvin,85.09,147.42,72.57,154.22,374.21,Single-ply,SBD,M,
Boys,89.81,12,Edgar Hernandez,Santa Fe,84.37,115.67,120.2,113.4,349.27,Single-ply,SBD,M,
Boys,89.81,13,Tyler Garza,Santa Fe,87.54,124.74,68.04,147.42,340.19,Single-ply,SBD,M,
Boys,89.81,DQ,Jamal Grey,Texas City,87.54,233.6,120.2,,,Single-ply,SBD,M,
Boys,99.79,1,Demontae Seymore,Manvel,92.71,249.48,158.76,249.48,657.71,Single-ply,SBD,M,
Boys,99.79,2,Emilio Martinez,Dickinson,99.79,238.14,117.93,226.8,582.87,Single-ply,SBD,M,
Boys,99.79,3,Erik Sandoval,Texas City,96.52,226.8,127.01,192.78,546.58,Single-ply,SBD,M,
Boys,99.79,4,Tony Teeples,Texas City,97.89,204.12,120.2,215.46,539.77,Single-ply,SBD,M,
Boys,99.79,5,Isaiah Trigo,Alvin,99.79,206.38,122.47,199.58,528.44,Single-ply,SBD,M,
Boys,99.79,6,Ivan Acuna,Alvin,96.07,208.65,124.74,192.78,526.17,Single-ply,SBD,M,
Boys,99.79,7,Christian Montalvo,Alvin,99.79,201.85,106.59,204.12,512.56,Single-ply,SBD,M,
Boys,99.79,8,James Shanks,Pearland,98.52,158.76,120.2,197.31,476.27,Single-ply,SBD,M,
Boys,99.79,9,Chris Moctezuma,Santa Fe,93.26,167.83,97.52,172.37,437.72,Single-ply,SBD,M,
Boys,99.79,10,Jacob Hedge,Pearland Dawson,98.97,161.03,106.59,165.56,433.18,Single-ply,SBD,M,
Boys,99.79,11,Ray Soliz,Texas City,99.61,158.76,92.99,142.88,394.63,Single-ply,SBD,M,
Boys,99.79,12,Alboury Ndao,Pearland Dawson,99.79,151.95,74.84,165.56,392.36,Single-ply,SBD,M,
Boys,99.79,13,Chris Macias,Alvin,99.34,140.61,90.72,156.49,387.82,Single-ply,SBD,M,
Boys,99.79,14,Salvador Chapa,Santa Fe,91.99,124.74,74.84,136.08,335.66,Single-ply,SBD,M,
Boys,109.77,1,Charlie Fox,Alvin,109.68,265.35,165.56,222.26,653.17,Single-ply,SBD,M,
Boys,109.77,2,Jesus Acuna,Alvin,106.41,219.99,142.88,199.58,562.45,Single-ply,SBD,M,
Boys,109.77,3,Josh Diaz,Alvin Shadow Creek,109.32,197.31,147.42,192.78,537.51,Single-ply,SBD,M,
Boys,109.77,4,Nathan Guerra,Texas City,101.6,210.92,124.74,183.7,519.36,Single-ply,SBD,M,
Boys,109.77,5,Leirone Ramsey,Pearland,109.23,183.7,102.06,176.9,462.66,Single-ply,SBD,M,
Boys,109.77,6,Jd Sulivan,Santa Fe,106.78,183.7,88.45,172.37,444.52,Single-ply,SBD,M,
Boys,124.74,1,Luis Morales,Pearland,124.74,240.4,117.93,240.4,598.74,Single-ply,SBD,M,
Boys,124.74,2,Michael Gonzales,Dickinson,121.74,235.87,147.42,208.65,591.94,Single-ply,SBD,M,
Boys,124.74,3,Aiden Demmon,Pearland,123.92,192.78,113.4,240.4,546.58,Single-ply,SBD,M,
Boys,124.74,4,Damon Stevens,Texas City,114.85,204.12,129.27,183.7,517.1,Single-ply,SBD,M,
Boys,124.74,5,Rodrigo Godinez,Alvin,111.77,127.01,102.06,195.04,424.11,Single-ply,SBD,M,
Boys,124.74,6,Mike Pantalion,Santa Fe,118.93,156.49,102.06,165.56,424.11,Single-ply,SBD,M,
Boys,124.74,7,Julian Rodriguez,Alvin Shadow Creek,112.85,147.42,97.52,161.03,405.97,Single-ply,SBD,M,
Boys,139.71,1,Dylan Hughes,Alvin Shadow Creek,130.82,274.42,179.17,269.89,723.48,Single-ply,SBD,M,
Boys,139.71,2,John Fletcher,Manvel,133.81,229.06,163.29,235.87,628.23,Single-ply,SBD,M,
Boys,139.71,3,David Escobedo,Pearland Dawson,139.25,192.78,142.88,172.37,508.02,Single-ply,SBD,M,
Boys,139.71,4,Clint Fogie,Pearland Dawson,138.98,210.92,102.06,183.7,496.68,Single-ply,SBD,M,
Boys,139.71,5,Christian Argo,Pearland,139.34,183.7,117.93,185.97,487.61,Single-ply,SBD,M,
Boys,139.71,6,Elgueda Francisco,Alvin Shadow Creek,133.27,163.29,124.74,181.44,469.47,Single-ply,SBD,M,
Boys,139.71+,1,Josiah Mason,Dickinson,140.7,269.89,183.7,208.65,662.24,Single-ply,SBD,M,
Boys,139.71+,2,Anthony Reyes,Pearland,141.34,242.67,124.74,229.06,596.47,Single-ply,SBD,M,
Boys,139.71+,3,Chris Herpin,Pearland Dawson,143.24,206.38,120.2,204.12,530.7,Single-ply,SBD,M,
