Division,WeightClassKg,Place,Name,Team,BodyweightKg,Best3SquatKg,Best3BenchKg,Best3DeadliftKg,TotalKg,Equipment,Event,Sex,BirthDate
Boys,51.71,1,Manuel Padilla,Rice,49.99,124.74,77.11,133.81,335.66,Single-ply,SBD,M,
Boys,51.71,2,Giovanny Sanchez,Whitney,49.53,108.86,56.7,145.15,310.71,Single-ply,SBD,M,
Boys,51.71,3,Nguyen Tran,Hillsboro,51.71,113.4,70.31,127.01,310.71,Single-ply,SBD,M,
Boys,51.71,4,Tyler Flower,Venus,50.8,115.67,79.38,113.4,308.44,Single-ply,SBD,M,
Boys,51.71,5,Miguel Pineda,Hillsboro,43.09,102.06,43.09,113.4,258.55,Single-ply,SBD,M,
Boys,51.71,6,Jaxson Tran,Bishop Lynch,48.53,74.84,49.9,102.06,226.8,Single-ply,SBD,M,
Boys,55.79,1,Krissangel Lopez,Rice,55.79,142.88,79.38,167.83,390.09,Single-ply,SBD,M,
Boys,55.79,2,Humberto Gonzalez,Hillsboro,55.79,136.08,68.04,138.35,342.46,Single-ply,SBD,M,
Boys,55.79,3,Danny Pena,San Angelo TLC Academy,53.52,102.06,83.91,115.67,301.64,Single-ply,SBD,M,
Boys,55.79,4,Damien Wooldridge,Italy,55.7,115.67,56.7,129.27,301.64,Single-ply,SBD,M,
Boys,55.79,5,Jot Grant,Rice,52.16,90.72,52.16,102.06,244.94,Single-ply,SBD,M,
Boys,55.79,6,Gael Gonzalez,Hillsboro,53.07,92.99,40.82,102.06,235.87,Single-ply,SBD,M,
Boys,59.87,1,Andrew Santoyo,Rice,59.15,145.15,74.84,158.76,378.75,Single-ply,SBD,M,
Boys,59.87,2,Romeo Silvas,Hillsboro,59.87,151.95,81.65,133.81,367.41,Single-ply,SBD,M,
Boys,59.87,3,Jacob Luna,Bishop Lynch,59.69,127.01,68.04,154.22,349.27,Single-ply,SBD,M,
Boys,59.87,4,John McDowell,Whitney,59.51,115.67,83.91,147.42,347,Single-ply,SBD,M,
Boys,59.87,5,Cody Teasley,Grandview,59.69,120.2,74.84,129.27,324.32,Single-ply,SBD,M,
Boys,59.87,6,Collin Conner,Riesel,58.79,113.4,70.31,136.08,319.78,Single-ply,SBD,M,
Boys,59.87,7,Peyton Hensley,Riesel,57.61,111.13,72.57,127.01,310.71,Single-ply,SBD,M,
Boys,59.87,8,Braeden Rockett,Whitney,56.79,,52.16,106.59,158.76,Single-ply,BD,M,
Boys,67.13,1,Leonardo Lopez,Hillsboro,63.96,197.31,117.93,185.97,501.22,Single-ply,SBD,M,
Boys,67.13,2,Hayden Jensen,Whitney,67.13,181.44,111.13,181.44,474,Single-ply,SBD,M,
Boys,67.13,3,Anthony Berrones,Grandview,65.59,170.1,111.13,170.1,451.32,Single-ply,SBD,M,
Boys,67.13,4,Alejandro Sanchez,Hillsboro,64.41,131.54,77.11,149.69,358.34,Single-ply,SBD,M,
Boys,67.13,5,Aaron Hernandez,Venus,65.77,131.54,83.91,136.08,351.53,Single-ply,SBD,M,
Boys,67.13,6,Braden Wohleb,Whitney,60.69,113.4,79.38,136.08,328.85,Single-ply,SBD,M,
Boys,67.13,7,Jarin VanLandingham,Whitney,61.6,104.33,68.04,136.08,308.44,Single-ply,SBD,M,
Boys,67.13,8,Sam Butts,Oakridge School,63.14,86.18,52.16,111.13,249.48,Single-ply,SBD,M,
Boys,67.13,DQ,Evan Hicks,Riesel,64.86,,,,,Single-ply,SBD,M,
Boys,67.13,DQ,Landyn Ainsworth,Grandview,62.23,,,,,Single-ply,SBD,M,
Boys,74.84,1,Ricardo Martinez,Hillsboro,74.39,224.53,138.35,229.06,591.94,Single-ply,SBD,M,
Boys,74.84,2,Colton Monroe,Bishop Lynch,73.84,226.8,127.01,226.8,580.6,Single-ply,SBD,M,
Boys,74.84,3,Hudson Ross,Grandview,74.84,170.1,120.2,183.7,474,Single-ply,SBD,M,
Boys,74.84,4,Dalton Wooten,Whitney,71.03,158.76,127.01,181.44,467.2,Single-ply,SBD,M,
Boys,74.84,5,Alejandro Mejia,Venus,71.03,190.51,120.2,154.22,464.93,Single-ply,SBD,M,
Boys,74.84,6,Caleb Wynn,Rio Vista,74.12,156.49,92.99,165.56,415.04,Single-ply,SBD,M,
Boys,74.84,7,Juan Galindo,Rice,70.4,145.15,86.18,151.95,383.29,Single-ply,SBD,M,
Boys,74.84,8,Jayden Jones,Bishop Lynch,72.57,113.4,68.04,124.74,306.17,Single-ply,SBD,M,
Boys,74.84,9,Henry Beck,Oakridge School,69.94,92.99,74.84,136.08,303.91,Single-ply,SBD,M,
Boys,82.1,1,Jorge Soria,Hillsboro,78.47,204.12,133.81,199.58,537.51,Single-ply,SBD,M,
Boys,82.1,2,Christian Mack,Waxahachie Life,78.93,183.7,129.27,192.78,505.76,Single-ply,SBD,M,
Boys,82.1,3,Braden Price,Grandview,79.2,199.58,124.74,174.63,498.95,Single-ply,SBD,M,
Boys,82.1,4,Dalton Fowler,Whitney,81.19,158.76,90.72,206.38,455.86,Single-ply,SBD,M,
Boys,82.1,5,Jesus Luna,Italy,77.2,165.56,104.33,176.9,446.79,Single-ply,SBD,M,
Boys,82.1,6,Claude Kelly,Waxahachie Life,76.02,165.56,104.33,174.63,444.52,Single-ply,SBD,M,
Boys,82.1,7,Jacob Trejo,Hillsboro,81.65,165.56,104.33,165.56,435.45,Single-ply,SBD,M,
Boys,82.1,8,Tyson Grogan,Riesel,78.83,151.95,88.45,165.56,405.97,Single-ply,SBD,M,
Boys,82.1,9,Chance Bryant,Italy,80.92,147.42,95.25,147.42,390.09,Single-ply,SBD,M,
Boys,82.1,10,Saul Sanchez,Bishop Lynch,82.01,142.88,90.72,147.42,381.02,Single-ply,SBD,M,
Boys,82.1,11,Alexis Perez #3,Venus,78.11,124.74,63.5,142.88,331.12,Single-ply,SBD,M,
Boys,82.1,12,Jayden Gross,Venus,79.38,199.58,127.01,,326.59,Single-ply,SB,M,
Boys,82.1,13,Daivin Desai,Oakridge School,79.38,92.99,70.31,142.88,306.17,Single-ply,SBD,M,
Boys,82.1,14,Michael Bradford,San Angelo TLC Academy,76.66,142.88,,,142.88,Single-ply,S,M,
Boys,89.81,1,Juan Paredes,Rice,85,229.06,131.54,208.65,569.26,Single-ply,SBD,M,
Boys,89.81,2,Isaiah Morales,Venus,87.45,206.38,113.4,219.99,539.77,Single-ply,SBD,M,
Boys,89.81,3,Mateo Dominguez,Venus,88.63,213.19,117.93,208.65,539.77,Single-ply,SBD,M,
Boys,89.81,4,Alan Beltran,Hillsboro,84.37,183.7,117.93,176.9,478.54,Single-ply,SBD,M,
Boys,89.81,5,Luis Garcia,Hillsboro,87.54,174.63,129.27,174.63,478.54,Single-ply,SBD,M,
Boys,89.81,6,Jack May,Oakridge School,84.46,174.63,99.79,199.58,474,Single-ply,SBD,M,
Boys,89.81,7,Caleb Hill,San Angelo TLC Academy,85.55,183.7,117.93,138.35,439.98,Single-ply,SBD,M,
Boys,89.81,8,Kennedy Hoag,Riesel,84.28,147.42,92.99,161.03,401.43,Single-ply,SBD,M,
Boys,89.81,9,Parks Hodges,Rio Vista,84.91,142.88,74.84,115.67,333.39,Single-ply,SBD,M,
Boys,89.81,10,Aaron Bagwell,Oakridge School,82.55,102.06,70.31,156.49,328.85,Single-ply,SBD,M,
Boys,89.81,11,Hayden Chavez,Bishop Lynch,89.81,124.74,65.77,124.74,315.25,Single-ply,SBD,M,
Boys,89.81,12,Alex Greene,Oakridge School,86.64,86.18,56.7,136.08,278.96,Single-ply,SBD,M,
Boys,89.81,13,Chase Blevins,Oakridge School,83.28,79.38,61.23,102.06,242.67,Single-ply,SBD,M,
Boys,99.79,1,Jovani Tamayo,Venus,96.71,226.8,174.63,226.8,628.23,Single-ply,SBD,M,
Boys,99.79,2,Kelvin Eagans,Hillsboro,93.44,206.38,111.13,249.48,566.99,Single-ply,SBD,M,
Boys,99.79,3,Emmanuel Lugo,Grandview,91.26,226.8,122.47,192.78,542.04,Single-ply,SBD,M,
Boys,99.79,4,Brayden Canada,Grandview,98.52,195.04,108.86,204.12,508.02,Single-ply,SBD,M,
Boys,99.79,5,Gabriel Martinez,Italy,90.54,176.9,124.74,188.24,489.88,Single-ply,SBD,M,
Boys,99.79,6,Cooper Gray,Grandview,94.26,183.7,120.2,176.9,480.81,Single-ply,SBD,M,
Boys,99.79,7,Jocsan Acosta,Hillsboro,92.99,195.04,115.67,165.56,476.27,Single-ply,SBD,M,
Boys,99.79,8,Andrew Sherrill,Venus,91.53,174.63,90.72,192.78,458.13,Single-ply,SBD,M,
Boys,99.79,9,Alex Lopez #10,Oakridge School,99.52,165.56,88.45,201.85,455.86,Single-ply,SBD,M,
Boys,99.79,10,Chris Hinojosa,San Angelo TLC Academy,98.43,176.9,83.91,165.56,426.38,Single-ply,SBD,M,
Boys,99.79,11,Chris Guevara,Rice,93.26,170.1,86.18,149.69,405.97,Single-ply,SBD,M,
Boys,99.79,12,John Nesselroad,Whitney,93.44,124.74,95.25,149.69,369.68,Single-ply,SBD,M,
Boys,99.79,13,Luke Wilson,Rio Vista,94.71,136.08,88.45,,224.53,Single-ply,SB,M,
Boys,99.79,14,Anthony Ovalle,Rice,96.25,192.78,,,192.78,Single-ply,S,M,
Boys,109.77,1,Xavier Navarro,Grandview,106.68,263.08,129.27,231.33,623.69,Single-ply,SBD,M,
Boys,109.77,2,Omar DeLaHoya,Italy,106.68,208.65,147.42,188.24,544.31,Single-ply,SBD,M,
Boys,109.77,3,Jeremiah Gutierrez,Italy,103.42,215.46,117.93,188.24,521.63,Single-ply,SBD,M,
Boys,109.77,4,Nick Holt,Rio Vista,107.59,181.44,122.47,217.72,521.63,Single-ply,SBD,M,
Boys,109.77,5,Hudson Glenn,Riesel,103.78,172.37,108.86,179.17,460.4,Single-ply,SBD,M,
Boys,109.77,6,Joel Zarate,Waxahachie Life,104.14,172.37,111.13,167.83,451.32,Single-ply,SBD,M,
Boys,109.77,7,Jonathan Killian,Waxahachie Life,108.5,181.44,95.25,170.1,446.79,Single-ply,SBD,M,
Boys,109.77,8,Alejandro Solis,Waxahachie Life,101.97,163.29,102.06,154.22,419.57,Single-ply,SBD,M,
Boys,109.77,9,Brandon Gluhm,San Angelo TLC Academy,108.14,165.56,92.99,158.76,417.3,Single-ply,SBD,M,
Boys,109.77,10,Jason Holman,Oakridge School,103.78,74.84,61.23,117.93,254.01,Single-ply,SBD,M,
Boys,109.77,11,Vince Reodica,San Angelo TLC Academy,103.6,,120.2,,120.2,Single-ply,B,M,
Boys,124.74,1,Esteban Ramirez,Whitney,113.31,217.72,108.86,210.92,537.51,Single-ply,SBD,M,
Boys,124.74,2,Javier Rubio,Hillsboro,122.47,204.12,142.88,165.56,512.56,Single-ply,SBD,M,
Boys,124.74,3,Caiden Rogers,Whitney,114.58,167.83,111.13,185.97,464.93,Single-ply,SBD,M,
Boys,124.74,4,Jaime Resendiz,Venus,112.58,183.7,108.86,165.56,458.13,Single-ply,SBD,M,
Boys,124.74,5,Ethan Crandell,Rio Vista,121.02,163.29,102.06,147.42,412.77,Single-ply,SBD,M,
Boys,124.74,6,Steven Barton,Grandview,118.39,151.95,92.99,149.69,394.63,Single-ply,SBD,M,
Boys,124.74,7,Caleb Bayer,Grandview,118.02,183.7,185.97,,369.68,Single-ply,SB,M,
Boys,139.71,1,Bryce Ballard,Italy,128,272.16,154.22,197.31,623.69,Single-ply,SBD,M,
Boys,139.71,2,Fabian Silvas,Hillsboro,129.27,238.14,149.69,176.9,564.72,Single-ply,SBD,M,
Boys,139.71,3,Dominic Lara,Hillsboro,128.37,161.03,97.52,136.08,394.63,Single-ply,SBD,M,
Boys,139.71+,1,Trent Tidwell,Hillsboro,142.88,238.14,197.31,210.92,646.37,Single-ply,SBD,M,
Boys,139.71+,2,Jordan Hooks,Bishop Lynch,145.97,229.06,129.27,195.04,553.38,Single-ply,SBD,M,
Boys,,NS,Bryce Castillo,Grandview,,,,,,Single-ply,SBD,M,
Boys,,NS,Raza Malik,Oakridge School,,,,,,Single-ply,SBD,M,
Boys,,NS,Andy Cummins,Rio Vista,,,,,,Single-ply,SBD,M,
Boys,,NS,Dalton Nizio,Rice,,,,,,Single-ply,SBD,M,
Boys,,NS,Stephen Mendoza,Rice,,,,,,Single-ply,SBD,M,
Boys,,NS,Saul Santogo,Rice,,,,,,Single-ply,SBD,M,
Boys,,NS,Jaime Gonzalez,Venus,,,,,,Single-ply,SBD,M,
Boys,,NS,Jax Avant,Whitney,,,,,,Single-ply,SBD,M,
