<svg width="1240" height="76" viewBox="0 0 1240 76" fill="none" xmlns="http://www.w3.org/2000/svg">
<path d="M1163.95 29.1681C1166.53 12.6656 1180.74 0.5 1197.44 0.5H1202C1222.71 0.5 1239.5 17.2893 1239.5 38C1239.5 58.7107 1222.71 75.5 1202 75.5H1197.44C1180.74 75.5 1166.53 63.3344 1163.95 46.8319C1163.65 44.9139 1162 43.5 1160.06 43.5H232.358C220.837 43.5 210.212 49.7139 204.564 59.7549C199.093 69.481 188.802 75.5 177.642 75.5H38C17.2893 75.5 0.5 58.7107 0.5 38C0.5 17.2893 17.2893 0.5 38 0.5H177.642C188.802 0.5 199.093 6.51901 204.564 16.2451C210.212 26.2861 220.837 32.5 232.358 32.5H1160.06C1162 32.5 1163.65 31.0861 1163.95 29.1681Z" stroke="white"/>
</svg>
