<svg width="24" height="24" viewBox="0 0 24 24" fill="none" xmlns="http://www.w3.org/2000/svg">
<rect x="2" y="7" width="20" height="2" rx="1" fill="white"/>
<rect x="2" y="15" width="20" height="2" rx="1" fill="white"/>
</svg>
