{
  "tasks": [
    {
      "id": "2",
      "text": "work it harder",
      "state": true
    },
    {
      "id": "3",
      "text": "make it better",
      "state": false
    },
    {
      "id": "4",
      "text": "do it faster",
      "state": true
    },
    {
      "id": "8348",
      "text": "Kanye",
      "day": "01/02",
      "state": false
    },
    {
      "id": "4b44",
      "text": "West ",
      "day": "01/02",
      "state": true
    }
  ]
}