<svg width="13" height="14" viewBox="0 0 13 14" fill="none" xmlns="http://www.w3.org/2000/svg">
<circle cx="6.36435" cy="6.85361" r="6.36435" fill="#1ABAD6"/>
<g clip-path="url(#clip0_1405_7199)">
<mask id="mask0_1405_7199" style="mask-type:luminance" maskUnits="userSpaceOnUse" x="3" y="3" width="7" height="7">
<path d="M3.30493 3.88184H9.42908V9.89525H3.30493V3.88184Z" fill="white"/>
</mask>
<g mask="url(#mask0_1405_7199)">
<path d="M9.19 3.96516C8.95058 3.80979 8.63097 3.87799 8.47593 4.11744L5.58272 8.58077L4.17178 7.27507C3.9623 7.08128 3.63581 7.09401 3.44218 7.30366C3.24858 7.51311 3.26131 7.84024 3.47076 8.03384L5.32337 9.74815C5.32337 9.74815 5.37655 9.79397 5.40115 9.80998C5.4879 9.86648 5.58533 9.89336 5.68169 9.89336C5.85069 9.89336 6.01645 9.81034 6.11542 9.6577L9.34215 4.67984C9.49739 4.44042 9.42922 4.12036 9.19 3.96516Z" fill="white"/>
</g>
</g>
<defs>
<clipPath id="clip0_1405_7199">
<rect width="6.66742" height="6.66742" fill="white" transform="translate(3.02979 3.51953)"/>
</clipPath>
</defs>
</svg>
