<svg width="338" height="223" viewBox="0 0 338 223" fill="none" xmlns="http://www.w3.org/2000/svg">
<path d="M159 162.651C143.244 155.257 126.542 148.929 121.085 144.971C108.417 135.784 126.407 126.6 133.688 115.602H133.705C134.133 114.941 134.548 114.272 134.947 113.592C137.475 109.367 139.479 104.735 140.773 98.6525C145.006 98.2029 151.115 96.4635 152.967 90.274C156.154 79.629 156.844 66.4525 142.029 68.2052C141.969 68.125 141.983 68.1437 141.924 68.0634C153.023 43.8887 144.969 28.9755 144.969 28.9755C152.314 22.5692 153.858 11.4292 154.112 5.21555C154.185 3.43603 152.29 2.29071 150.719 3.12829C143.521 6.96296 128.965 9.41147 115.782 5.80426C96.7626 0.596822 82.6907 15.9569 82.6907 15.9569C82.6907 15.9569 67.638 8.34911 58.2576 24.809C48.5917 41.772 56.7055 65.8879 57.4708 68.0661C57.4681 68.1169 57.4654 68.1678 57.4627 68.2186C42.5312 66.3856 43.213 79.6022 46.4116 90.274C48.2791 96.509 54.4662 98.2323 58.7023 98.6632C60.1736 105.73 62.5908 110.839 65.6735 115.602H65.8002C73.0813 126.6 91.0686 135.784 78.4034 144.971C70.4701 150.722 38.8044 161.479 20.7821 173.24C8.47795 180.401 2.41481 192.943 0.156629 198.745C-0.425432 200.238 0.68749 201.849 2.29355 201.849H152.961L159 162.651Z" fill="#36A0C1"/>
<mask id="mask0_1062_9780" style="mask-type:luminance" maskUnits="userSpaceOnUse" x="115" y="0" width="163" height="203">
<path d="M115.139 0H277.077V202.727H115.139V0Z" fill="white"/>
</mask>
<g mask="url(#mask0_1062_9780)">
<path d="M276.62 161.508C260.854 153.112 244.695 145.895 238.566 141.465C233.546 137.836 233.029 134.208 234.765 130.482C236.555 126.636 240.238 123.998 244.437 123.303C255.842 121.419 264.442 118.73 269.839 116.708C273.269 115.422 274.841 111.489 273.279 108.186C266.219 93.2681 265.594 73.5399 262.469 48.98C258.23 15.6259 241.597 0 215.75 0C189.906 0 173.274 15.6259 169.031 48.98C165.909 73.5399 165.284 93.2654 158.227 108.186C156.663 111.486 158.235 115.422 161.664 116.708C167.064 118.73 175.659 121.419 187.066 123.303C191.263 123.998 194.948 126.636 196.738 130.482C198.472 134.208 197.958 137.836 192.937 141.465C184.461 147.594 156.781 159.058 137.513 171.594C124.224 179.303 117.745 192.873 115.389 198.967C114.811 200.472 115.925 202.087 117.545 202.087H269.376L276.62 161.508Z" fill="#81D9E9"/>
</g>
<mask id="mask1_1062_9780" style="mask-type:luminance" maskUnits="userSpaceOnUse" x="265" y="151" width="73" height="72">
<path d="M265.363 151.046H337.999V222.753H265.363V151.046Z" fill="white"/>
</mask>
<g mask="url(#mask1_1062_9780)">
<path d="M337.939 186.925C337.939 206.713 321.834 222.753 301.969 222.753C282.103 222.753 265.998 206.713 265.998 186.925C265.998 167.135 282.103 151.095 301.969 151.095C321.834 151.095 337.939 167.135 337.939 186.925Z" fill="#36A0C1"/>
</g>
<path d="M315.427 183.486H305.573V174.212C305.573 172.354 303.974 170.849 302 170.849C300.026 170.849 298.427 172.354 298.427 174.212V183.486H288.573C286.599 183.486 285 184.991 285 186.849C285 188.706 286.599 190.212 288.573 190.212H298.427V199.486C298.427 201.343 300.026 202.849 302 202.849C303.974 202.849 305.573 201.343 305.573 199.486V190.212H315.427C317.401 190.212 319 188.706 319 186.849C319 184.991 317.401 183.486 315.427 183.486Z" fill="white"/>
</svg>
