<svg width="15" height="18" viewBox="0 0 15 18" fill="none" xmlns="http://www.w3.org/2000/svg">
<path d="M14.3637 2.34827L7.80123 0.0520316C7.60622 -0.0173439 7.39361 -0.0173439 7.1986 0.0520316L0.6361 2.34827C0.254952 2.4807 0 2.84707 0 3.26104V8.4268C0 14.7315 6.84238 17.7965 7.13371 17.9239C7.36868 18.0254 7.63115 18.0254 7.86612 17.9239C8.15744 17.7953 15 14.7315 15 8.4268V3.26104C15 2.84707 14.7449 2.4807 14.3637 2.34827Z" fill="#86888A"/>
<mask id="mask0_1405_7196" style="mask-type:luminance" maskUnits="userSpaceOnUse" x="4" y="5" width="7" height="8">
<path d="M4.65796 5.86841H10.9211V12.0183H4.65796V5.86841Z" fill="white"/>
</mask>
<g mask="url(#mask0_1405_7196)">
<path d="M10.6766 5.95362C10.4318 5.79473 10.1049 5.86447 9.94633 6.10936L6.98746 10.674L5.54449 9.33867C5.33025 9.14048 4.99635 9.1535 4.79832 9.3679C4.60033 9.58211 4.61335 9.91667 4.82756 10.1147L6.72222 11.8679C6.72222 11.8679 6.77661 11.9147 6.80176 11.9311C6.89048 11.9889 6.99012 12.0164 7.08867 12.0164C7.26151 12.0164 7.43103 11.9315 7.53224 11.7754L10.8322 6.68453C10.991 6.43967 10.9213 6.11235 10.6766 5.95362Z" fill="white"/>
</g>
</svg>
