<svg width="321" height="48" viewBox="0 0 321 48" fill="none" xmlns="http://www.w3.org/2000/svg">
<path d="M32.0312 9L289.031 9.00002" stroke="#1ABAD6" stroke-opacity="0.4" stroke-width="0.547231"/>
<circle cx="31.7869" cy="8.7557" r="8.7557" fill="#1ABAD6"/>
<path d="M0.981184 33.7207V27.5917H4.87747V28.3447H1.90929V30.2534H4.6148V30.9889H1.90929V32.9677H4.87747V33.7207H0.981184ZM5.9482 33.7207V29.3779H6.77123L6.84128 30.1396C6.97553 29.8711 7.17108 29.661 7.42791 29.5092C7.69058 29.3516 7.99119 29.2728 8.32975 29.2728C8.85509 29.2728 9.26661 29.4362 9.5643 29.7631C9.86783 30.09 10.0196 30.5774 10.0196 31.2253V33.7207H9.10025V31.3216C9.10025 30.4811 8.75586 30.0608 8.06708 30.0608C7.72269 30.0608 7.43667 30.1834 7.20902 30.4286C6.98721 30.6737 6.8763 31.0239 6.8763 31.4792V33.7207H5.9482ZM11.3316 33.7207V30.1571H10.7099V29.3779H11.3316V28.7475C11.3316 28.2747 11.4483 27.9361 11.6818 27.7318C11.9211 27.5217 12.2568 27.4166 12.6887 27.4166H13.144V28.2046H12.8288C12.6245 28.2046 12.4786 28.2484 12.391 28.3359C12.3035 28.4177 12.2597 28.5578 12.2597 28.7562V29.3779H13.2578V30.1571H12.2597V33.7207H11.3316ZM15.9999 33.8258C15.5738 33.8258 15.1944 33.7324 14.8616 33.5456C14.5348 33.353 14.2779 33.0874 14.0911 32.7488C13.9043 32.4103 13.811 32.0163 13.811 31.5668C13.811 31.1115 13.9014 30.7117 14.0824 30.3673C14.2692 30.0229 14.526 29.7544 14.8529 29.5617C15.1856 29.3691 15.5708 29.2728 16.0086 29.2728C16.4347 29.2728 16.8054 29.3691 17.1206 29.5617C17.4358 29.7485 17.681 29.9995 17.8561 30.3147C18.0312 30.6299 18.1188 30.9773 18.1188 31.3567C18.1188 31.415 18.1158 31.4792 18.11 31.5493C18.11 31.6135 18.1071 31.6865 18.1012 31.7682H14.7215C14.7507 32.1885 14.8879 32.5095 15.1331 32.7313C15.3841 32.9473 15.673 33.0553 15.9999 33.0553C16.2625 33.0553 16.4814 32.9969 16.6566 32.8802C16.8375 32.7576 16.9718 32.5941 17.0593 32.3898H17.9874C17.8707 32.7984 17.6372 33.1399 17.287 33.4143C16.9426 33.6886 16.5135 33.8258 15.9999 33.8258ZM15.9999 30.0346C15.6905 30.0346 15.4162 30.1279 15.1768 30.3147C14.9375 30.4957 14.7916 30.77 14.7391 31.1378H17.1907C17.1731 30.7992 17.0535 30.5307 16.8317 30.3322C16.6099 30.1338 16.3326 30.0346 15.9999 30.0346ZM19.0817 33.7207V29.3779H19.9135L19.9923 30.2009C20.1441 29.9149 20.3542 29.6902 20.6228 29.5267C20.8971 29.3574 21.2269 29.2728 21.6121 29.2728V30.2447H21.3582C21.1014 30.2447 20.8708 30.2885 20.6665 30.376C20.4681 30.4577 20.3075 30.6008 20.185 30.8051C20.0682 31.0035 20.0099 31.2808 20.0099 31.6368V33.7207H19.0817ZM22.4079 33.7207V29.3779H23.2309L23.3097 29.9908C23.4498 29.769 23.6337 29.5938 23.8613 29.4654C24.0948 29.337 24.3633 29.2728 24.6669 29.2728C25.3556 29.2728 25.8343 29.5442 26.1028 30.0871C26.2604 29.8361 26.4705 29.6376 26.7332 29.4917C27.0017 29.3458 27.2906 29.2728 27.6 29.2728C28.1429 29.2728 28.569 29.4362 28.8783 29.7631C29.1877 30.09 29.3424 30.5774 29.3424 31.2253V33.7207H28.4143V31.3216C28.4143 30.4811 28.0933 30.0608 27.4512 30.0608C27.1243 30.0608 26.8558 30.1834 26.6456 30.4286C26.4413 30.6737 26.3392 31.0239 26.3392 31.4792V33.7207H25.4111V31.3216C25.4111 30.4811 25.0871 30.0608 24.4392 30.0608C24.1182 30.0608 23.8526 30.1834 23.6424 30.4286C23.4381 30.6737 23.336 31.0239 23.336 31.4792V33.7207H22.4079ZM32.4596 33.8258C32.0335 33.8258 31.654 33.7324 31.3213 33.5456C30.9944 33.353 30.7376 33.0874 30.5508 32.7488C30.364 32.4103 30.2706 32.0163 30.2706 31.5668C30.2706 31.1115 30.3611 30.7117 30.5421 30.3673C30.7289 30.0229 30.9857 29.7544 31.3126 29.5617C31.6453 29.3691 32.0305 29.2728 32.4683 29.2728C32.8944 29.2728 33.2651 29.3691 33.5803 29.5617C33.8955 29.7485 34.1407 29.9995 34.3158 30.3147C34.4909 30.6299 34.5784 30.9773 34.5784 31.3567C34.5784 31.415 34.5755 31.4792 34.5697 31.5493C34.5697 31.6135 34.5668 31.6865 34.5609 31.7682H31.1812C31.2104 32.1885 31.3476 32.5095 31.5928 32.7313C31.8438 32.9473 32.1327 33.0553 32.4596 33.0553C32.7222 33.0553 32.9411 32.9969 33.1162 32.8802C33.2972 32.7576 33.4315 32.5941 33.519 32.3898H34.4471C34.3304 32.7984 34.0969 33.1399 33.7467 33.4143C33.4023 33.6886 32.9732 33.8258 32.4596 33.8258ZM32.4596 30.0346C32.1502 30.0346 31.8759 30.1279 31.6365 30.3147C31.3972 30.4957 31.2513 30.77 31.1987 31.1378H33.6503C33.6328 30.7992 33.5132 30.5307 33.2914 30.3322C33.0695 30.1338 32.7923 30.0346 32.4596 30.0346ZM37.5202 33.8258C37.1 33.8258 36.7293 33.7265 36.4082 33.5281C36.0872 33.3296 35.8362 33.0582 35.6553 32.7138C35.4743 32.3694 35.3838 31.9783 35.3838 31.5405C35.3838 31.1027 35.4743 30.7146 35.6553 30.376C35.8362 30.0316 36.0872 29.7631 36.4082 29.5705C36.7351 29.372 37.1087 29.2728 37.529 29.2728C37.8734 29.2728 38.174 29.3399 38.4308 29.4742C38.6935 29.6084 38.8978 29.7981 39.0437 30.0433V27.4166H39.9718V33.7207H39.14L39.0437 33.0465C38.9036 33.2508 38.711 33.4318 38.4658 33.5894C38.2207 33.747 37.9055 33.8258 37.5202 33.8258ZM37.6866 33.0202C38.0835 33.0202 38.4075 32.8831 38.6585 32.6087C38.9153 32.3344 39.0437 31.9812 39.0437 31.5493C39.0437 31.1115 38.9153 30.7584 38.6585 30.4898C38.4075 30.2155 38.0835 30.0783 37.6866 30.0783C37.2897 30.0783 36.9628 30.2155 36.7059 30.4898C36.4491 30.7584 36.3207 31.1115 36.3207 31.5493C36.3207 31.8353 36.3791 32.0892 36.4958 32.311C36.6125 32.5328 36.7731 32.708 36.9774 32.8364C37.1875 32.959 37.4239 33.0202 37.6866 33.0202ZM42.613 33.8258C42.2452 33.8258 41.9417 33.7645 41.7024 33.6419C41.463 33.5193 41.285 33.3588 41.1683 33.1603C41.0515 32.956 40.9932 32.7342 40.9932 32.4949C40.9932 32.0746 41.1566 31.7419 41.4835 31.4968C41.8104 31.2516 42.2773 31.129 42.8844 31.129H44.0226V31.0502C44.0226 30.7117 43.9292 30.4577 43.7424 30.2885C43.5615 30.1192 43.3251 30.0346 43.0332 30.0346C42.7764 30.0346 42.5517 30.0988 42.359 30.2272C42.1723 30.3498 42.0584 30.5336 42.0176 30.7788H41.0895C41.1187 30.4636 41.2237 30.1951 41.4047 29.9733C41.5915 29.7456 41.825 29.5734 42.1051 29.4567C42.3912 29.3341 42.7034 29.2728 43.042 29.2728C43.6491 29.2728 44.1189 29.4333 44.4517 29.7544C44.7844 30.0696 44.9507 30.5015 44.9507 31.0502V33.7207H44.1452L44.0664 32.9765C43.9438 33.2158 43.7658 33.4172 43.5323 33.5806C43.2988 33.7441 42.9924 33.8258 42.613 33.8258ZM42.7968 33.0728C43.0478 33.0728 43.258 33.0144 43.4272 32.8977C43.6024 32.7751 43.7366 32.6146 43.83 32.4161C43.9292 32.2176 43.9905 31.9987 44.0139 31.7594H42.9807C42.613 31.7594 42.3503 31.8236 42.1927 31.9521C42.0409 32.0805 41.965 32.241 41.965 32.4336C41.965 32.6321 42.038 32.7897 42.1839 32.9064C42.3357 33.0173 42.54 33.0728 42.7968 33.0728ZM48.0117 33.8258C47.5914 33.8258 47.2207 33.7265 46.8997 33.5281C46.5787 33.3296 46.3277 33.0582 46.1467 32.7138C45.9658 32.3694 45.8753 31.9783 45.8753 31.5405C45.8753 31.1027 45.9658 30.7146 46.1467 30.376C46.3277 30.0316 46.5787 29.7631 46.8997 29.5705C47.2266 29.372 47.6002 29.2728 48.0204 29.2728C48.3648 29.2728 48.6654 29.3399 48.9223 29.4742C49.1849 29.6084 49.3892 29.7981 49.5352 30.0433V27.4166H50.4633V33.7207H49.6315L49.5352 33.0465C49.3951 33.2508 49.2024 33.4318 48.9573 33.5894C48.7121 33.747 48.3969 33.8258 48.0117 33.8258ZM48.178 33.0202C48.575 33.0202 48.8989 32.8831 49.1499 32.6087C49.4067 32.3344 49.5352 31.9812 49.5352 31.5493C49.5352 31.1115 49.4067 30.7584 49.1499 30.4898C48.8989 30.2155 48.575 30.0783 48.178 30.0783C47.7811 30.0783 47.4542 30.2155 47.1974 30.4898C46.9406 30.7584 46.8121 31.1115 46.8121 31.5493C46.8121 31.8353 46.8705 32.0892 46.9873 32.311C47.104 32.5328 47.2645 32.708 47.4688 32.8364C47.679 32.959 47.9154 33.0202 48.178 33.0202ZM53.6648 33.8258C53.2387 33.8258 52.8593 33.7324 52.5265 33.5456C52.1997 33.353 51.9428 33.0874 51.756 32.7488C51.5692 32.4103 51.4759 32.0163 51.4759 31.5668C51.4759 31.1115 51.5663 30.7117 51.7473 30.3673C51.9341 30.0229 52.1909 29.7544 52.5178 29.5617C52.8505 29.3691 53.2357 29.2728 53.6735 29.2728C54.0996 29.2728 54.4703 29.3691 54.7855 29.5617C55.1007 29.7485 55.3459 29.9995 55.521 30.3147C55.6961 30.6299 55.7837 30.9773 55.7837 31.3567C55.7837 31.415 55.7807 31.4792 55.7749 31.5493C55.7749 31.6135 55.772 31.6865 55.7661 31.7682H52.3864C52.4156 32.1885 52.5528 32.5095 52.798 32.7313C53.049 32.9473 53.3379 33.0553 53.6648 33.0553C53.9274 33.0553 54.1463 32.9969 54.3215 32.8802C54.5024 32.7576 54.6367 32.5941 54.7242 32.3898H55.6523C55.5356 32.7984 55.3021 33.1399 54.9519 33.4143C54.6075 33.6886 54.1784 33.8258 53.6648 33.8258ZM53.6648 30.0346C53.3554 30.0346 53.0811 30.1279 52.8417 30.3147C52.6024 30.4957 52.4565 30.77 52.404 31.1378H54.8556C54.838 30.7992 54.7184 30.5307 54.4966 30.3322C54.2748 30.1338 53.9975 30.0346 53.6648 30.0346ZM58.4803 33.8258C57.9316 33.8258 57.4792 33.6915 57.1231 33.423C56.7671 33.1545 56.5628 32.7984 56.5102 32.3548H57.4471C57.4938 32.5533 57.6047 32.7255 57.7798 32.8714C57.9549 33.0115 58.1855 33.0815 58.4715 33.0815C58.7517 33.0815 58.956 33.0232 59.0844 32.9064C59.2128 32.7897 59.277 32.6554 59.277 32.5037C59.277 32.2818 59.1866 32.133 59.0056 32.0571C58.8305 31.9754 58.5853 31.9024 58.2701 31.8382C58.025 31.7857 57.7798 31.7156 57.5347 31.6281C57.2953 31.5405 57.094 31.418 56.9305 31.2604C56.7729 31.0969 56.6941 30.878 56.6941 30.6037C56.6941 30.2243 56.84 29.9091 57.1319 29.6581C57.4238 29.4012 57.8324 29.2728 58.3577 29.2728C58.8422 29.2728 59.2333 29.3895 59.531 29.623C59.8345 29.8565 60.0125 30.1863 60.0651 30.6124H59.172C59.1428 30.4256 59.0552 30.2797 58.9093 30.1746C58.7692 30.0696 58.5795 30.017 58.3402 30.017C58.1067 30.017 57.9258 30.0667 57.7973 30.1659C57.6689 30.2593 57.6047 30.3819 57.6047 30.5336C57.6047 30.6854 57.6923 30.8051 57.8674 30.8926C58.0483 30.9802 58.2847 31.059 58.5766 31.129C58.8684 31.1932 59.137 31.2691 59.3821 31.3567C59.6331 31.4384 59.8345 31.561 59.9863 31.7244C60.138 31.8878 60.2139 32.1272 60.2139 32.4424C60.2197 32.8393 60.0651 33.1691 59.7499 33.4318C59.4405 33.6944 59.0173 33.8258 58.4803 33.8258ZM14.5032 44.7207V39.3447H12.6908V38.5917H17.235V39.3447H15.4313V44.7207H14.5032ZM17.6068 44.7207V40.3779H18.4386L18.5174 41.2009C18.6691 40.9149 18.8793 40.6902 19.1478 40.5267C19.4221 40.3574 19.7519 40.2728 20.1372 40.2728V41.2447H19.8833C19.6264 41.2447 19.3959 41.2885 19.1916 41.376C18.9931 41.4577 18.8326 41.6008 18.71 41.8051C18.5933 42.0035 18.5349 42.2808 18.5349 42.6368V44.7207H17.6068ZM22.4039 44.8258C22.0361 44.8258 21.7326 44.7645 21.4933 44.6419C21.254 44.5193 21.0759 44.3588 20.9592 44.1603C20.8425 43.956 20.7841 43.7342 20.7841 43.4949C20.7841 43.0746 20.9475 42.7419 21.2744 42.4968C21.6013 42.2516 22.0682 42.129 22.6753 42.129H23.8136V42.0502C23.8136 41.7117 23.7202 41.4577 23.5334 41.2885C23.3524 41.1192 23.116 41.0346 22.8242 41.0346C22.5673 41.0346 22.3426 41.0988 22.15 41.2272C21.9632 41.3498 21.8494 41.5336 21.8085 41.7788H20.8804C20.9096 41.4636 21.0146 41.1951 21.1956 40.9733C21.3824 40.7456 21.6159 40.5734 21.8961 40.4567C22.1821 40.3341 22.4944 40.2728 22.8329 40.2728C23.44 40.2728 23.9099 40.4333 24.2426 40.7544C24.5753 41.0696 24.7417 41.5015 24.7417 42.0502V44.7207H23.9361L23.8573 43.9765C23.7348 44.2158 23.5567 44.4172 23.3232 44.5806C23.0897 44.7441 22.7833 44.8258 22.4039 44.8258ZM22.5878 44.0728C22.8388 44.0728 23.0489 44.0144 23.2182 43.8977C23.3933 43.7751 23.5275 43.6146 23.6209 43.4161C23.7202 43.2176 23.7814 42.9987 23.8048 42.7594H22.7716C22.4039 42.7594 22.1412 42.8236 21.9836 42.9521C21.8318 43.0805 21.756 43.241 21.756 43.4336C21.756 43.6321 21.8289 43.7897 21.9749 43.9064C22.1266 44.0173 22.3309 44.0728 22.5878 44.0728ZM27.5595 44.7207C27.1334 44.7207 26.7948 44.6186 26.5438 44.4143C26.2928 44.2041 26.1673 43.8335 26.1673 43.3023V41.1571H25.4231V40.3779H26.1673L26.2812 39.2747H27.0954V40.3779H28.3212V41.1571H27.0954V43.3023C27.0954 43.5416 27.1451 43.708 27.2443 43.8014C27.3494 43.8889 27.5274 43.9327 27.7784 43.9327H28.2775V44.7207H27.5595ZM30.7492 44.8258C30.3814 44.8258 30.0779 44.7645 29.8386 44.6419C29.5992 44.5193 29.4212 44.3588 29.3045 44.1603C29.1877 43.956 29.1294 43.7342 29.1294 43.4949C29.1294 43.0746 29.2928 42.7419 29.6197 42.4968C29.9466 42.2516 30.4135 42.129 31.0206 42.129H32.1588V42.0502C32.1588 41.7117 32.0654 41.4577 31.8786 41.2885C31.6977 41.1192 31.4613 41.0346 31.1694 41.0346C30.9126 41.0346 30.6879 41.0988 30.4952 41.2272C30.3085 41.3498 30.1946 41.5336 30.1538 41.7788H29.2257C29.2549 41.4636 29.3599 41.1951 29.5409 40.9733C29.7277 40.7456 29.9611 40.5734 30.2413 40.4567C30.5274 40.3341 30.8396 40.2728 31.1782 40.2728C31.7853 40.2728 32.2551 40.4333 32.5879 40.7544C32.9206 41.0696 33.0869 41.5015 33.0869 42.0502V44.7207H32.2814L32.2026 43.9765C32.08 44.2158 31.902 44.4172 31.6685 44.5806C31.435 44.7441 31.1286 44.8258 30.7492 44.8258ZM30.933 44.0728C31.184 44.0728 31.3942 44.0144 31.5634 43.8977C31.7386 43.7751 31.8728 43.6146 31.9662 43.4161C32.0654 43.2176 32.1267 42.9987 32.1501 42.7594H31.1169C30.7492 42.7594 30.4865 42.8236 30.3289 42.9521C30.1771 43.0805 30.1012 43.241 30.1012 43.4336C30.1012 43.6321 30.1742 43.7897 30.3201 43.9064C30.4719 44.0173 30.6762 44.0728 30.933 44.0728ZM36.1479 44.8258C35.7276 44.8258 35.3569 44.7265 35.0359 44.5281C34.7149 44.3296 34.4639 44.0582 34.2829 43.7138C34.102 43.3694 34.0115 42.9783 34.0115 42.5405C34.0115 42.1027 34.102 41.7146 34.2829 41.376C34.4639 41.0316 34.7149 40.7631 35.0359 40.5705C35.3628 40.372 35.7364 40.2728 36.1566 40.2728C36.501 40.2728 36.8016 40.3399 37.0585 40.4742C37.3211 40.6084 37.5254 40.7981 37.6714 41.0433V38.4166H38.5995V44.7207H37.7677L37.6714 44.0465C37.5313 44.2508 37.3386 44.4318 37.0935 44.5894C36.8483 44.747 36.5331 44.8258 36.1479 44.8258ZM36.3142 44.0202C36.7112 44.0202 37.0351 43.8831 37.2861 43.6087C37.5429 43.3344 37.6714 42.9812 37.6714 42.5493C37.6714 42.1115 37.5429 41.7584 37.2861 41.4898C37.0351 41.2155 36.7112 41.0783 36.3142 41.0783C35.9173 41.0783 35.5904 41.2155 35.3336 41.4898C35.0768 41.7584 34.9483 42.1115 34.9483 42.5493C34.9483 42.8353 35.0067 43.0892 35.1235 43.311C35.2402 43.5328 35.4007 43.708 35.605 43.8364C35.8152 43.959 36.0516 44.0202 36.3142 44.0202ZM41.2406 44.8258C40.8729 44.8258 40.5693 44.7645 40.33 44.6419C40.0907 44.5193 39.9127 44.3588 39.7959 44.1603C39.6792 43.956 39.6208 43.7342 39.6208 43.4949C39.6208 43.0746 39.7842 42.7419 40.1111 42.4968C40.438 42.2516 40.905 42.129 41.512 42.129H42.6503V42.0502C42.6503 41.7117 42.5569 41.4577 42.3701 41.2885C42.1891 41.1192 41.9527 41.0346 41.6609 41.0346C41.4041 41.0346 41.1793 41.0988 40.9867 41.2272C40.7999 41.3498 40.6861 41.5336 40.6452 41.7788H39.7171C39.7463 41.4636 39.8514 41.1951 40.0323 40.9733C40.2191 40.7456 40.4526 40.5734 40.7328 40.4567C41.0188 40.3341 41.3311 40.2728 41.6696 40.2728C42.2767 40.2728 42.7466 40.4333 43.0793 40.7544C43.412 41.0696 43.5784 41.5015 43.5784 42.0502V44.7207H42.7729L42.6941 43.9765C42.5715 44.2158 42.3934 44.4172 42.16 44.5806C41.9265 44.7441 41.62 44.8258 41.2406 44.8258ZM41.4245 44.0728C41.6755 44.0728 41.8856 44.0144 42.0549 43.8977C42.23 43.7751 42.3643 43.6146 42.4577 43.4161C42.5569 43.2176 42.6182 42.9987 42.6415 42.7594H41.6084C41.2406 42.7594 40.9779 42.8236 40.8203 42.9521C40.6686 43.0805 40.5927 43.241 40.5927 43.4336C40.5927 43.6321 40.6657 43.7897 40.8116 43.9064C40.9633 44.0173 41.1676 44.0728 41.4245 44.0728ZM46.3942 44.8258C45.8455 44.8258 45.3931 44.6915 45.037 44.423C44.681 44.1545 44.4767 43.7984 44.4241 43.3548H45.361C45.4077 43.5533 45.5186 43.7255 45.6937 43.8714C45.8688 44.0115 46.0994 44.0815 46.3854 44.0815C46.6656 44.0815 46.8699 44.0232 46.9983 43.9064C47.1267 43.7897 47.1909 43.6554 47.1909 43.5037C47.1909 43.2818 47.1005 43.133 46.9195 43.0571C46.7444 42.9754 46.4992 42.9024 46.184 42.8382C45.9389 42.7857 45.6937 42.7156 45.4485 42.6281C45.2092 42.5405 45.0078 42.418 44.8444 42.2604C44.6868 42.0969 44.608 41.878 44.608 41.6037C44.608 41.2243 44.7539 40.9091 45.0458 40.6581C45.3376 40.4012 45.7462 40.2728 46.2716 40.2728C46.7561 40.2728 47.1471 40.3895 47.4448 40.623C47.7484 40.8565 47.9264 41.1863 47.9789 41.6124H47.0859C47.0567 41.4256 46.9691 41.2797 46.8232 41.1746C46.6831 41.0696 46.4934 41.017 46.2541 41.017C46.0206 41.017 45.8396 41.0667 45.7112 41.1659C45.5828 41.2593 45.5186 41.3819 45.5186 41.5336C45.5186 41.6854 45.6061 41.8051 45.7813 41.8926C45.9622 41.9802 46.1986 42.059 46.4905 42.129C46.7823 42.1932 47.0508 42.2691 47.296 42.3567C47.547 42.4384 47.7484 42.561 47.9001 42.7244C48.0519 42.8878 48.1278 43.1272 48.1278 43.4424C48.1336 43.8393 47.9789 44.1691 47.6637 44.4318C47.3544 44.6944 46.9312 44.8258 46.3942 44.8258Z" fill="#89868D"/>
<path d="M34.9042 6.08313C34.6653 5.92811 34.3464 5.99616 34.1917 6.23508L31.3049 10.6885L29.8971 9.38567C29.6881 9.19231 29.3624 9.20501 29.1692 9.41419C28.976 9.62317 28.9887 9.94958 29.1977 10.1427L31.0462 11.8532C31.0462 11.8532 31.0992 11.899 31.1238 11.9149C31.2103 11.9713 31.3075 11.9981 31.4037 11.9981C31.5723 11.9981 31.7377 11.9153 31.8364 11.763L35.056 6.79622C35.2109 6.55734 35.1429 6.23799 34.9042 6.08313Z" fill="white"/>
<circle cx="164.025" cy="8.75587" r="6.01954" fill="#ADE1EB"/>
<path d="M143.452 33.7207V27.5917H144.38V33.7207H143.452ZM145.589 33.7207V29.3779H146.412L146.491 29.9908C146.631 29.769 146.815 29.5938 147.042 29.4654C147.276 29.337 147.544 29.2728 147.848 29.2728C148.537 29.2728 149.015 29.5442 149.284 30.0871C149.442 29.8361 149.652 29.6376 149.914 29.4917C150.183 29.3458 150.472 29.2728 150.781 29.2728C151.324 29.2728 151.75 29.4362 152.059 29.7631C152.369 30.09 152.524 30.5774 152.524 31.2253V33.7207H151.595V31.3216C151.595 30.4811 151.274 30.0608 150.632 30.0608C150.305 30.0608 150.037 30.1834 149.827 30.4286C149.622 30.6737 149.52 31.0239 149.52 31.4792V33.7207H148.592V31.3216C148.592 30.4811 148.268 30.0608 147.62 30.0608C147.299 30.0608 147.034 30.1834 146.824 30.4286C146.619 30.6737 146.517 31.0239 146.517 31.4792V33.7207H145.589ZM155.08 33.8258C154.713 33.8258 154.409 33.7645 154.17 33.6419C153.93 33.5193 153.752 33.3588 153.636 33.1603C153.519 32.956 153.461 32.7342 153.461 32.4949C153.461 32.0746 153.624 31.7419 153.951 31.4968C154.278 31.2516 154.745 31.129 155.352 31.129H156.49V31.0502C156.49 30.7117 156.397 30.4577 156.21 30.2885C156.029 30.1192 155.792 30.0346 155.501 30.0346C155.244 30.0346 155.019 30.0988 154.826 30.2272C154.64 30.3498 154.526 30.5336 154.485 30.7788H153.557C153.586 30.4636 153.691 30.1951 153.872 29.9733C154.059 29.7456 154.292 29.5734 154.572 29.4567C154.859 29.3341 155.171 29.2728 155.509 29.2728C156.116 29.2728 156.586 29.4333 156.919 29.7544C157.252 30.0696 157.418 30.5015 157.418 31.0502V33.7207H156.613L156.534 32.9765C156.411 33.2158 156.233 33.4172 156 33.5806C155.766 33.7441 155.46 33.8258 155.08 33.8258ZM155.264 33.0728C155.515 33.0728 155.725 33.0144 155.895 32.8977C156.07 32.7751 156.204 32.6146 156.297 32.4161C156.397 32.2176 156.458 31.9987 156.481 31.7594H155.448C155.08 31.7594 154.818 31.8236 154.66 31.9521C154.508 32.0805 154.432 32.241 154.432 32.4336C154.432 32.6321 154.505 32.7897 154.651 32.9064C154.803 33.0173 155.007 33.0728 155.264 33.0728ZM160.278 32.3898C160.05 32.3898 159.84 32.3636 159.647 32.311L159.271 32.6788C159.335 32.7196 159.414 32.7547 159.507 32.7838C159.601 32.813 159.732 32.8393 159.901 32.8626C160.07 32.886 160.301 32.9093 160.593 32.9327C161.171 32.9852 161.588 33.1253 161.845 33.353C162.102 33.5748 162.23 33.8725 162.23 34.246C162.23 34.5029 162.16 34.7451 162.02 34.9728C161.886 35.2063 161.673 35.393 161.381 35.5331C161.095 35.6791 160.727 35.752 160.278 35.752C159.671 35.752 159.177 35.6353 158.798 35.4018C158.424 35.1741 158.238 34.8268 158.238 34.3599C158.238 34.1789 158.284 33.998 158.378 33.817C158.477 33.6419 158.632 33.4755 158.842 33.3179C158.719 33.2654 158.611 33.21 158.518 33.1516C158.43 33.0874 158.351 33.0232 158.281 32.959V32.7488L159.034 31.9783C158.696 31.6865 158.527 31.3041 158.527 30.8313C158.527 30.5453 158.594 30.2855 158.728 30.0521C158.868 29.8127 159.069 29.623 159.332 29.4829C159.595 29.3429 159.91 29.2728 160.278 29.2728C160.523 29.2728 160.75 29.3078 160.961 29.3779H162.58V29.9908L161.81 30.0346C161.95 30.2739 162.02 30.5395 162.02 30.8313C162.02 31.1232 161.95 31.3858 161.81 31.6193C161.676 31.8528 161.477 32.0396 161.215 32.1797C160.958 32.3198 160.645 32.3898 160.278 32.3898ZM160.278 31.6631C160.546 31.6631 160.762 31.5931 160.926 31.453C161.095 31.307 161.179 31.1027 161.179 30.8401C161.179 30.5716 161.095 30.3673 160.926 30.2272C160.762 30.0871 160.546 30.017 160.278 30.017C160.003 30.017 159.781 30.0871 159.612 30.2272C159.449 30.3673 159.367 30.5716 159.367 30.8401C159.367 31.1027 159.449 31.307 159.612 31.453C159.781 31.5931 160.003 31.6631 160.278 31.6631ZM159.113 34.2723C159.113 34.5233 159.224 34.7101 159.446 34.8327C159.668 34.9611 159.945 35.0253 160.278 35.0253C160.599 35.0253 160.858 34.9553 161.057 34.8152C161.255 34.6809 161.355 34.5 161.355 34.2723C161.355 34.103 161.287 33.9571 161.153 33.8345C161.019 33.7178 160.765 33.6448 160.391 33.6156C160.111 33.5981 159.863 33.5719 159.647 33.5368C159.443 33.6477 159.303 33.7674 159.227 33.8958C159.151 34.0242 159.113 34.1497 159.113 34.2723ZM165.269 33.8258C164.842 33.8258 164.463 33.7324 164.13 33.5456C163.803 33.353 163.547 33.0874 163.36 32.7488C163.173 32.4103 163.08 32.0163 163.08 31.5668C163.08 31.1115 163.17 30.7117 163.351 30.3673C163.538 30.0229 163.795 29.7544 164.122 29.5617C164.454 29.3691 164.84 29.2728 165.277 29.2728C165.703 29.2728 166.074 29.3691 166.389 29.5617C166.704 29.7485 166.95 29.9995 167.125 30.3147C167.3 30.6299 167.387 30.9773 167.387 31.3567C167.387 31.415 167.384 31.4792 167.379 31.5493C167.379 31.6135 167.376 31.6865 167.37 31.7682H163.99C164.019 32.1885 164.157 32.5095 164.402 32.7313C164.653 32.9473 164.942 33.0553 165.269 33.0553C165.531 33.0553 165.75 32.9969 165.925 32.8802C166.106 32.7576 166.24 32.5941 166.328 32.3898H167.256C167.139 32.7984 166.906 33.1399 166.556 33.4143C166.211 33.6886 165.782 33.8258 165.269 33.8258ZM165.269 30.0346C164.959 30.0346 164.685 30.1279 164.445 30.3147C164.206 30.4957 164.06 30.77 164.008 31.1378H166.459C166.442 30.7992 166.322 30.5307 166.1 30.3322C165.879 30.1338 165.601 30.0346 165.269 30.0346ZM168.35 33.7207V29.3779H169.173L169.243 30.1396C169.378 29.8711 169.573 29.661 169.83 29.5092C170.093 29.3516 170.393 29.2728 170.732 29.2728C171.257 29.2728 171.669 29.4362 171.967 29.7631C172.27 30.09 172.422 30.5774 172.422 31.2253V33.7207H171.502V31.3216C171.502 30.4811 171.158 30.0608 170.469 30.0608C170.125 30.0608 169.839 30.1834 169.611 30.4286C169.389 30.6737 169.279 31.0239 169.279 31.4792V33.7207H168.35ZM175.756 33.7207V27.5917H177.743C178.461 27.5917 179.051 27.7172 179.512 27.9682C179.979 28.2192 180.324 28.5753 180.545 29.0364C180.773 29.4917 180.887 30.0346 180.887 30.665C180.887 31.2895 180.773 31.8324 180.545 32.2935C180.324 32.7488 179.979 33.102 179.512 33.353C179.051 33.5981 178.461 33.7207 177.743 33.7207H175.756ZM176.684 32.9327H177.708C178.263 32.9327 178.701 32.8422 179.022 32.6613C179.349 32.4803 179.582 32.2206 179.722 31.882C179.868 31.5435 179.941 31.1378 179.941 30.665C179.941 30.1922 179.868 29.7836 179.722 29.4392C179.582 29.0948 179.349 28.8321 179.022 28.6512C178.701 28.4644 178.263 28.371 177.708 28.371H176.684V32.9327ZM183.909 33.8258C183.482 33.8258 183.103 33.7324 182.77 33.5456C182.443 33.353 182.187 33.0874 182 32.7488C181.813 32.4103 181.72 32.0163 181.72 31.5668C181.72 31.1115 181.81 30.7117 181.991 30.3673C182.178 30.0229 182.435 29.7544 182.762 29.5617C183.094 29.3691 183.48 29.2728 183.917 29.2728C184.343 29.2728 184.714 29.3691 185.029 29.5617C185.345 29.7485 185.59 29.9995 185.765 30.3147C185.94 30.6299 186.027 30.9773 186.027 31.3567C186.027 31.415 186.025 31.4792 186.019 31.5493C186.019 31.6135 186.016 31.6865 186.01 31.7682H182.63C182.659 32.1885 182.797 32.5095 183.042 32.7313C183.293 32.9473 183.582 33.0553 183.909 33.0553C184.171 33.0553 184.39 32.9969 184.565 32.8802C184.746 32.7576 184.88 32.5941 184.968 32.3898H185.896C185.779 32.7984 185.546 33.1399 185.196 33.4143C184.851 33.6886 184.422 33.8258 183.909 33.8258ZM183.909 30.0346C183.599 30.0346 183.325 30.1279 183.086 30.3147C182.846 30.4957 182.7 30.77 182.648 31.1378H185.099C185.082 30.7992 184.962 30.5307 184.74 30.3322C184.519 30.1338 184.241 30.0346 183.909 30.0346ZM154.927 44.7207V38.5917H157.072C157.551 38.5917 157.948 38.6734 158.263 38.8369C158.578 38.9945 158.812 39.2134 158.963 39.4936C159.121 39.7679 159.2 40.0802 159.2 40.4304C159.2 40.7631 159.124 41.0696 158.972 41.3498C158.826 41.6241 158.596 41.843 158.28 42.0064C157.965 42.1699 157.562 42.2516 157.072 42.2516H155.855V44.7207H154.927ZM155.855 41.4898H157.028C157.466 41.4898 157.778 41.3965 157.965 41.2097C158.158 41.017 158.254 40.7573 158.254 40.4304C158.254 40.0919 158.158 39.8292 157.965 39.6424C157.778 39.4498 157.466 39.3535 157.028 39.3535H155.855V41.4898ZM161.874 44.8258C161.448 44.8258 161.068 44.7324 160.736 44.5456C160.409 44.353 160.152 44.0874 159.965 43.7488C159.778 43.4103 159.685 43.0163 159.685 42.5668C159.685 42.1115 159.776 41.7117 159.956 41.3673C160.143 41.0229 160.4 40.7544 160.727 40.5617C161.06 40.3691 161.445 40.2728 161.883 40.2728C162.309 40.2728 162.68 40.3691 162.995 40.5617C163.31 40.7485 163.555 40.9995 163.73 41.3147C163.905 41.6299 163.993 41.9773 163.993 42.3567C163.993 42.415 163.99 42.4792 163.984 42.5493C163.984 42.6135 163.981 42.6865 163.975 42.7682H160.596C160.625 43.1885 160.762 43.5095 161.007 43.7313C161.258 43.9473 161.547 44.0553 161.874 44.0553C162.137 44.0553 162.356 43.9969 162.531 43.8802C162.712 43.7576 162.846 43.5941 162.933 43.3898H163.862C163.745 43.7984 163.511 44.1399 163.161 44.4143C162.817 44.6886 162.388 44.8258 161.874 44.8258ZM161.874 41.0346C161.565 41.0346 161.29 41.1279 161.051 41.3147C160.812 41.4957 160.666 41.77 160.613 42.1378H163.065C163.047 41.7992 162.928 41.5307 162.706 41.3322C162.484 41.1338 162.207 41.0346 161.874 41.0346ZM164.956 44.7207V40.3779H165.788L165.866 41.2009C166.018 40.9149 166.228 40.6902 166.497 40.5267C166.771 40.3574 167.101 40.2728 167.486 40.2728V41.2447H167.232C166.976 41.2447 166.745 41.2885 166.541 41.376C166.342 41.4577 166.182 41.6008 166.059 41.8051C165.942 42.0035 165.884 42.2808 165.884 42.6368V44.7207H164.956ZM168.501 44.7207V41.1571H167.879V40.3779H168.501V39.7475C168.501 39.2747 168.618 38.9361 168.851 38.7318C169.09 38.5217 169.426 38.4166 169.858 38.4166H170.313V39.2046H169.998C169.794 39.2046 169.648 39.2484 169.56 39.3359C169.473 39.4177 169.429 39.5578 169.429 39.7562V40.3779H172.178V44.7207H171.25V41.1571H169.429V44.7207H168.501ZM171.723 39.6512C171.548 39.6512 171.402 39.5986 171.285 39.4936C171.174 39.3826 171.119 39.2426 171.119 39.0733C171.119 38.9098 171.174 38.7756 171.285 38.6705C171.402 38.5654 171.548 38.5129 171.723 38.5129C171.898 38.5129 172.041 38.5654 172.152 38.6705C172.269 38.7756 172.327 38.9098 172.327 39.0733C172.327 39.2426 172.269 39.3826 172.152 39.4936C172.041 39.5986 171.898 39.6512 171.723 39.6512ZM173.412 44.7207V38.4166H174.34V44.7207H173.412Z" fill="#89868D"/>
<circle cx="293.446" cy="8.75587" r="6.01954" fill="#B1E0E9"/>
<path d="M266.087 33.7207L268.346 27.5917H269.362L271.603 33.7207H270.622L270.097 32.2235H267.593L267.068 33.7207H266.087ZM267.856 31.488H269.834L268.845 28.6949L267.856 31.488ZM274.258 33.8258C273.832 33.8258 273.45 33.7295 273.111 33.5368C272.778 33.3442 272.516 33.0786 272.323 32.7401C272.136 32.3957 272.043 31.9987 272.043 31.5493C272.043 31.0998 272.136 30.7058 272.323 30.3673C272.516 30.0229 272.778 29.7544 273.111 29.5617C273.45 29.3691 273.832 29.2728 274.258 29.2728C274.795 29.2728 275.245 29.4129 275.606 29.6931C275.974 29.9733 276.211 30.3527 276.316 30.8313H275.344C275.285 30.592 275.157 30.4052 274.959 30.271C274.76 30.1367 274.527 30.0696 274.258 30.0696C274.03 30.0696 273.82 30.1279 273.628 30.2447C273.435 30.3556 273.28 30.522 273.164 30.7438C273.047 30.9597 272.988 31.2282 272.988 31.5493C272.988 31.8703 273.047 32.1418 273.164 32.3636C273.28 32.5795 273.435 32.7459 273.628 32.8626C273.82 32.9794 274.03 33.0378 274.258 33.0378C274.527 33.0378 274.76 32.9706 274.959 32.8364C275.157 32.7021 275.285 32.5124 275.344 32.2673H276.316C276.216 32.7342 275.983 33.1107 275.615 33.3967C275.247 33.6828 274.795 33.8258 274.258 33.8258ZM279.354 33.8258C278.927 33.8258 278.548 33.7324 278.215 33.5456C277.888 33.353 277.632 33.0874 277.445 32.7488C277.258 32.4103 277.165 32.0163 277.165 31.5668C277.165 31.1115 277.255 30.7117 277.436 30.3673C277.623 30.0229 277.88 29.7544 278.207 29.5617C278.539 29.3691 278.925 29.2728 279.362 29.2728C279.788 29.2728 280.159 29.3691 280.474 29.5617C280.789 29.7485 281.035 29.9995 281.21 30.3147C281.385 30.6299 281.472 30.9773 281.472 31.3567C281.472 31.415 281.47 31.4792 281.464 31.5493C281.464 31.6135 281.461 31.6865 281.455 31.7682H278.075C278.104 32.1885 278.242 32.5095 278.487 32.7313C278.738 32.9473 279.027 33.0553 279.354 33.0553C279.616 33.0553 279.835 32.9969 280.01 32.8802C280.191 32.7576 280.325 32.5941 280.413 32.3898H281.341C281.224 32.7984 280.991 33.1399 280.641 33.4143C280.296 33.6886 279.867 33.8258 279.354 33.8258ZM279.354 30.0346C279.044 30.0346 278.77 30.1279 278.531 30.3147C278.291 30.4957 278.145 30.77 278.093 31.1378H280.544C280.527 30.7992 280.407 30.5307 280.185 30.3322C279.964 30.1338 279.686 30.0346 279.354 30.0346ZM282.435 33.7207V29.3779H283.267L283.346 30.2009C283.498 29.9149 283.708 29.6902 283.976 29.5267C284.251 29.3574 284.581 29.2728 284.966 29.2728V30.2447H284.712C284.455 30.2447 284.225 30.2885 284.02 30.376C283.822 30.4577 283.661 30.6008 283.539 30.8051C283.422 31.0035 283.364 31.2808 283.364 31.6368V33.7207H282.435ZM287.699 33.8258C287.273 33.8258 286.891 33.7295 286.552 33.5368C286.22 33.3442 285.957 33.0786 285.764 32.7401C285.578 32.3957 285.484 31.9987 285.484 31.5493C285.484 31.0998 285.578 30.7058 285.764 30.3673C285.957 30.0229 286.22 29.7544 286.552 29.5617C286.891 29.3691 287.273 29.2728 287.699 29.2728C288.236 29.2728 288.686 29.4129 289.048 29.6931C289.416 29.9733 289.652 30.3527 289.757 30.8313H288.785C288.727 30.592 288.598 30.4052 288.4 30.271C288.201 30.1367 287.968 30.0696 287.699 30.0696C287.472 30.0696 287.262 30.1279 287.069 30.2447C286.876 30.3556 286.722 30.522 286.605 30.7438C286.488 30.9597 286.43 31.2282 286.43 31.5493C286.43 31.8703 286.488 32.1418 286.605 32.3636C286.722 32.5795 286.876 32.7459 287.069 32.8626C287.262 32.9794 287.472 33.0378 287.699 33.0378C287.968 33.0378 288.201 32.9706 288.4 32.8364C288.598 32.7021 288.727 32.5124 288.785 32.2673H289.757C289.658 32.7342 289.424 33.1107 289.057 33.3967C288.689 33.6828 288.236 33.8258 287.699 33.8258ZM292.235 33.8258C291.867 33.8258 291.563 33.7645 291.324 33.6419C291.085 33.5193 290.907 33.3588 290.79 33.1603C290.673 32.956 290.615 32.7342 290.615 32.4949C290.615 32.0746 290.778 31.7419 291.105 31.4968C291.432 31.2516 291.899 31.129 292.506 31.129H293.644V31.0502C293.644 30.7117 293.551 30.4577 293.364 30.2885C293.183 30.1192 292.947 30.0346 292.655 30.0346C292.398 30.0346 292.173 30.0988 291.981 30.2272C291.794 30.3498 291.68 30.5336 291.639 30.7788H290.711C290.74 30.4636 290.845 30.1951 291.026 29.9733C291.213 29.7456 291.447 29.5734 291.727 29.4567C292.013 29.3341 292.325 29.2728 292.664 29.2728C293.271 29.2728 293.741 29.4333 294.073 29.7544C294.406 30.0696 294.572 30.5015 294.572 31.0502V33.7207H293.767L293.688 32.9765C293.565 33.2158 293.387 33.4172 293.154 33.5806C292.92 33.7441 292.614 33.8258 292.235 33.8258ZM292.418 33.0728C292.669 33.0728 292.88 33.0144 293.049 32.8977C293.224 32.7751 293.358 32.6146 293.452 32.4161C293.551 32.2176 293.612 31.9987 293.635 31.7594H292.602C292.235 31.7594 291.972 31.8236 291.814 31.9521C291.663 32.0805 291.587 32.241 291.587 32.4336C291.587 32.6321 291.66 32.7897 291.806 32.9064C291.957 33.0173 292.162 33.0728 292.418 33.0728ZM297.896 33.7207V27.5917H299.883C300.601 27.5917 301.191 27.7172 301.652 27.9682C302.119 28.2192 302.463 28.5753 302.685 29.0364C302.913 29.4917 303.026 30.0346 303.026 30.665C303.026 31.2895 302.913 31.8324 302.685 32.2935C302.463 32.7488 302.119 33.102 301.652 33.353C301.191 33.5981 300.601 33.7207 299.883 33.7207H297.896ZM298.824 32.9327H299.848C300.403 32.9327 300.84 32.8422 301.161 32.6613C301.488 32.4803 301.722 32.2206 301.862 31.882C302.008 31.5435 302.081 31.1378 302.081 30.665C302.081 30.1922 302.008 29.7836 301.862 29.4392C301.722 29.0948 301.488 28.8321 301.161 28.6512C300.84 28.4644 300.403 28.371 299.848 28.371H298.824V32.9327ZM306.048 33.8258C305.622 33.8258 305.243 33.7324 304.91 33.5456C304.583 33.353 304.326 33.0874 304.139 32.7488C303.953 32.4103 303.859 32.0163 303.859 31.5668C303.859 31.1115 303.95 30.7117 304.131 30.3673C304.317 30.0229 304.574 29.7544 304.901 29.5617C305.234 29.3691 305.619 29.2728 306.057 29.2728C306.483 29.2728 306.854 29.3691 307.169 29.5617C307.484 29.7485 307.729 29.9995 307.904 30.3147C308.079 30.6299 308.167 30.9773 308.167 31.3567C308.167 31.415 308.164 31.4792 308.158 31.5493C308.158 31.6135 308.155 31.6865 308.15 31.7682H304.77C304.799 32.1885 304.936 32.5095 305.181 32.7313C305.432 32.9473 305.721 33.0553 306.048 33.0553C306.311 33.0553 306.53 32.9969 306.705 32.8802C306.886 32.7576 307.02 32.5941 307.108 32.3898H308.036C307.919 32.7984 307.685 33.1399 307.335 33.4143C306.991 33.6886 306.562 33.8258 306.048 33.8258ZM306.048 30.0346C305.739 30.0346 305.464 30.1279 305.225 30.3147C304.986 30.4957 304.84 30.77 304.787 31.1378H307.239C307.221 30.7992 307.102 30.5307 306.88 30.3322C306.658 30.1338 306.381 30.0346 306.048 30.0346ZM311.371 33.7207V27.5917H312.466L314.541 31.6719L316.607 27.5917H317.701V33.7207H316.773V29.194L314.9 32.8451H314.182L312.299 29.2028V33.7207H311.371ZM319.437 28.5548C319.262 28.5548 319.116 28.5023 318.999 28.3972C318.888 28.2863 318.833 28.1492 318.833 27.9857C318.833 27.8223 318.888 27.688 318.999 27.583C319.116 27.4721 319.262 27.4166 319.437 27.4166C319.612 27.4166 319.755 27.4721 319.866 27.583C319.983 27.688 320.041 27.8223 320.041 27.9857C320.041 28.1492 319.983 28.2863 319.866 28.3972C319.755 28.5023 319.612 28.5548 319.437 28.5548ZM318.973 33.7207V29.3779H319.901V33.7207H318.973Z" fill="#89868D"/>
</svg>
