<svg width="14" height="14" viewBox="0 0 14 14" fill="none" xmlns="http://www.w3.org/2000/svg">
<g id="Icon/calendar" clip-path="url(#clip0_668_7155)">
<path id="Vector" d="M3 0.875V1.75H1.5C0.671875 1.75 0 2.33789 0 3.0625V4.375H14V3.0625C14 2.33789 13.3281 1.75 12.5 1.75H11V0.875C11 0.391016 10.5531 0 10 0C9.44687 0 9 0.391016 9 0.875V1.75H5V0.875C5 0.391016 4.55312 0 4 0C3.44688 0 3 0.391016 3 0.875ZM14 5.25H0V12.6875C0 13.4121 0.671875 14 1.5 14H12.5C13.3281 14 14 13.4121 14 12.6875V5.25Z" fill="#727272"/>
</g>
<defs>
<clipPath id="clip0_668_7155">
<rect width="14" height="14" fill="white"/>
</clipPath>
</defs>
</svg>
