<svg width="29" height="29" viewBox="0 0 29 29" fill="none" xmlns="http://www.w3.org/2000/svg">
<path d="M23.5302 11.859C23.5302 14.4362 22.6934 16.8169 21.2838 18.7484L28.3936 25.8624C29.0956 26.5642 29.0956 27.704 28.3936 28.4059C27.6916 29.1078 26.5516 29.1078 25.8496 28.4059L18.7398 21.2919C16.8079 22.7069 14.4268 23.5378 11.8491 23.5378C5.39639 23.5378 0.167969 18.3104 0.167969 11.859C0.167969 5.40758 5.39639 0.180176 11.8491 0.180176C18.3018 0.180176 23.5302 5.40758 23.5302 11.859ZM11.8491 19.9444C16.3137 19.9444 19.936 16.3228 19.936 11.859C19.936 7.39523 16.3137 3.77366 11.8491 3.77366C7.38443 3.77366 3.76216 7.39523 3.76216 11.859C3.76216 16.3228 7.38443 19.9444 11.8491 19.9444Z" fill="white" fill-opacity="0.7"/>
</svg>
