<svg width="23" height="23" viewBox="0 0 23 23" fill="none" xmlns="http://www.w3.org/2000/svg">
<mask id="mask0_766_7404" style="mask-type:luminance" maskUnits="userSpaceOnUse" x="3" y="1" width="17" height="21">
<path d="M3.5437 1.1499H19.452V21.8499H3.5437V1.1499Z" fill="white"/>
</mask>
<g mask="url(#mask0_766_7404)">
<path d="M11.4979 1.15674C11.3678 1.15674 11.2377 1.15995 11.1077 1.16639C10.9776 1.17271 10.8478 1.18225 10.7182 1.19512C10.5887 1.20787 10.4596 1.22373 10.3308 1.24292C10.202 1.262 10.0738 1.28418 9.94612 1.30958C9.81846 1.33498 9.69145 1.3636 9.56523 1.39521C9.43889 1.42682 9.31356 1.46154 9.18888 1.49936C9.06432 1.53719 8.94076 1.57801 8.8182 1.62182C8.69563 1.66574 8.57429 1.71255 8.45394 1.76235C8.3337 1.81226 8.2148 1.86495 8.09712 1.92063C7.97943 1.97631 7.86319 2.03488 7.74839 2.09622C7.63359 2.15766 7.52034 2.22178 7.40865 2.28877C7.29695 2.35565 7.18703 2.42531 7.07878 2.49763C6.97063 2.57006 6.86415 2.64493 6.75966 2.72257C6.65507 2.8001 6.55247 2.88019 6.45187 2.96282C6.35126 3.04545 6.25266 3.13042 6.15627 3.21782C6.05977 3.30534 5.96549 3.39507 5.87343 3.48713C5.78137 3.57919 5.69163 3.67347 5.60423 3.76997C5.51683 3.86647 5.43186 3.96508 5.34923 4.06568C5.2667 4.16639 5.18662 4.26899 5.10909 4.37359C5.03156 4.47818 4.95658 4.58456 4.88426 4.69281C4.81194 4.80107 4.74228 4.9111 4.6754 5.02279C4.60852 5.13449 4.54429 5.24774 4.48296 5.36254C4.42162 5.47745 4.36305 5.59369 4.30748 5.71137C4.2518 5.82917 4.19901 5.94807 4.1492 6.06842C4.0994 6.18877 4.05259 6.31022 4.00867 6.43279C3.96486 6.55535 3.92404 6.67902 3.88622 6.80359C3.8485 6.92826 3.81379 7.05371 3.78218 7.17993C3.75045 7.30627 3.72195 7.43327 3.69655 7.56105C3.67115 7.68871 3.64896 7.81693 3.62988 7.94582C3.6107 8.0746 3.59483 8.20382 3.58208 8.33337C3.56932 8.46292 3.55967 8.59281 3.55335 8.7228C3.54692 8.85291 3.5437 8.98302 3.5437 9.11324C3.5437 14.9135 9.25488 21.8437 11.4979 21.8437C13.741 21.8437 19.452 14.9135 19.452 9.11324C19.452 8.98302 19.4489 8.85291 19.4425 8.7228C19.4361 8.59281 19.4265 8.46292 19.4138 8.33337C19.401 8.20382 19.385 8.0746 19.366 7.94582C19.3469 7.81693 19.3246 7.68871 19.2992 7.56105C19.2738 7.43327 19.2453 7.30627 19.2137 7.17993C19.1821 7.05371 19.1473 6.92826 19.1095 6.80359C19.0718 6.67902 19.031 6.55535 18.9871 6.43279C18.9433 6.31022 18.8964 6.18877 18.8466 6.06842C18.7967 5.94807 18.744 5.82917 18.6884 5.71137C18.6327 5.59369 18.5742 5.47745 18.5129 5.36254C18.4514 5.24774 18.3873 5.13449 18.3204 5.02279C18.2535 4.9111 18.1839 4.80118 18.1116 4.69281C18.0393 4.58456 17.9643 4.47818 17.8868 4.37359C17.8092 4.26899 17.7291 4.16639 17.6465 4.06568C17.564 3.96508 17.479 3.86647 17.3915 3.76997C17.3041 3.67347 17.2144 3.57919 17.1223 3.48713C17.0304 3.39507 16.9361 3.30534 16.8396 3.21782C16.7432 3.13042 16.6446 3.04534 16.544 2.96282C16.4434 2.88019 16.3408 2.8001 16.2362 2.72257C16.1316 2.64493 16.0252 2.57006 15.917 2.49763C15.8088 2.42531 15.6988 2.35565 15.5872 2.28877C15.4755 2.22178 15.3623 2.15766 15.2475 2.09622C15.1327 2.03488 15.0164 1.97631 14.8987 1.92063C14.781 1.86495 14.6621 1.81226 14.5418 1.76235C14.4216 1.71255 14.3001 1.66574 14.1775 1.62182C14.055 1.57801 13.9314 1.53719 13.8069 1.49936C13.6823 1.46154 13.5568 1.42682 13.4306 1.39521C13.3044 1.3636 13.1774 1.33498 13.0497 1.30958C12.9221 1.28418 12.7938 1.262 12.6651 1.24292C12.5363 1.22373 12.4071 1.20787 12.2775 1.19512C12.148 1.18225 12.0182 1.17271 11.8882 1.16639C11.7582 1.15995 11.6281 1.15674 11.4979 1.15674ZM7.52079 9.11324C7.52079 9.04813 7.52245 8.98302 7.52567 8.91802C7.52877 8.85302 7.53365 8.78813 7.53997 8.72336C7.54641 8.65847 7.55428 8.59392 7.56382 8.52947C7.57347 8.46514 7.58456 8.40103 7.59721 8.33714C7.60996 8.27325 7.62416 8.20981 7.64002 8.14658C7.65588 8.08347 7.67319 8.02069 7.69204 7.95847C7.71101 7.89613 7.73142 7.83435 7.75327 7.77301C7.77523 7.71167 7.79864 7.651 7.82359 7.59088C7.84844 7.53065 7.87484 7.4712 7.90268 7.4123C7.93052 7.35352 7.9598 7.29529 7.99041 7.23794C8.02114 7.18049 8.05319 7.12381 8.08669 7.06801C8.12008 7.01222 8.1549 6.95721 8.19106 6.90308C8.22722 6.84895 8.26471 6.79571 8.30353 6.74336C8.34225 6.69111 8.38229 6.63976 8.42355 6.58951C8.46492 6.53916 8.5074 6.48991 8.5511 6.44166C8.59481 6.39341 8.63962 6.34627 8.68565 6.30024C8.73168 6.25421 8.77882 6.20929 8.82707 6.16558C8.87532 6.12188 8.92457 6.07929 8.97492 6.03803C9.02517 5.99677 9.07652 5.95672 9.12877 5.9179C9.18101 5.87908 9.23425 5.84159 9.28838 5.80543C9.34251 5.76927 9.39741 5.73444 9.45331 5.70095C9.50911 5.66756 9.56567 5.63539 9.62313 5.60478C9.68047 5.57406 9.7386 5.54477 9.79749 5.51693C9.85628 5.48909 9.91584 5.46269 9.97596 5.43785C10.0361 5.41289 10.0967 5.38949 10.1581 5.36753C10.2193 5.34557 10.2811 5.32516 10.3434 5.3063C10.4057 5.28744 10.4684 5.27003 10.5315 5.25417C10.5947 5.23842 10.6582 5.22411 10.722 5.21146C10.7859 5.19871 10.85 5.18762 10.9143 5.17808C10.9788 5.16854 11.0433 5.16055 11.1081 5.15412C11.1729 5.1478 11.2378 5.14303 11.3028 5.13981C11.3678 5.1366 11.4329 5.13504 11.4979 5.13504C11.563 5.13504 11.6281 5.1366 11.6931 5.13981C11.7581 5.14303 11.823 5.1478 11.8877 5.15412C11.9525 5.16055 12.0171 5.16854 12.0815 5.17808C12.1459 5.18762 12.21 5.19871 12.2739 5.21146C12.3376 5.22411 12.4011 5.23842 12.4643 5.25417C12.5274 5.27003 12.5901 5.28744 12.6524 5.3063C12.7146 5.32516 12.7764 5.34557 12.8378 5.36753C12.899 5.38949 12.9598 5.41289 13.0199 5.43785C13.08 5.46269 13.1395 5.48909 13.1984 5.51693C13.2571 5.54477 13.3153 5.57406 13.3727 5.60478C13.4301 5.63539 13.4867 5.66756 13.5425 5.70095C13.5983 5.73444 13.6533 5.76927 13.7075 5.80543C13.7616 5.84159 13.8147 5.87908 13.8671 5.9179C13.9193 5.95672 13.9707 5.99677 14.0209 6.03803C14.0713 6.07929 14.1205 6.12188 14.1688 6.16558C14.217 6.20929 14.2641 6.25421 14.3101 6.30024C14.3561 6.34627 14.401 6.39341 14.4447 6.44166C14.4884 6.48991 14.5309 6.53916 14.5722 6.58951C14.6136 6.63976 14.6536 6.69111 14.6923 6.74336C14.7311 6.79571 14.7686 6.84895 14.8048 6.90308C14.8409 6.95721 14.8757 7.01222 14.9092 7.06801C14.9427 7.12381 14.9747 7.18049 15.0054 7.23794C15.036 7.29529 15.0653 7.35352 15.0932 7.4123C15.121 7.4712 15.1473 7.53065 15.1723 7.59088C15.1972 7.651 15.2206 7.71167 15.2425 7.77301C15.2644 7.83435 15.2848 7.89613 15.3037 7.95847C15.3227 8.02069 15.34 8.08347 15.3558 8.14658C15.3716 8.20981 15.3859 8.27325 15.3985 8.33714C15.4113 8.40103 15.4224 8.46514 15.4319 8.52947C15.4415 8.59392 15.4494 8.65847 15.4559 8.72336C15.4622 8.78813 15.467 8.85302 15.4702 8.91802C15.4734 8.98302 15.475 9.04813 15.475 9.11324C15.475 9.17834 15.4734 9.24345 15.4702 9.30845C15.467 9.37345 15.4622 9.43834 15.4559 9.50322C15.4494 9.568 15.4415 9.63256 15.4319 9.697C15.4224 9.76133 15.4113 9.82555 15.3985 9.88933C15.3859 9.95322 15.3716 10.0168 15.3558 10.0799C15.34 10.143 15.3227 10.2058 15.3037 10.2681C15.2848 10.3303 15.2644 10.3921 15.2425 10.4535C15.2206 10.5148 15.1972 10.5755 15.1723 10.6357C15.1473 10.6958 15.121 10.7553 15.0932 10.8142C15.0653 10.8731 15.036 10.9312 15.0054 10.9885C14.9747 11.046 14.9427 11.1027 14.9092 11.1585C14.8757 11.2144 14.8409 11.2693 14.8048 11.3234C14.7686 11.3776 14.7311 11.4308 14.6923 11.4831C14.6536 11.5354 14.6136 11.5867 14.5722 11.6371C14.5309 11.6873 14.4884 11.7367 14.4447 11.7849C14.401 11.8331 14.3561 11.8802 14.3101 11.9263C14.2641 11.9724 14.217 12.0172 14.1688 12.0609C14.1205 12.1047 14.0713 12.1472 14.0209 12.1884C13.9707 12.2298 13.9193 12.2699 13.8671 12.3086C13.8147 12.3474 13.7616 12.3849 13.7075 12.421C13.6533 12.4572 13.5983 12.492 13.5425 12.5255C13.4867 12.559 13.4301 12.5911 13.3727 12.6218C13.3153 12.6524 13.2571 12.6817 13.1984 12.7095C13.1395 12.7374 13.08 12.7638 13.0199 12.7886C12.9598 12.8136 12.899 12.837 12.8378 12.8589C12.7764 12.8809 12.7146 12.9013 12.6524 12.9202C12.5901 12.9391 12.5274 12.9564 12.4643 12.9723C12.4011 12.9881 12.3376 13.0024 12.2739 13.015C12.21 13.0278 12.1459 13.0389 12.0815 13.0484C12.0171 13.058 11.9525 13.0659 11.8877 13.0724C11.823 13.0787 11.7581 13.0836 11.6931 13.0867C11.6281 13.0899 11.563 13.0915 11.4979 13.0915C11.4329 13.0915 11.3678 13.0899 11.3028 13.0867C11.2378 13.0836 11.1729 13.0787 11.1081 13.0724C11.0433 13.0659 10.9788 13.058 10.9143 13.0484C10.85 13.0389 10.7859 13.0278 10.722 13.015C10.6582 13.0024 10.5947 12.9881 10.5315 12.9723C10.4684 12.9564 10.4057 12.9391 10.3434 12.9202C10.2811 12.9013 10.2193 12.8809 10.1581 12.8589C10.0967 12.837 10.0361 12.8136 9.97596 12.7886C9.91584 12.7638 9.85628 12.7374 9.79749 12.7095C9.7386 12.6817 9.68047 12.6524 9.62313 12.6218C9.56567 12.5911 9.50911 12.559 9.45331 12.5255C9.39741 12.492 9.34251 12.4572 9.28838 12.421C9.23425 12.3849 9.18101 12.3474 9.12877 12.3086C9.07652 12.2699 9.02517 12.2298 8.97492 12.1884C8.92457 12.1472 8.87532 12.1047 8.82707 12.0609C8.77882 12.0172 8.73168 11.9724 8.68565 11.9263C8.63962 11.8802 8.59481 11.8331 8.5511 11.7849C8.5074 11.7367 8.46492 11.6873 8.42355 11.6371C8.38229 11.5867 8.34225 11.5354 8.30353 11.4831C8.26471 11.4308 8.22722 11.3776 8.19106 11.3234C8.1549 11.2693 8.12008 11.2144 8.08669 11.1585C8.05319 11.1027 8.02114 11.046 7.99041 10.9885C7.9598 10.9312 7.93052 10.8731 7.90268 10.8142C7.87484 10.7553 7.84844 10.6958 7.82359 10.6357C7.79864 10.5755 7.77523 10.5148 7.75327 10.4535C7.73142 10.3921 7.71101 10.3303 7.69204 10.2681C7.67319 10.2058 7.65588 10.143 7.64002 10.0799C7.62416 10.0168 7.60996 9.95322 7.59721 9.88933C7.58456 9.82555 7.57347 9.76133 7.56382 9.697C7.55428 9.63256 7.54641 9.568 7.53997 9.50322C7.53365 9.43834 7.52877 9.37345 7.52567 9.30845C7.52245 9.24345 7.52079 9.17834 7.52079 9.11324Z" fill="#86888A"/>
</g>
</svg>
