<svg width="17" height="17" viewBox="0 0 17 17" fill="none" xmlns="http://www.w3.org/2000/svg">
<path id="Vector" d="M13.2522 7.0179C13.2522 8.43413 12.7923 9.74238 12.0177 10.8038L15.9247 14.7131C16.3105 15.0988 16.3105 15.7251 15.9247 16.1108C15.539 16.4965 14.9125 16.4965 14.5267 16.1108L10.6197 12.2015C9.55813 12.979 8.24963 13.4357 6.83312 13.4357C3.28721 13.4357 0.414062 10.5631 0.414062 7.0179C0.414062 3.47268 3.28721 0.600098 6.83312 0.600098C10.379 0.600098 13.2522 3.47268 13.2522 7.0179ZM6.83312 11.461C9.28655 11.461 11.2771 9.47085 11.2771 7.0179C11.2771 4.56494 9.28655 2.57481 6.83312 2.57481C4.37968 2.57481 2.38916 4.56494 2.38916 7.0179C2.38916 9.47085 4.37968 11.461 6.83312 11.461Z" fill="white"/>
</svg>
