<svg width="27" height="27" viewBox="0 0 27 27" fill="none" xmlns="http://www.w3.org/2000/svg">
<rect x="13.3271" y="0.363281" width="18.6076" height="18.6076" rx="3.72151" transform="rotate(45 13.3271 0.363281)" fill="#676666"/>
<path d="M18.5306 11.8389C18.6212 11.6227 18.6212 11.3791 18.5306 11.1628C18.489 11.0474 18.421 10.9434 18.3321 10.8589L16.6823 9.20283C16.3157 8.86125 15.7444 8.87132 15.3901 9.22563C15.0358 9.57993 15.0257 10.1512 15.3673 10.5178L15.4231 10.5736H12.6816C11.7714 10.5736 10.8987 10.936 10.2562 11.5808C9.6138 12.2255 9.25454 13.0996 9.25784 14.0098V18.1779C9.25784 18.6917 9.67438 19.1083 10.1882 19.1083C10.702 19.1083 11.1186 18.6917 11.1186 18.1779V14.0098C11.122 13.149 11.8208 12.4529 12.6816 12.4529H15.4231L15.3673 12.5026C15.0079 12.8672 15.0079 13.4529 15.3673 13.8175C15.5428 13.9903 15.7785 14.0882 16.0248 14.0904C16.2716 14.0909 16.5083 13.9926 16.6823 13.8175L18.3259 12.149C18.4123 12.0625 18.4799 11.959 18.5244 11.8451L18.5306 11.8389Z" fill="white"/>
</svg>
