<svg width="428" height="48" viewBox="0 0 428 48" fill="none" xmlns="http://www.w3.org/2000/svg">
<path d="M24.6865 8.75586L410.662 8.75589" stroke="#1ABAD6" stroke-opacity="0.4" stroke-width="0.547231"/>
<circle cx="16.7557" cy="8.7557" r="8.7557" fill="#1ABAD6"/>
<circle cx="153.563" cy="8.75587" r="6.01954" fill="#ADE1EB"/>
<path d="M139.612 33.8258C139.163 33.8258 138.769 33.747 138.43 33.5894C138.091 33.4318 137.826 33.207 137.633 32.9152C137.446 32.6233 137.35 32.276 137.344 31.8733H138.325C138.331 32.2001 138.445 32.4774 138.666 32.705C138.888 32.9327 139.2 33.0465 139.603 33.0465C139.959 33.0465 140.237 32.9619 140.435 32.7926C140.639 32.6175 140.741 32.3957 140.741 32.1272C140.741 31.9112 140.692 31.7361 140.593 31.6018C140.499 31.4676 140.368 31.3567 140.199 31.2691C140.035 31.1815 139.845 31.1027 139.63 31.0327C139.414 30.9627 139.186 30.8868 138.947 30.8051C138.474 30.6475 138.118 30.4432 137.878 30.1922C137.645 29.9412 137.528 29.6114 137.528 29.2028C137.522 28.8584 137.601 28.5578 137.765 28.3009C137.934 28.0441 138.167 27.8456 138.465 27.7055C138.769 27.5596 139.122 27.4866 139.524 27.4866C139.921 27.4866 140.269 27.5596 140.566 27.7055C140.87 27.8515 141.106 28.0558 141.276 28.3184C141.445 28.5753 141.532 28.8759 141.538 29.2203H140.558C140.558 29.0627 140.517 28.9138 140.435 28.7737C140.353 28.6278 140.234 28.5081 140.076 28.4147C139.918 28.3214 139.726 28.2747 139.498 28.2747C139.206 28.2688 138.964 28.3418 138.771 28.4936C138.585 28.6453 138.491 28.8555 138.491 29.124C138.491 29.3633 138.561 29.5472 138.701 29.6756C138.841 29.804 139.034 29.912 139.279 29.9995C139.524 30.0813 139.805 30.1776 140.12 30.2885C140.423 30.3877 140.695 30.5074 140.934 30.6475C141.173 30.7875 141.363 30.9714 141.503 31.1991C141.649 31.4267 141.722 31.7156 141.722 32.0659C141.722 32.3752 141.643 32.6642 141.486 32.9327C141.328 33.1954 141.092 33.4113 140.777 33.5806C140.461 33.7441 140.073 33.8258 139.612 33.8258ZM144.733 33.8258C144.307 33.8258 143.928 33.7324 143.595 33.5456C143.268 33.353 143.011 33.0874 142.824 32.7488C142.638 32.4103 142.544 32.0163 142.544 31.5668C142.544 31.1115 142.635 30.7117 142.816 30.3673C143.002 30.0229 143.259 29.7544 143.586 29.5617C143.919 29.3691 144.304 29.2728 144.742 29.2728C145.168 29.2728 145.539 29.3691 145.854 29.5617C146.169 29.7485 146.414 29.9995 146.589 30.3147C146.764 30.6299 146.852 30.9773 146.852 31.3567C146.852 31.415 146.849 31.4792 146.843 31.5493C146.843 31.6135 146.84 31.6865 146.834 31.7682H143.455C143.484 32.1885 143.621 32.5095 143.866 32.7313C144.117 32.9473 144.406 33.0553 144.733 33.0553C144.996 33.0553 145.215 32.9969 145.39 32.8802C145.571 32.7576 145.705 32.5941 145.793 32.3898H146.721C146.604 32.7984 146.37 33.1399 146.02 33.4143C145.676 33.6886 145.247 33.8258 144.733 33.8258ZM144.733 30.0346C144.424 30.0346 144.149 30.1279 143.91 30.3147C143.671 30.4957 143.525 30.77 143.472 31.1378H145.924C145.906 30.7992 145.787 30.5307 145.565 30.3322C145.343 30.1338 145.066 30.0346 144.733 30.0346ZM147.815 33.7207V29.3779H148.647L148.726 30.2009C148.877 29.9149 149.087 29.6902 149.356 29.5267C149.63 29.3574 149.96 29.2728 150.345 29.2728V30.2447H150.091C149.835 30.2447 149.604 30.2885 149.4 30.376C149.201 30.4577 149.041 30.6008 148.918 30.8051C148.801 31.0035 148.743 31.2808 148.743 31.6368V33.7207H147.815ZM152.358 33.7207L150.73 29.3779H151.701L152.91 32.8364L154.118 29.3779H155.081L153.461 33.7207H152.358ZM156.369 28.5548C156.194 28.5548 156.048 28.5023 155.931 28.3972C155.821 28.2863 155.765 28.1492 155.765 27.9857C155.765 27.8223 155.821 27.688 155.931 27.583C156.048 27.4721 156.194 27.4166 156.369 27.4166C156.544 27.4166 156.687 27.4721 156.798 27.583C156.915 27.688 156.973 27.8223 156.973 27.9857C156.973 28.1492 156.915 28.2863 156.798 28.3972C156.687 28.5023 156.544 28.5548 156.369 28.5548ZM155.905 33.7207V29.3779H156.833V33.7207H155.905ZM160.116 33.8258C159.69 33.8258 159.308 33.7295 158.969 33.5368C158.636 33.3442 158.374 33.0786 158.181 32.7401C157.994 32.3957 157.901 31.9987 157.901 31.5493C157.901 31.0998 157.994 30.7058 158.181 30.3673C158.374 30.0229 158.636 29.7544 158.969 29.5617C159.308 29.3691 159.69 29.2728 160.116 29.2728C160.653 29.2728 161.103 29.4129 161.464 29.6931C161.832 29.9733 162.069 30.3527 162.174 30.8313H161.202C161.143 30.592 161.015 30.4052 160.817 30.271C160.618 30.1367 160.385 30.0696 160.116 30.0696C159.888 30.0696 159.678 30.1279 159.486 30.2447C159.293 30.3556 159.138 30.522 159.022 30.7438C158.905 30.9597 158.846 31.2282 158.846 31.5493C158.846 31.8703 158.905 32.1418 159.022 32.3636C159.138 32.5795 159.293 32.7459 159.486 32.8626C159.678 32.9794 159.888 33.0378 160.116 33.0378C160.385 33.0378 160.618 32.9706 160.817 32.8364C161.015 32.7021 161.143 32.5124 161.202 32.2673H162.174C162.074 32.7342 161.841 33.1107 161.473 33.3967C161.105 33.6828 160.653 33.8258 160.116 33.8258ZM163.706 28.5548C163.53 28.5548 163.385 28.5023 163.268 28.3972C163.157 28.2863 163.101 28.1492 163.101 27.9857C163.101 27.8223 163.157 27.688 163.268 27.583C163.385 27.4721 163.53 27.4166 163.706 27.4166C163.881 27.4166 164.024 27.4721 164.135 27.583C164.251 27.688 164.31 27.8223 164.31 27.9857C164.31 28.1492 164.251 28.2863 164.135 28.3972C164.024 28.5023 163.881 28.5548 163.706 28.5548ZM163.242 33.7207V29.3779H164.17V33.7207H163.242ZM167.426 33.8258C167.012 33.8258 166.638 33.7324 166.305 33.5456C165.979 33.353 165.719 33.0874 165.526 32.7488C165.334 32.4044 165.237 32.0046 165.237 31.5493C165.237 31.094 165.334 30.6971 165.526 30.3585C165.725 30.0141 165.99 29.7485 166.323 29.5617C166.656 29.3691 167.026 29.2728 167.435 29.2728C167.849 29.2728 168.22 29.3691 168.547 29.5617C168.88 29.7485 169.142 30.0141 169.335 30.3585C169.533 30.6971 169.633 31.094 169.633 31.5493C169.633 32.0046 169.533 32.4044 169.335 32.7488C169.142 33.0874 168.88 33.353 168.547 33.5456C168.214 33.7324 167.841 33.8258 167.426 33.8258ZM167.426 33.029C167.648 33.029 167.852 32.9736 168.039 32.8626C168.232 32.7517 168.386 32.5883 168.503 32.3723C168.62 32.1505 168.678 31.8762 168.678 31.5493C168.678 31.2224 168.62 30.951 168.503 30.735C168.392 30.5132 168.24 30.3468 168.048 30.2359C167.861 30.125 167.657 30.0696 167.435 30.0696C167.213 30.0696 167.006 30.125 166.813 30.2359C166.626 30.3468 166.475 30.5132 166.358 30.735C166.241 30.951 166.183 31.2224 166.183 31.5493C166.183 31.8762 166.241 32.1505 166.358 32.3723C166.475 32.5883 166.626 32.7517 166.813 32.8626C167 32.9736 167.204 33.029 167.426 33.029ZM172.37 33.8258C171.821 33.8258 171.369 33.6915 171.013 33.423C170.657 33.1545 170.452 32.7984 170.4 32.3548H171.337C171.383 32.5533 171.494 32.7255 171.669 32.8714C171.845 33.0115 172.075 33.0815 172.361 33.0815C172.641 33.0815 172.846 33.0232 172.974 32.9064C173.102 32.7897 173.167 32.6554 173.167 32.5037C173.167 32.2818 173.076 32.133 172.895 32.0571C172.72 31.9754 172.475 31.9024 172.16 31.8382C171.915 31.7857 171.669 31.7156 171.424 31.6281C171.185 31.5405 170.984 31.418 170.82 31.2604C170.663 31.0969 170.584 30.878 170.584 30.6037C170.584 30.2243 170.73 29.9091 171.021 29.6581C171.313 29.4012 171.722 29.2728 172.247 29.2728C172.732 29.2728 173.123 29.3895 173.421 29.623C173.724 29.8565 173.902 30.1863 173.955 30.6124H173.062C173.032 30.4256 172.945 30.2797 172.799 30.1746C172.659 30.0696 172.469 30.017 172.23 30.017C171.996 30.017 171.815 30.0667 171.687 30.1659C171.559 30.2593 171.494 30.3819 171.494 30.5336C171.494 30.6854 171.582 30.8051 171.757 30.8926C171.938 30.9802 172.174 31.059 172.466 31.129C172.758 31.1932 173.027 31.2691 173.272 31.3567C173.523 31.4384 173.724 31.561 173.876 31.7244C174.028 31.8878 174.104 32.1272 174.104 32.4424C174.109 32.8393 173.955 33.1691 173.639 33.4318C173.33 33.6944 172.907 33.8258 172.37 33.8258Z" fill="#89868D"/>
<path d="M3.37155 33.8248C2.76449 33.8248 2.23915 33.6935 1.79553 33.4308C1.35774 33.1623 1.01919 32.7916 0.779866 32.3188C0.540543 31.8402 0.420882 31.2886 0.420882 30.664C0.420882 30.0336 0.540543 29.482 0.779866 29.0092C1.01919 28.5305 1.35774 28.1569 1.79553 27.8884C2.23915 27.6199 2.76449 27.4857 3.37155 27.4857C4.08952 27.4857 4.67615 27.6608 5.13145 28.011C5.58675 28.3612 5.87568 28.8516 5.99826 29.482H4.96509C4.88337 29.1259 4.70826 28.8428 4.43975 28.6327C4.17124 28.4225 3.81226 28.3175 3.3628 28.3175C2.7499 28.3175 2.26542 28.5276 1.90935 28.9479C1.55329 29.3623 1.37525 29.9343 1.37525 30.664C1.37525 31.3878 1.55329 31.9569 1.90935 32.3713C2.26542 32.7858 2.7499 32.993 3.3628 32.993C3.81226 32.993 4.17124 32.8938 4.43975 32.6953C4.70826 32.4968 4.88337 32.2254 4.96509 31.881H5.99826C5.87568 32.4881 5.58675 32.9638 5.13145 33.3082C4.67615 33.6526 4.08952 33.8248 3.37155 33.8248ZM9.01474 33.8248C8.6003 33.8248 8.22673 33.7314 7.89401 33.5446C7.56713 33.352 7.30738 33.0864 7.11475 32.7478C6.92213 32.4035 6.82581 32.0036 6.82581 31.5483C6.82581 31.093 6.92213 30.6961 7.11475 30.3575C7.31321 30.0131 7.5788 29.7476 7.91152 29.5608C8.24424 29.3681 8.6149 29.2718 9.02349 29.2718C9.43793 29.2718 9.80859 29.3681 10.1355 29.5608C10.4682 29.7476 10.7309 30.0131 10.9235 30.3575C11.1219 30.6961 11.2212 31.093 11.2212 31.5483C11.2212 32.0036 11.1219 32.4035 10.9235 32.7478C10.7309 33.0864 10.4682 33.352 10.1355 33.5446C9.80275 33.7314 9.42918 33.8248 9.01474 33.8248ZM9.01474 33.028C9.23655 33.028 9.44085 32.9726 9.62764 32.8617C9.82026 32.7508 9.97495 32.5873 10.0917 32.3713C10.2084 32.1495 10.2668 31.8752 10.2668 31.5483C10.2668 31.2214 10.2084 30.95 10.0917 30.734C9.98078 30.5122 9.82902 30.3459 9.63639 30.235C9.44961 30.1241 9.24531 30.0686 9.02349 30.0686C8.80168 30.0686 8.59447 30.1241 8.40184 30.235C8.21505 30.3459 8.06329 30.5122 7.94654 30.734C7.8298 30.95 7.77143 31.2214 7.77143 31.5483C7.77143 31.8752 7.8298 32.1495 7.94654 32.3713C8.06329 32.5873 8.21505 32.7508 8.40184 32.8617C8.58863 32.9726 8.79293 33.028 9.01474 33.028ZM12.2249 33.7197V29.3769H13.0479L13.1179 30.1386C13.2522 29.8701 13.4477 29.66 13.7046 29.5082C13.9672 29.3506 14.2679 29.2718 14.6064 29.2718C15.1318 29.2718 15.5433 29.4353 15.841 29.7621C16.1445 30.089 16.2963 30.5764 16.2963 31.2244V33.7197H15.3769V31.3207C15.3769 30.4801 15.0325 30.0598 14.3437 30.0598C13.9994 30.0598 13.7133 30.1824 13.4857 30.4276C13.2639 30.6727 13.153 31.023 13.153 31.4783V33.7197H12.2249ZM19.123 33.8248C18.5743 33.8248 18.1219 33.6905 17.7659 33.422C17.4098 33.1535 17.2055 32.7975 17.153 32.3538H18.0898C18.1365 32.5523 18.2474 32.7245 18.4225 32.8704C18.5976 33.0105 18.8282 33.0806 19.1142 33.0806C19.3944 33.0806 19.5987 33.0222 19.7271 32.9054C19.8555 32.7887 19.9198 32.6544 19.9198 32.5027C19.9198 32.2809 19.8293 32.132 19.6483 32.0561C19.4732 31.9744 19.2281 31.9015 18.9129 31.8373C18.6677 31.7847 18.4225 31.7147 18.1774 31.6271C17.9381 31.5396 17.7367 31.417 17.5732 31.2594C17.4156 31.0959 17.3368 30.877 17.3368 30.6027C17.3368 30.2233 17.4828 29.9081 17.7746 29.6571C18.0665 29.4002 18.4751 29.2718 19.0004 29.2718C19.4849 29.2718 19.876 29.3886 20.1737 29.6221C20.4772 29.8555 20.6552 30.1853 20.7078 30.6115H19.8147C19.7855 30.4247 19.6979 30.2787 19.552 30.1737C19.4119 30.0686 19.2222 30.0161 18.9829 30.0161C18.7494 30.0161 18.5685 30.0657 18.44 30.1649C18.3116 30.2583 18.2474 30.3809 18.2474 30.5327C18.2474 30.6844 18.335 30.8041 18.5101 30.8916C18.691 30.9792 18.9274 31.058 19.2193 31.128C19.5112 31.1922 19.7797 31.2681 20.0248 31.3557C20.2758 31.4374 20.4772 31.56 20.629 31.7234C20.7807 31.8869 20.8566 32.1262 20.8566 32.4414C20.8625 32.8383 20.7078 33.1681 20.3926 33.4308C20.0832 33.6935 19.66 33.8248 19.123 33.8248ZM23.4721 33.8248C22.9468 33.8248 22.5323 33.6614 22.2288 33.3345C21.9311 33.0076 21.7823 32.5202 21.7823 31.8723V29.3769H22.7104V31.776C22.7104 32.6165 23.0548 33.0368 23.7435 33.0368C24.0879 33.0368 24.371 32.9142 24.5928 32.669C24.8146 32.4239 24.9256 32.0737 24.9256 31.6184V29.3769H25.8537V33.7197H25.0306L24.9606 32.958C24.8263 33.2265 24.6279 33.4395 24.3652 33.5971C24.1084 33.7489 23.8107 33.8248 23.4721 33.8248ZM27.0343 33.7197V27.4156H27.9624V33.7197H27.0343ZM30.9589 33.7197C30.5328 33.7197 30.1943 33.6176 29.9433 33.4133C29.6923 33.2031 29.5668 32.8325 29.5668 32.3013V30.1562H28.8225V29.3769H29.5668L29.6806 28.2737H30.4949V29.3769H31.7207V30.1562H30.4949V32.3013C30.4949 32.5406 30.5445 32.707 30.6437 32.8004C30.7488 32.8879 30.9268 32.9317 31.1778 32.9317H31.6769V33.7197H30.9589ZM34.1486 33.8248C33.7809 33.8248 33.4773 33.7635 33.238 33.6409C32.9987 33.5183 32.8206 33.3578 32.7039 33.1594C32.5872 32.9551 32.5288 32.7333 32.5288 32.4939C32.5288 32.0737 32.6922 31.7409 33.0191 31.4958C33.346 31.2506 33.813 31.128 34.42 31.128H35.5583V31.0492C35.5583 30.7107 35.4649 30.4568 35.2781 30.2875C35.0971 30.1182 34.8607 30.0336 34.5689 30.0336C34.312 30.0336 34.0873 30.0978 33.8947 30.2262C33.7079 30.3488 33.5941 30.5327 33.5532 30.7778H32.6251C32.6543 30.4626 32.7594 30.1941 32.9403 29.9723C33.1271 29.7446 33.3606 29.5724 33.6408 29.4557C33.9268 29.3331 34.2391 29.2718 34.5776 29.2718C35.1847 29.2718 35.6546 29.4324 35.9873 29.7534C36.32 30.0686 36.4864 30.5005 36.4864 31.0492V33.7197H35.6808L35.602 32.9755C35.4795 33.2148 35.3014 33.4162 35.0679 33.5796C34.8345 33.7431 34.528 33.8248 34.1486 33.8248ZM34.3325 33.0718C34.5835 33.0718 34.7936 33.0134 34.9629 32.8967C35.138 32.7741 35.2722 32.6136 35.3656 32.4151C35.4649 32.2167 35.5262 31.9978 35.5495 31.7584H34.5163C34.1486 31.7584 33.8859 31.8227 33.7283 31.9511C33.5766 32.0795 33.5007 32.24 33.5007 32.4326C33.5007 32.6311 33.5736 32.7887 33.7196 32.9054C33.8713 33.0164 34.0756 33.0718 34.3325 33.0718ZM3.86331 44.7197V38.5907H4.95777L7.03287 42.6709L9.09922 38.5907H10.1937V44.7197H9.26558V40.193L7.39186 43.8442H6.67389L4.79141 40.2018V44.7197H3.86331ZM13.4353 44.8248C13.0092 44.8248 12.6298 44.7314 12.2971 44.5446C11.9702 44.352 11.7134 44.0864 11.5266 43.7478C11.3398 43.4093 11.2464 43.0153 11.2464 42.5658C11.2464 42.1105 11.3369 41.7107 11.5178 41.3663C11.7046 41.0219 11.9615 40.7534 12.2883 40.5608C12.6211 40.3681 13.0063 40.2718 13.4441 40.2718C13.8702 40.2718 14.2409 40.3681 14.5561 40.5608C14.8713 40.7476 15.1164 40.9986 15.2915 41.3138C15.4667 41.629 15.5542 41.9763 15.5542 42.3557C15.5542 42.4141 15.5513 42.4783 15.5455 42.5483C15.5455 42.6125 15.5425 42.6855 15.5367 42.7672H12.157C12.1862 43.1875 12.3234 43.5085 12.5685 43.7303C12.8195 43.9463 13.1085 44.0543 13.4353 44.0543C13.698 44.0543 13.9169 43.9959 14.092 43.8792C14.273 43.7566 14.4072 43.5932 14.4948 43.3889H15.4229C15.3061 43.7975 15.0727 44.1389 14.7224 44.4133C14.378 44.6876 13.949 44.8248 13.4353 44.8248ZM13.4353 41.0336C13.126 41.0336 12.8516 41.127 12.6123 41.3138C12.373 41.4947 12.2271 41.7691 12.1745 42.1368H14.6261C14.6086 41.7982 14.4889 41.5297 14.2671 41.3313C14.0453 41.1328 13.7681 41.0336 13.4353 41.0336ZM13.1814 40.0179V39.3525L15.0902 38.2668V39.0373L13.1814 40.0179ZM18.496 44.8248C18.0757 44.8248 17.7051 44.7256 17.384 44.5271C17.063 44.3286 16.812 44.0572 16.631 43.7128C16.4501 43.3684 16.3596 42.9773 16.3596 42.5396C16.3596 42.1018 16.4501 41.7136 16.631 41.375C16.812 41.0307 17.063 40.7621 17.384 40.5695C17.7109 40.3711 18.0845 40.2718 18.5048 40.2718C18.8491 40.2718 19.1498 40.339 19.4066 40.4732C19.6693 40.6075 19.8736 40.7972 20.0195 41.0423V38.4156H20.9476V44.7197H20.1158L20.0195 44.0455C19.8794 44.2498 19.6868 44.4308 19.4416 44.5884C19.1965 44.746 18.8812 44.8248 18.496 44.8248ZM18.6624 44.0193C19.0593 44.0193 19.3832 43.8821 19.6342 43.6078C19.8911 43.3334 20.0195 42.9803 20.0195 42.5483C20.0195 42.1105 19.8911 41.7574 19.6342 41.4889C19.3832 41.2145 19.0593 41.0774 18.6624 41.0774C18.2654 41.0774 17.9386 41.2145 17.6817 41.4889C17.4249 41.7574 17.2965 42.1105 17.2965 42.5483C17.2965 42.8343 17.3548 43.0882 17.4716 43.3101C17.5883 43.5319 17.7488 43.707 17.9531 43.8354C18.1633 43.958 18.3997 44.0193 18.6624 44.0193ZM22.6431 39.5539C22.468 39.5539 22.3221 39.5013 22.2053 39.3963C22.0944 39.2854 22.039 39.1482 22.039 38.9847C22.039 38.8213 22.0944 38.687 22.2053 38.582C22.3221 38.4711 22.468 38.4156 22.6431 38.4156C22.8182 38.4156 22.9612 38.4711 23.0722 38.582C23.1889 38.687 23.2473 38.8213 23.2473 38.9847C23.2473 39.1482 23.1889 39.2854 23.0722 39.3963C22.9612 39.5013 22.8182 39.5539 22.6431 39.5539ZM22.1791 44.7197V40.3769H23.1072V44.7197H22.1791ZM26.3899 44.8248C25.9638 44.8248 25.5815 44.7285 25.2429 44.5359C24.9102 44.3432 24.6476 44.0776 24.4549 43.7391C24.2681 43.3947 24.1748 42.9978 24.1748 42.5483C24.1748 42.0989 24.2681 41.7048 24.4549 41.3663C24.6476 41.0219 24.9102 40.7534 25.2429 40.5608C25.5815 40.3681 25.9638 40.2718 26.3899 40.2718C26.927 40.2718 27.3764 40.4119 27.7383 40.6921C28.1061 40.9723 28.3425 41.3517 28.4475 41.8303H27.4757C27.4173 41.591 27.2889 41.4042 27.0904 41.27C26.8919 41.1357 26.6585 41.0686 26.3899 41.0686C26.1623 41.0686 25.9522 41.127 25.7595 41.2437C25.5669 41.3546 25.4122 41.521 25.2955 41.7428C25.1787 41.9588 25.1204 42.2273 25.1204 42.5483C25.1204 42.8694 25.1787 43.1408 25.2955 43.3626C25.4122 43.5786 25.5669 43.7449 25.7595 43.8617C25.9522 43.9784 26.1623 44.0368 26.3899 44.0368C26.6585 44.0368 26.8919 43.9697 27.0904 43.8354C27.2889 43.7011 27.4173 43.5114 27.4757 43.2663H28.4475C28.3483 43.7333 28.1148 44.1097 27.7471 44.3958C27.3793 44.6818 26.927 44.8248 26.3899 44.8248ZM30.9251 44.8248C30.5573 44.8248 30.2538 44.7635 30.0145 44.6409C29.7751 44.5183 29.5971 44.3578 29.4804 44.1594C29.3636 43.9551 29.3053 43.7333 29.3053 43.4939C29.3053 43.0737 29.4687 42.7409 29.7956 42.4958C30.1225 42.2506 30.5894 42.128 31.1965 42.128H32.3347V42.0492C32.3347 41.7107 32.2413 41.4568 32.0545 41.2875C31.8736 41.1182 31.6372 41.0336 31.3453 41.0336C31.0885 41.0336 30.8638 41.0978 30.6711 41.2262C30.4844 41.3488 30.3705 41.5327 30.3297 41.7778H29.4016C29.4308 41.4626 29.5358 41.1941 29.7168 40.9723C29.9036 40.7446 30.137 40.5724 30.4172 40.4557C30.7032 40.3331 31.0155 40.2718 31.3541 40.2718C31.9611 40.2718 32.431 40.4324 32.7638 40.7534C33.0965 41.0686 33.2628 41.5005 33.2628 42.0492V44.7197H32.4573L32.3785 43.9755C32.2559 44.2148 32.0779 44.4162 31.8444 44.5796C31.6109 44.7431 31.3045 44.8248 30.9251 44.8248ZM31.1089 44.0718C31.3599 44.0718 31.5701 44.0134 31.7393 43.8967C31.9145 43.7741 32.0487 43.6136 32.1421 43.4151C32.2413 43.2167 32.3026 42.9978 32.326 42.7584H31.2928C30.9251 42.7584 30.6624 42.8227 30.5048 42.9511C30.353 43.0795 30.2771 43.24 30.2771 43.4326C30.2771 43.6311 30.3501 43.7887 30.496 43.9054C30.6478 44.0164 30.8521 44.0718 31.1089 44.0718Z" fill="#89868D"/>
<circle cx="285.994" cy="6.75587" r="6.01954" fill="#C3E6EC"/>
<path d="M274.644 31.7207V26.3447H272.832V25.5917H277.376V26.3447H275.572V31.7207H274.644ZM278.988 31.8258C278.62 31.8258 278.316 31.7645 278.077 31.6419C277.838 31.5193 277.66 31.3588 277.543 31.1603C277.426 30.956 277.368 30.7342 277.368 30.4949C277.368 30.0746 277.531 29.7419 277.858 29.4968C278.185 29.2516 278.652 29.129 279.259 29.129H280.397V29.0502C280.397 28.7117 280.304 28.4577 280.117 28.2885C279.936 28.1192 279.7 28.0346 279.408 28.0346C279.151 28.0346 278.926 28.0988 278.734 28.2272C278.547 28.3498 278.433 28.5336 278.392 28.7788H277.464C277.493 28.4636 277.598 28.1951 277.779 27.9733C277.966 27.7456 278.2 27.5734 278.48 27.4567C278.766 27.3341 279.078 27.2728 279.417 27.2728C280.024 27.2728 280.494 27.4333 280.826 27.7544C281.159 28.0696 281.325 28.5015 281.325 29.0502V31.7207H280.52L280.441 30.9765C280.319 31.2158 280.14 31.4172 279.907 31.5806C279.674 31.7441 279.367 31.8258 278.988 31.8258ZM279.172 31.0728C279.423 31.0728 279.633 31.0144 279.802 30.8977C279.977 30.7751 280.111 30.6146 280.205 30.4161C280.304 30.2176 280.365 29.9987 280.389 29.7594H279.355C278.988 29.7594 278.725 29.8236 278.567 29.9521C278.416 30.0805 278.34 30.241 278.34 30.4336C278.34 30.6321 278.413 30.7897 278.559 30.9064C278.71 31.0173 278.915 31.0728 279.172 31.0728ZM282.408 31.7207V27.3779H283.239L283.318 28.2009C283.47 27.9149 283.68 27.6902 283.949 27.5267C284.223 27.3574 284.553 27.2728 284.938 27.2728V28.2447H284.684C284.427 28.2447 284.197 28.2885 283.992 28.376C283.794 28.4577 283.633 28.6008 283.511 28.8051C283.394 29.0035 283.336 29.2808 283.336 29.6368V31.7207H282.408ZM286.259 26.5548C286.084 26.5548 285.938 26.5023 285.821 26.3972C285.71 26.2863 285.655 26.1492 285.655 25.9857C285.655 25.8223 285.71 25.688 285.821 25.583C285.938 25.4721 286.084 25.4166 286.259 25.4166C286.434 25.4166 286.577 25.4721 286.688 25.583C286.805 25.688 286.863 25.8223 286.863 25.9857C286.863 26.1492 286.805 26.2863 286.688 26.3972C286.577 26.5023 286.434 26.5548 286.259 26.5548ZM285.795 31.7207V27.3779H286.723V31.7207H285.795ZM288.167 31.7207V28.1571H287.546V27.3779H288.167V26.7475C288.167 26.2747 288.284 25.9361 288.517 25.7318C288.757 25.5217 289.092 25.4166 289.524 25.4166H289.98V26.2046H289.664C289.46 26.2046 289.314 26.2484 289.227 26.3359C289.139 26.4177 289.095 26.5578 289.095 26.7562V27.3779H290.093V28.1571H289.095V31.7207H288.167ZM292.275 31.8258C291.907 31.8258 291.604 31.7645 291.365 31.6419C291.125 31.5193 290.947 31.3588 290.83 31.1603C290.714 30.956 290.655 30.7342 290.655 30.4949C290.655 30.0746 290.819 29.7419 291.146 29.4968C291.473 29.2516 291.939 29.129 292.547 29.129H293.685V29.0502C293.685 28.7117 293.591 28.4577 293.405 28.2885C293.224 28.1192 292.987 28.0346 292.695 28.0346C292.439 28.0346 292.214 28.0988 292.021 28.2272C291.834 28.3498 291.721 28.5336 291.68 28.7788H290.752C290.781 28.4636 290.886 28.1951 291.067 27.9733C291.254 27.7456 291.487 27.5734 291.767 27.4567C292.053 27.3341 292.366 27.2728 292.704 27.2728C293.311 27.2728 293.781 27.4333 294.114 27.7544C294.447 28.0696 294.613 28.5015 294.613 29.0502V31.7207H293.807L293.729 30.9765C293.606 31.2158 293.428 31.4172 293.194 31.5806C292.961 31.7441 292.655 31.8258 292.275 31.8258ZM292.459 31.0728C292.71 31.0728 292.92 31.0144 293.089 30.8977C293.265 30.7751 293.399 30.6146 293.492 30.4161C293.591 30.2176 293.653 29.9987 293.676 29.7594H292.643C292.275 29.7594 292.012 29.8236 291.855 29.9521C291.703 30.0805 291.627 30.241 291.627 30.4336C291.627 30.6321 291.7 30.7897 291.846 30.9064C291.998 31.0173 292.202 31.0728 292.459 31.0728ZM297.429 31.8258C296.88 31.8258 296.428 31.6915 296.072 31.423C295.715 31.1545 295.511 30.7984 295.459 30.3548H296.395C296.442 30.5533 296.553 30.7255 296.728 30.8714C296.903 31.0115 297.134 31.0815 297.42 31.0815C297.7 31.0815 297.904 31.0232 298.033 30.9064C298.161 30.7897 298.225 30.6554 298.225 30.5037C298.225 30.2818 298.135 30.133 297.954 30.0571C297.779 29.9754 297.534 29.9024 297.219 29.8382C296.973 29.7857 296.728 29.7156 296.483 29.6281C296.244 29.5405 296.042 29.418 295.879 29.2604C295.721 29.0969 295.643 28.878 295.643 28.6037C295.643 28.2243 295.788 27.9091 296.08 27.6581C296.372 27.4012 296.781 27.2728 297.306 27.2728C297.791 27.2728 298.182 27.3895 298.479 27.623C298.783 27.8565 298.961 28.1863 299.013 28.6124H298.12C298.091 28.4256 298.004 28.2797 297.858 28.1746C297.718 28.0696 297.528 28.017 297.289 28.017C297.055 28.017 296.874 28.0667 296.746 28.1659C296.617 28.2593 296.553 28.3819 296.553 28.5336C296.553 28.6854 296.641 28.8051 296.816 28.8926C296.997 28.9802 297.233 29.059 297.525 29.129C297.817 29.1932 298.085 29.2691 298.331 29.3567C298.582 29.4384 298.783 29.561 298.935 29.7244C299.086 29.8878 299.162 30.1272 299.162 30.4424C299.168 30.8393 299.013 31.1691 298.698 31.4318C298.389 31.6944 297.966 31.8258 297.429 31.8258Z" fill="#89868D"/>
<circle cx="415.414" cy="6.75587" r="6.01954" fill="#C5E5EA"/>
<path d="M403.449 31.7207V25.5917H405.594C406.073 25.5917 406.47 25.6734 406.785 25.8369C407.1 25.9945 407.333 26.2134 407.485 26.4936C407.643 26.7679 407.722 27.0802 407.722 27.4304C407.722 27.7631 407.646 28.0696 407.494 28.3498C407.348 28.6241 407.117 28.843 406.802 29.0064C406.487 29.1699 406.084 29.2516 405.594 29.2516H404.377V31.7207H403.449ZM404.377 28.4898H405.55C405.988 28.4898 406.3 28.3965 406.487 28.2097C406.68 28.017 406.776 27.7573 406.776 27.4304C406.776 27.0919 406.68 26.8292 406.487 26.6424C406.3 26.4498 405.988 26.3535 405.55 26.3535H404.377V28.4898ZM409.835 31.8258C409.468 31.8258 409.164 31.7645 408.925 31.6419C408.686 31.5193 408.508 31.3588 408.391 31.1603C408.274 30.956 408.216 30.7342 408.216 30.4949C408.216 30.0746 408.379 29.7419 408.706 29.4968C409.033 29.2516 409.5 29.129 410.107 29.129H411.245V29.0502C411.245 28.7117 411.152 28.4577 410.965 28.2885C410.784 28.1192 410.548 28.0346 410.256 28.0346C409.999 28.0346 409.774 28.0988 409.582 28.2272C409.395 28.3498 409.281 28.5336 409.24 28.7788H408.312C408.341 28.4636 408.446 28.1951 408.627 27.9733C408.814 27.7456 409.047 27.5734 409.328 27.4567C409.614 27.3341 409.926 27.2728 410.265 27.2728C410.872 27.2728 411.341 27.4333 411.674 27.7544C412.007 28.0696 412.173 28.5015 412.173 29.0502V31.7207H411.368L411.289 30.9765C411.166 31.2158 410.988 31.4172 410.755 31.5806C410.521 31.7441 410.215 31.8258 409.835 31.8258ZM410.019 31.0728C410.27 31.0728 410.48 31.0144 410.65 30.8977C410.825 30.7751 410.959 30.6146 411.053 30.4161C411.152 30.2176 411.213 29.9987 411.236 29.7594H410.203C409.835 29.7594 409.573 29.8236 409.415 29.9521C409.263 30.0805 409.188 30.241 409.188 30.4336C409.188 30.6321 409.261 30.7897 409.406 30.9064C409.558 31.0173 409.763 31.0728 410.019 31.0728ZM415.033 30.3898C414.805 30.3898 414.595 30.3636 414.402 30.311L414.026 30.6788C414.09 30.7196 414.169 30.7547 414.262 30.7838C414.356 30.813 414.487 30.8393 414.656 30.8626C414.826 30.886 415.056 30.9093 415.348 30.9327C415.926 30.9852 416.343 31.1253 416.6 31.353C416.857 31.5748 416.985 31.8725 416.985 32.246C416.985 32.5029 416.915 32.7451 416.775 32.9728C416.641 33.2063 416.428 33.393 416.136 33.5331C415.85 33.6791 415.482 33.752 415.033 33.752C414.426 33.752 413.932 33.6353 413.553 33.4018C413.18 33.1741 412.993 32.8268 412.993 32.3599C412.993 32.1789 413.039 31.998 413.133 31.817C413.232 31.6419 413.387 31.4755 413.597 31.3179C413.474 31.2654 413.366 31.21 413.273 31.1516C413.185 31.0874 413.107 31.0232 413.036 30.959V30.7488L413.789 29.9783C413.451 29.6865 413.282 29.3041 413.282 28.8313C413.282 28.5453 413.349 28.2855 413.483 28.0521C413.623 27.8127 413.825 27.623 414.087 27.4829C414.35 27.3429 414.665 27.2728 415.033 27.2728C415.278 27.2728 415.506 27.3078 415.716 27.3779H417.336V27.9908L416.565 28.0346C416.705 28.2739 416.775 28.5395 416.775 28.8313C416.775 29.1232 416.705 29.3858 416.565 29.6193C416.431 29.8528 416.232 30.0396 415.97 30.1797C415.713 30.3198 415.401 30.3898 415.033 30.3898ZM415.033 29.6631C415.301 29.6631 415.517 29.5931 415.681 29.453C415.85 29.307 415.935 29.1027 415.935 28.8401C415.935 28.5716 415.85 28.3673 415.681 28.2272C415.517 28.0871 415.301 28.017 415.033 28.017C414.758 28.017 414.537 28.0871 414.367 28.2272C414.204 28.3673 414.122 28.5716 414.122 28.8401C414.122 29.1027 414.204 29.307 414.367 29.453C414.537 29.5931 414.758 29.6631 415.033 29.6631ZM413.868 32.2723C413.868 32.5233 413.979 32.7101 414.201 32.8327C414.423 32.9611 414.7 33.0253 415.033 33.0253C415.354 33.0253 415.614 32.9553 415.812 32.8152C416.011 32.6809 416.11 32.5 416.11 32.2723C416.11 32.103 416.043 31.9571 415.908 31.8345C415.774 31.7178 415.52 31.6448 415.147 31.6156C414.866 31.5981 414.618 31.5719 414.402 31.5368C414.198 31.6477 414.058 31.7674 413.982 31.8958C413.906 32.0242 413.868 32.1497 413.868 32.2723ZM420.024 31.8258C419.609 31.8258 419.236 31.7324 418.903 31.5456C418.576 31.353 418.316 31.0874 418.124 30.7488C417.931 30.4044 417.835 30.0046 417.835 29.5493C417.835 29.094 417.931 28.6971 418.124 28.3585C418.322 28.0141 418.588 27.7485 418.92 27.5617C419.253 27.3691 419.624 27.2728 420.032 27.2728C420.447 27.2728 420.818 27.3691 421.144 27.5617C421.477 27.7485 421.74 28.0141 421.932 28.3585C422.131 28.6971 422.23 29.094 422.23 29.5493C422.23 30.0046 422.131 30.4044 421.932 30.7488C421.74 31.0874 421.477 31.353 421.144 31.5456C420.812 31.7324 420.438 31.8258 420.024 31.8258ZM420.024 31.029C420.245 31.029 420.45 30.9736 420.637 30.8626C420.829 30.7517 420.984 30.5883 421.101 30.3723C421.217 30.1505 421.276 29.8762 421.276 29.5493C421.276 29.2224 421.217 28.951 421.101 28.735C420.99 28.5132 420.838 28.3468 420.645 28.2359C420.459 28.125 420.254 28.0696 420.032 28.0696C419.811 28.0696 419.603 28.125 419.411 28.2359C419.224 28.3468 419.072 28.5132 418.955 28.735C418.839 28.951 418.78 29.2224 418.78 29.5493C418.78 29.8762 418.839 30.1505 418.955 30.3723C419.072 30.5883 419.224 30.7517 419.411 30.8626C419.598 30.9736 419.802 31.029 420.024 31.029ZM424.967 31.8258C424.419 31.8258 423.966 31.6915 423.61 31.423C423.254 31.1545 423.05 30.7984 422.997 30.3548H423.934C423.981 30.5533 424.092 30.7255 424.267 30.8714C424.442 31.0115 424.673 31.0815 424.959 31.0815C425.239 31.0815 425.443 31.0232 425.572 30.9064C425.7 30.7897 425.764 30.6554 425.764 30.5037C425.764 30.2818 425.674 30.133 425.493 30.0571C425.318 29.9754 425.073 29.9024 424.757 29.8382C424.512 29.7857 424.267 29.7156 424.022 29.6281C423.783 29.5405 423.581 29.418 423.418 29.2604C423.26 29.0969 423.181 28.878 423.181 28.6037C423.181 28.2243 423.327 27.9091 423.619 27.6581C423.911 27.4012 424.32 27.2728 424.845 27.2728C425.329 27.2728 425.72 27.3895 426.018 27.623C426.322 27.8565 426.5 28.1863 426.552 28.6124H425.659C425.63 28.4256 425.542 28.2797 425.396 28.1746C425.256 28.0696 425.067 28.017 424.827 28.017C424.594 28.017 424.413 28.0667 424.284 28.1659C424.156 28.2593 424.092 28.3819 424.092 28.5336C424.092 28.6854 424.179 28.8051 424.355 28.8926C424.535 28.9802 424.772 29.059 425.064 29.129C425.356 29.1932 425.624 29.2691 425.869 29.3567C426.12 29.4384 426.322 29.561 426.473 29.7244C426.625 29.8878 426.701 30.1272 426.701 30.4424C426.707 30.8393 426.552 31.1691 426.237 31.4318C425.928 31.6944 425.504 31.8258 424.967 31.8258Z" fill="#89868D"/>
<mask id="mask0_1419_7449" style="mask-type:luminance" maskUnits="userSpaceOnUse" x="13" y="6" width="7" height="6">
<path d="M13.8896 6H20.0001V12H13.8896V6Z" fill="white"/>
</mask>
<g mask="url(#mask0_1419_7449)">
<path d="M19.7616 6.08313C19.5227 5.92811 19.2038 5.99616 19.0491 6.23508L16.1624 10.6885L14.7546 9.38567C14.5456 9.19231 14.2198 9.20501 14.0266 9.41419C13.8334 9.62317 13.8461 9.94958 14.0551 10.1427L15.9036 11.8532C15.9036 11.8532 15.9567 11.899 15.9812 11.9149C16.0678 11.9713 16.165 11.9981 16.2611 11.9981C16.4297 11.9981 16.5951 11.9153 16.6939 11.763L19.9134 6.79622C20.0683 6.55734 20.0003 6.23799 19.7616 6.08313Z" fill="white"/>
</g>
</svg>
