<svg width="23" height="23" viewBox="0 0 23 23" fill="none" xmlns="http://www.w3.org/2000/svg">
<path id="Exclude" fill-rule="evenodd" clip-rule="evenodd" d="M5.77148 0.791016C2.77275 0.791016 0.341797 3.22197 0.341797 6.2207V17.0801C0.341797 20.0788 2.77275 22.5098 5.77148 22.5098H16.6309C19.6296 22.5098 22.0605 20.0788 22.0605 17.0801V6.2207C22.0605 3.22197 19.6296 0.791016 16.6309 0.791016H5.77148ZM11.2012 6.2207C11.8009 6.2207 12.2871 6.70689 12.2871 7.30664V11.2006L14.1409 13.0544C14.565 13.4785 14.565 14.1661 14.1409 14.5901C13.7168 15.0142 13.0293 15.0142 12.6052 14.5901L10.4333 12.4183C10.2296 12.2146 10.1152 11.9384 10.1152 11.6504V7.30664C10.1152 6.70689 10.6014 6.2207 11.2012 6.2207Z" fill="#676666"/>
</svg>
