<svg width="16" height="15" viewBox="0 0 16 15" fill="none" xmlns="http://www.w3.org/2000/svg">
<g id="Icon/star">
<path id="Vector" d="M7.65501 2.10582C7.73074 1.95014 7.88943 1.85156 8.06254 1.85156C8.23625 1.85156 8.39433 1.95014 8.47007 2.10582C9.05552 3.30677 10.0629 5.37568 10.0629 5.37568C10.0629 5.37568 12.3536 5.69065 13.6826 5.87398C13.9248 5.90703 14.0733 6.112 14.0733 6.32298C14.0733 6.43719 14.03 6.55319 13.9345 6.64516C12.9667 7.56962 11.3005 9.16428 11.3005 9.16428C11.3005 9.16428 11.7075 11.4285 11.9431 12.7419C11.993 13.0196 11.7778 13.272 11.4971 13.272C11.4238 13.272 11.3504 13.2546 11.2837 13.2185C10.1008 12.5886 8.06254 11.5049 8.06254 11.5049C8.06254 11.5049 6.02428 12.5886 4.84136 13.2185C4.77464 13.2546 4.70071 13.272 4.62738 13.272C4.34788 13.272 4.13149 13.019 4.18198 12.7419C4.4182 11.4285 4.82513 9.16428 4.82513 9.16428C4.82513 9.16428 3.15834 7.56962 2.19121 6.64516C2.09504 6.55319 2.05176 6.43719 2.05176 6.32358C2.05176 6.112 2.20143 5.90643 2.44306 5.87398C3.77204 5.69065 6.06215 5.37568 6.06215 5.37568C6.06215 5.37568 7.07016 3.30677 7.65501 2.10582Z" fill="#1ABAD6"/>
</g>
</svg>
