<svg width="203" height="244" viewBox="0 0 203 244" fill="none" xmlns="http://www.w3.org/2000/svg">
<path d="M17 233L16.3148 16.0006" stroke="#1ABAD6" stroke-opacity="0.4"/>
<circle cx="16" cy="16" r="16" fill="#1ABAD6"/>
<circle cx="17" cy="127" r="11" fill="#ADE1EB"/>
<circle cx="17" cy="233" r="11" fill="#B1E0E9"/>
<path d="M48.0523 21V11.046H54.2095V12.0272H49.2468V15.4969H53.7829V16.4638H49.2468V20.0188H54.2095V21H48.0523ZM56.0077 21V13.9469H57.0884L57.1595 15.2125C57.387 14.7669 57.7141 14.4161 58.1407 14.1602C58.5673 13.9042 59.0508 13.7762 59.5911 13.7762C60.4254 13.7762 61.089 14.0322 61.5819 14.5441C62.0844 15.0466 62.3356 15.8239 62.3356 16.8762V21H61.1411V17.0042C61.1411 15.5348 60.5344 14.8001 59.321 14.8001C58.7142 14.8001 58.2071 15.0229 57.7994 15.4684C57.4013 15.9045 57.2022 16.5302 57.2022 17.3455V21H56.0077ZM64.5293 21V14.9565H63.4628V13.9469H64.5293V12.724C64.5293 12.0414 64.6999 11.5437 65.0412 11.2309C65.3825 10.918 65.8802 10.7616 66.5343 10.7616H67.2453V11.7854H66.7191C66.3589 11.7854 66.1029 11.8613 65.9513 12.013C65.7996 12.1552 65.7237 12.4016 65.7237 12.7524V13.9469H67.4586V14.9565H65.7237V21H64.5293ZM71.774 21.1706C71.1009 21.1706 70.5037 21.019 69.9823 20.7156C69.4609 20.4028 69.0485 19.9714 68.7452 19.4216C68.4513 18.8717 68.3043 18.2224 68.3043 17.4734C68.3043 16.734 68.4513 16.0894 68.7452 15.5395C69.039 14.9802 69.4467 14.5489 69.9681 14.2455C70.499 13.9327 71.1104 13.7762 71.8025 13.7762C72.485 13.7762 73.0728 13.9327 73.5657 14.2455C74.0682 14.5489 74.4521 14.9518 74.7176 15.4542C74.983 15.9566 75.1157 16.497 75.1157 17.0753C75.1157 17.1796 75.111 17.2838 75.1015 17.3881C75.1015 17.4924 75.1015 17.6109 75.1015 17.7436H69.4846C69.513 18.284 69.6363 18.7343 69.8543 19.0945C70.0818 19.4453 70.3615 19.7107 70.6933 19.8908C71.0346 20.071 71.3948 20.161 71.774 20.161C72.267 20.161 72.6794 20.0473 73.0112 19.8197C73.343 19.5922 73.5847 19.2841 73.7364 18.8954H74.9166C74.727 19.5496 74.3621 20.0947 73.8217 20.5307C73.2908 20.9573 72.6083 21.1706 71.774 21.1706ZM71.774 14.7859C71.2052 14.7859 70.698 14.9612 70.2525 15.312C69.8164 15.6533 69.5652 16.1557 69.4988 16.8193H73.9355C73.907 16.1842 73.689 15.6865 73.2813 15.3262C72.8737 14.966 72.3713 14.7859 71.774 14.7859ZM76.6989 21V13.9469H77.7796L77.8792 15.2978C78.0972 14.8333 78.429 14.4635 78.8746 14.1886C79.3201 13.9137 79.87 13.7762 80.5241 13.7762V15.0276H80.197C79.7799 15.0276 79.396 15.1034 79.0452 15.2551C78.6945 15.3973 78.4148 15.6438 78.2062 15.9946C77.9977 16.3453 77.8934 16.8288 77.8934 17.445V21H76.6989ZM81.8648 21V13.9469H82.9455L83.0308 14.9707C83.2583 14.5915 83.5617 14.2976 83.9409 14.0891C84.3201 13.8805 84.7467 13.7762 85.2207 13.7762C85.78 13.7762 86.2588 13.89 86.6569 14.1175C87.0646 14.345 87.3774 14.6911 87.5954 15.1556C87.8419 14.729 88.1785 14.3924 88.6051 14.146C89.0411 13.8995 89.5104 13.7762 90.0128 13.7762C90.8566 13.7762 91.5296 14.0322 92.0321 14.5441C92.5345 15.0466 92.7857 15.8239 92.7857 16.8762V21H91.6055V17.0042C91.6055 16.2742 91.4585 15.7244 91.1647 15.3547C90.8708 14.9849 90.4489 14.8001 89.8991 14.8001C89.3303 14.8001 88.8563 15.0229 88.4771 15.4684C88.1074 15.9045 87.9225 16.5302 87.9225 17.3455V21H86.728V17.0042C86.728 16.2742 86.5811 15.7244 86.2872 15.3547C85.9933 14.9849 85.5715 14.8001 85.0216 14.8001C84.4623 14.8001 83.993 15.0229 83.6138 15.4684C83.2441 15.9045 83.0593 16.5302 83.0593 17.3455V21H81.8648ZM97.7561 21.1706C97.083 21.1706 96.4857 21.019 95.9643 20.7156C95.4429 20.4028 95.0306 19.9714 94.7272 19.4216C94.4333 18.8717 94.2864 18.2224 94.2864 17.4734C94.2864 16.734 94.4333 16.0894 94.7272 15.5395C95.0211 14.9802 95.4287 14.5489 95.9501 14.2455C96.481 13.9327 97.0925 13.7762 97.7845 13.7762C98.4671 13.7762 99.0548 13.9327 99.5478 14.2455C100.05 14.5489 100.434 14.9518 100.7 15.4542C100.965 15.9566 101.098 16.497 101.098 17.0753C101.098 17.1796 101.093 17.2838 101.084 17.3881C101.084 17.4924 101.084 17.6109 101.084 17.7436H95.4666C95.4951 18.284 95.6183 18.7343 95.8364 19.0945C96.0639 19.4453 96.3435 19.7107 96.6753 19.8908C97.0166 20.071 97.3769 20.161 97.7561 20.161C98.249 20.161 98.6614 20.0473 98.9932 19.8197C99.325 19.5922 99.5667 19.2841 99.7184 18.8954H100.899C100.709 19.5496 100.344 20.0947 99.8037 20.5307C99.2729 20.9573 98.5903 21.1706 97.7561 21.1706ZM97.7561 14.7859C97.1873 14.7859 96.6801 14.9612 96.2345 15.312C95.7984 15.6533 95.5472 16.1557 95.4809 16.8193H99.9175C99.8891 16.1842 99.671 15.6865 99.2634 15.3262C98.8557 14.966 98.3533 14.7859 97.7561 14.7859ZM105.88 21.1706C105.179 21.1706 104.563 21.0095 104.032 20.6872C103.51 20.3648 103.103 19.924 102.809 19.3647C102.525 18.8054 102.382 18.1702 102.382 17.4592C102.382 16.7482 102.529 16.1178 102.823 15.568C103.117 15.0086 103.525 14.5726 104.046 14.2597C104.567 13.9374 105.184 13.7762 105.895 13.7762C106.473 13.7762 106.985 13.8947 107.43 14.1317C107.876 14.3687 108.222 14.7005 108.469 15.1271V10.7616H109.663V21H108.582L108.469 19.834C108.241 20.1752 107.914 20.4833 107.487 20.7583C107.061 21.0332 106.525 21.1706 105.88 21.1706ZM106.008 20.1326C106.482 20.1326 106.9 20.0236 107.26 19.8055C107.63 19.578 107.914 19.2652 108.113 18.867C108.322 18.4688 108.426 18.0043 108.426 17.4734C108.426 16.9426 108.322 16.478 108.113 16.0799C107.914 15.6817 107.63 15.3736 107.26 15.1556C106.9 14.9281 106.482 14.8143 106.008 14.8143C105.544 14.8143 105.127 14.9281 104.757 15.1556C104.397 15.3736 104.112 15.6817 103.904 16.0799C103.705 16.478 103.605 16.9426 103.605 17.4734C103.605 18.0043 103.705 18.4688 103.904 18.867C104.112 19.2652 104.397 19.578 104.757 19.8055C105.127 20.0236 105.544 20.1326 106.008 20.1326ZM113.956 21.1706C113.369 21.1706 112.88 21.0711 112.492 20.872C112.103 20.6729 111.814 20.4075 111.624 20.0757C111.435 19.7439 111.34 19.3837 111.34 18.995C111.34 18.2745 111.615 17.7199 112.165 17.3312C112.715 16.9426 113.463 16.7482 114.411 16.7482H116.317V16.6629C116.317 16.0467 116.156 15.5822 115.833 15.2693C115.511 14.947 115.08 14.7859 114.539 14.7859C114.075 14.7859 113.672 14.9044 113.331 15.1414C112.999 15.3689 112.79 15.7054 112.705 16.151H111.482C111.53 15.6391 111.7 15.2077 111.994 14.857C112.297 14.5062 112.672 14.2408 113.117 14.0606C113.563 13.871 114.037 13.7762 114.539 13.7762C115.525 13.7762 116.265 14.0417 116.758 14.5726C117.26 15.094 117.511 15.7907 117.511 16.6629V21H116.445L116.374 19.7344C116.175 20.1326 115.881 20.4739 115.492 20.7583C115.113 21.0332 114.601 21.1706 113.956 21.1706ZM114.141 20.161C114.596 20.161 114.985 20.0425 115.307 19.8055C115.639 19.5685 115.89 19.2604 116.061 18.8812C116.232 18.502 116.317 18.1039 116.317 17.6867V17.6725H114.511C113.809 17.6725 113.312 17.7958 113.018 18.0422C112.734 18.2792 112.591 18.5779 112.591 18.9381C112.591 19.3078 112.724 19.6064 112.989 19.834C113.264 20.052 113.648 20.161 114.141 20.161ZM122.503 21.1706C121.801 21.1706 121.185 21.0095 120.654 20.6872C120.133 20.3648 119.725 19.924 119.431 19.3647C119.147 18.8054 119.005 18.1702 119.005 17.4592C119.005 16.7482 119.152 16.1178 119.446 15.568C119.739 15.0086 120.147 14.5726 120.668 14.2597C121.19 13.9374 121.806 13.7762 122.517 13.7762C123.095 13.7762 123.607 13.8947 124.053 14.1317C124.498 14.3687 124.844 14.7005 125.091 15.1271V10.7616H126.285V21H125.205L125.091 19.834C124.863 20.1752 124.536 20.4833 124.11 20.7583C123.683 21.0332 123.148 21.1706 122.503 21.1706ZM122.631 20.1326C123.105 20.1326 123.522 20.0236 123.882 19.8055C124.252 19.578 124.536 19.2652 124.735 18.867C124.944 18.4688 125.048 18.0043 125.048 17.4734C125.048 16.9426 124.944 16.478 124.735 16.0799C124.536 15.6817 124.252 15.3736 123.882 15.1556C123.522 14.9281 123.105 14.8143 122.631 14.8143C122.166 14.8143 121.749 14.9281 121.379 15.1556C121.019 15.3736 120.735 15.6817 120.526 16.0799C120.327 16.478 120.228 16.9426 120.228 17.4734C120.228 18.0043 120.327 18.4688 120.526 18.867C120.735 19.2652 121.019 19.578 121.379 19.8055C121.749 20.0236 122.166 20.1326 122.631 20.1326ZM131.404 21.1706C130.731 21.1706 130.133 21.019 129.612 20.7156C129.09 20.4028 128.678 19.9714 128.375 19.4216C128.081 18.8717 127.934 18.2224 127.934 17.4734C127.934 16.734 128.081 16.0894 128.375 15.5395C128.669 14.9802 129.076 14.5489 129.598 14.2455C130.129 13.9327 130.74 13.7762 131.432 13.7762C132.115 13.7762 132.702 13.9327 133.195 14.2455C133.698 14.5489 134.082 14.9518 134.347 15.4542C134.613 15.9566 134.745 16.497 134.745 17.0753C134.745 17.1796 134.741 17.2838 134.731 17.3881C134.731 17.4924 134.731 17.6109 134.731 17.7436H129.114C129.143 18.284 129.266 18.7343 129.484 19.0945C129.711 19.4453 129.991 19.7107 130.323 19.8908C130.664 20.071 131.024 20.161 131.404 20.161C131.897 20.161 132.309 20.0473 132.641 19.8197C132.973 19.5922 133.214 19.2841 133.366 18.8954H134.546C134.357 19.5496 133.992 20.0947 133.451 20.5307C132.92 20.9573 132.238 21.1706 131.404 21.1706ZM131.404 14.7859C130.835 14.7859 130.328 14.9612 129.882 15.312C129.446 15.6533 129.195 16.1557 129.128 16.8193H133.565C133.537 16.1842 133.319 15.6865 132.911 15.3262C132.503 14.966 132.001 14.7859 131.404 14.7859ZM139.03 21.1706C138.187 21.1706 137.485 20.9573 136.926 20.5307C136.366 20.1041 136.039 19.5259 135.945 18.7959H137.167C137.243 19.1656 137.438 19.4879 137.75 19.7629C138.073 20.0283 138.504 20.161 139.045 20.161C139.547 20.161 139.917 20.0567 140.154 19.8482C140.391 19.6301 140.509 19.3742 140.509 19.0803C140.509 18.6537 140.353 18.3693 140.04 18.2271C139.737 18.0849 139.305 17.9569 138.746 17.8432C138.367 17.7673 137.987 17.6583 137.608 17.5161C137.229 17.3739 136.912 17.1748 136.656 16.9189C136.4 16.6534 136.272 16.3074 136.272 15.8808C136.272 15.2646 136.499 14.7622 136.954 14.3735C137.419 13.9753 138.044 13.7762 138.831 13.7762C139.58 13.7762 140.192 13.9658 140.666 14.345C141.149 14.7148 141.429 15.2456 141.505 15.9377H140.324C140.277 15.5774 140.12 15.2978 139.855 15.0987C139.599 14.8901 139.253 14.7859 138.817 14.7859C138.39 14.7859 138.059 14.8759 137.822 15.056C137.594 15.2362 137.48 15.4732 137.48 15.767C137.48 16.0514 137.627 16.2742 137.921 16.4354C138.224 16.5965 138.632 16.734 139.144 16.8478C139.58 16.9426 139.993 17.0611 140.381 17.2033C140.779 17.336 141.102 17.5398 141.348 17.8147C141.604 18.0802 141.732 18.4688 141.732 18.9808C141.742 19.6159 141.5 20.1421 141.007 20.5592C140.523 20.9668 139.865 21.1706 139.03 21.1706ZM149.605 21V12.0272H146.633V11.046H153.771V12.0272H150.799V21H149.605ZM154.353 21V13.9469H155.434L155.534 15.2978C155.752 14.8333 156.084 14.4635 156.529 14.1886C156.975 13.9137 157.525 13.7762 158.179 13.7762V15.0276H157.852C157.434 15.0276 157.051 15.1034 156.7 15.2551C156.349 15.3973 156.069 15.6438 155.861 15.9946C155.652 16.3453 155.548 16.8288 155.548 17.445V21H154.353ZM161.866 21.1706C161.278 21.1706 160.79 21.0711 160.401 20.872C160.012 20.6729 159.723 20.4075 159.534 20.0757C159.344 19.7439 159.249 19.3837 159.249 18.995C159.249 18.2745 159.524 17.7199 160.074 17.3312C160.624 16.9426 161.373 16.7482 162.321 16.7482H164.226V16.6629C164.226 16.0467 164.065 15.5822 163.743 15.2693C163.42 14.947 162.989 14.7859 162.449 14.7859C161.984 14.7859 161.581 14.9044 161.24 15.1414C160.908 15.3689 160.7 15.7054 160.614 16.151H159.391C159.439 15.6391 159.609 15.2077 159.903 14.857C160.207 14.5062 160.581 14.2408 161.027 14.0606C161.472 13.871 161.946 13.7762 162.449 13.7762C163.435 13.7762 164.174 14.0417 164.667 14.5726C165.169 15.094 165.421 15.7907 165.421 16.6629V21H164.354L164.283 19.7344C164.084 20.1326 163.79 20.4739 163.401 20.7583C163.022 21.0332 162.51 21.1706 161.866 21.1706ZM162.05 20.161C162.506 20.161 162.894 20.0425 163.217 19.8055C163.548 19.5685 163.8 19.2604 163.97 18.8812C164.141 18.502 164.226 18.1039 164.226 17.6867V17.6725H162.42C161.719 17.6725 161.221 17.7958 160.927 18.0422C160.643 18.2792 160.5 18.5779 160.5 18.9381C160.5 19.3078 160.633 19.6064 160.899 19.834C161.174 20.052 161.558 20.161 162.05 20.161ZM169.805 21C169.161 21 168.653 20.8436 168.284 20.5307C167.914 20.2179 167.729 19.6538 167.729 18.8386V14.9565H166.506V13.9469H167.729L167.886 12.2547H168.924V13.9469H171V14.9565H168.924V18.8386C168.924 19.2841 169.014 19.5875 169.194 19.7486C169.374 19.9003 169.691 19.9762 170.147 19.9762H170.886V21H169.805ZM174.864 21.1706C174.276 21.1706 173.788 21.0711 173.399 20.872C173.01 20.6729 172.721 20.4075 172.531 20.0757C172.342 19.7439 172.247 19.3837 172.247 18.995C172.247 18.2745 172.522 17.7199 173.072 17.3312C173.622 16.9426 174.371 16.7482 175.319 16.7482H177.224V16.6629C177.224 16.0467 177.063 15.5822 176.741 15.2693C176.418 14.947 175.987 14.7859 175.447 14.7859C174.982 14.7859 174.579 14.9044 174.238 15.1414C173.906 15.3689 173.698 15.7054 173.612 16.151H172.389C172.437 15.6391 172.607 15.2077 172.901 14.857C173.205 14.5062 173.579 14.2408 174.025 14.0606C174.47 13.871 174.944 13.7762 175.447 13.7762C176.433 13.7762 177.172 14.0417 177.665 14.5726C178.167 15.094 178.419 15.7907 178.419 16.6629V21H177.352L177.281 19.7344C177.082 20.1326 176.788 20.4739 176.399 20.7583C176.02 21.0332 175.508 21.1706 174.864 21.1706ZM175.048 20.161C175.503 20.161 175.892 20.0425 176.214 19.8055C176.546 19.5685 176.797 19.2604 176.968 18.8812C177.139 18.502 177.224 18.1039 177.224 17.6867V17.6725H175.418C174.717 17.6725 174.219 17.7958 173.925 18.0422C173.641 18.2792 173.498 18.5779 173.498 18.9381C173.498 19.3078 173.631 19.6064 173.897 19.834C174.172 20.052 174.555 20.161 175.048 20.161ZM183.41 21.1706C182.708 21.1706 182.092 21.0095 181.561 20.6872C181.04 20.3648 180.632 19.924 180.338 19.3647C180.054 18.8054 179.912 18.1702 179.912 17.4592C179.912 16.7482 180.059 16.1178 180.353 15.568C180.647 15.0086 181.054 14.5726 181.576 14.2597C182.097 13.9374 182.713 13.7762 183.424 13.7762C184.003 13.7762 184.514 13.8947 184.96 14.1317C185.406 14.3687 185.752 14.7005 185.998 15.1271V10.7616H187.193V21H186.112L185.998 19.834C185.771 20.1752 185.443 20.4833 185.017 20.7583C184.59 21.0332 184.055 21.1706 183.41 21.1706ZM183.538 20.1326C184.012 20.1326 184.429 20.0236 184.789 19.8055C185.159 19.578 185.443 19.2652 185.643 18.867C185.851 18.4688 185.955 18.0043 185.955 17.4734C185.955 16.9426 185.851 16.478 185.643 16.0799C185.443 15.6817 185.159 15.3736 184.789 15.1556C184.429 14.9281 184.012 14.8143 183.538 14.8143C183.073 14.8143 182.656 14.9281 182.287 15.1556C181.926 15.3736 181.642 15.6817 181.433 16.0799C181.234 16.478 181.135 16.9426 181.135 17.4734C181.135 18.0043 181.234 18.4688 181.433 18.867C181.642 19.2652 181.926 19.578 182.287 19.8055C182.656 20.0236 183.073 20.1326 183.538 20.1326ZM191.486 21.1706C190.898 21.1706 190.41 21.0711 190.021 20.872C189.633 20.6729 189.343 20.4075 189.154 20.0757C188.964 19.7439 188.869 19.3837 188.869 18.995C188.869 18.2745 189.144 17.7199 189.694 17.3312C190.244 16.9426 190.993 16.7482 191.941 16.7482H193.846V16.6629C193.846 16.0467 193.685 15.5822 193.363 15.2693C193.041 14.947 192.609 14.7859 192.069 14.7859C191.604 14.7859 191.202 14.9044 190.86 15.1414C190.528 15.3689 190.32 15.7054 190.235 16.151H189.012C189.059 15.6391 189.23 15.2077 189.524 14.857C189.827 14.5062 190.201 14.2408 190.647 14.0606C191.093 13.871 191.567 13.7762 192.069 13.7762C193.055 13.7762 193.794 14.0417 194.287 14.5726C194.79 15.094 195.041 15.7907 195.041 16.6629V21H193.974L193.903 19.7344C193.704 20.1326 193.41 20.4739 193.022 20.7583C192.643 21.0332 192.131 21.1706 191.486 21.1706ZM191.671 20.161C192.126 20.161 192.515 20.0425 192.837 19.8055C193.169 19.5685 193.42 19.2604 193.591 18.8812C193.761 18.502 193.846 18.1039 193.846 17.6867V17.6725H192.041C191.339 17.6725 190.841 17.7958 190.547 18.0422C190.263 18.2792 190.121 18.5779 190.121 18.9381C190.121 19.3078 190.254 19.6064 190.519 19.834C190.794 20.052 191.178 20.161 191.671 20.161ZM199.535 21.1706C198.691 21.1706 197.989 20.9573 197.43 20.5307C196.871 20.1041 196.544 19.5259 196.449 18.7959H197.672C197.748 19.1656 197.942 19.4879 198.255 19.7629C198.577 20.0283 199.009 20.161 199.549 20.161C200.051 20.161 200.421 20.0567 200.658 19.8482C200.895 19.6301 201.014 19.3742 201.014 19.0803C201.014 18.6537 200.857 18.3693 200.544 18.2271C200.241 18.0849 199.81 17.9569 199.25 17.8432C198.871 17.7673 198.492 17.6583 198.113 17.5161C197.734 17.3739 197.416 17.1748 197.16 16.9189C196.904 16.6534 196.776 16.3074 196.776 15.8808C196.776 15.2646 197.004 14.7622 197.459 14.3735C197.923 13.9753 198.549 13.7762 199.336 13.7762C200.085 13.7762 200.696 13.9658 201.17 14.345C201.654 14.7148 201.933 15.2456 202.009 15.9377H200.829C200.781 15.5774 200.625 15.2978 200.359 15.0987C200.104 14.8901 199.758 14.7859 199.321 14.7859C198.895 14.7859 198.563 14.8759 198.326 15.056C198.099 15.2362 197.985 15.4732 197.985 15.767C197.985 16.0514 198.132 16.2742 198.426 16.4354C198.729 16.5965 199.137 16.734 199.648 16.8478C200.085 16.9426 200.497 17.0611 200.886 17.2033C201.284 17.336 201.606 17.5398 201.853 17.8147C202.109 18.0802 202.237 18.4688 202.237 18.9808C202.246 19.6159 202.004 20.1421 201.511 20.5592C201.028 20.9668 200.369 21.1706 199.535 21.1706Z" fill="#727272"/>
<path d="M48.0523 132V122.046H49.2468V132H48.0523ZM51.2862 132V124.947H52.3669L52.4523 125.971C52.6798 125.592 52.9831 125.298 53.3623 125.089C53.7415 124.881 54.1681 124.776 54.6421 124.776C55.2015 124.776 55.6802 124.89 56.0784 125.118C56.486 125.345 56.7988 125.691 57.0169 126.156C57.2634 125.729 57.5999 125.392 58.0265 125.146C58.4626 124.899 58.9318 124.776 59.4343 124.776C60.278 124.776 60.9511 125.032 61.4535 125.544C61.956 126.047 62.2072 126.824 62.2072 127.876V132H61.0269V128.004C61.0269 127.274 60.88 126.724 60.5861 126.355C60.2922 125.985 59.8704 125.8 59.3205 125.8C58.7517 125.8 58.2777 126.023 57.8985 126.468C57.5288 126.904 57.3439 127.53 57.3439 128.345V132H56.1495V128.004C56.1495 127.274 56.0025 126.724 55.7086 126.355C55.4148 125.985 54.9929 125.8 54.4431 125.8C53.8837 125.8 53.4145 126.023 53.0353 126.468C52.6656 126.904 52.4807 127.53 52.4807 128.345V132H51.2862ZM66.3528 132.171C65.765 132.171 65.2768 132.071 64.8881 131.872C64.4994 131.673 64.2103 131.407 64.0207 131.076C63.8311 130.744 63.7363 130.384 63.7363 129.995C63.7363 129.274 64.0112 128.72 64.561 128.331C65.1109 127.943 65.8598 127.748 66.8078 127.748H68.7133V127.663C68.7133 127.047 68.5521 126.582 68.2298 126.269C67.9075 125.947 67.4761 125.786 66.9358 125.786C66.4713 125.786 66.0684 125.904 65.7271 126.141C65.3953 126.369 65.1867 126.705 65.1014 127.151H63.8785C63.9259 126.639 64.0965 126.208 64.3904 125.857C64.6938 125.506 65.0682 125.241 65.5138 125.061C65.9593 124.871 66.4333 124.776 66.9358 124.776C67.9217 124.776 68.6611 125.042 69.1541 125.573C69.6565 126.094 69.9078 126.791 69.9078 127.663V132H68.8413L68.7702 130.734C68.5711 131.133 68.2772 131.474 67.8885 131.758C67.5093 132.033 66.9974 132.171 66.3528 132.171ZM66.5376 131.161C66.9927 131.161 67.3813 131.043 67.7037 130.806C68.0355 130.569 68.2867 130.26 68.4573 129.881C68.628 129.502 68.7133 129.104 68.7133 128.687V128.673H66.9073C66.2058 128.673 65.7081 128.796 65.4142 129.042C65.1298 129.279 64.9876 129.578 64.9876 129.938C64.9876 130.308 65.1204 130.606 65.3858 130.834C65.6607 131.052 66.0447 131.161 66.5376 131.161ZM74.4868 129.782C74.0887 129.782 73.7237 129.73 73.3919 129.625L72.6809 130.294C72.7852 130.369 72.9131 130.436 73.0648 130.493C73.226 130.54 73.4535 130.587 73.7474 130.635C74.0413 130.673 74.4536 130.715 74.9845 130.763C75.9325 130.829 76.6103 131.047 77.018 131.417C77.4256 131.787 77.6294 132.27 77.6294 132.867C77.6294 133.275 77.5157 133.664 77.2882 134.033C77.0701 134.403 76.7288 134.707 76.2643 134.944C75.8093 135.181 75.2215 135.299 74.501 135.299C73.8659 135.299 73.3018 135.214 72.8089 135.043C72.3159 134.882 71.932 134.631 71.657 134.289C71.3821 133.958 71.2447 133.536 71.2447 133.024C71.2447 132.758 71.3158 132.469 71.458 132.156C71.6002 131.853 71.8656 131.564 72.2543 131.289C72.0457 131.204 71.8656 131.114 71.7139 131.019C71.5717 130.915 71.439 130.801 71.3158 130.678V130.35L72.5245 129.156C71.9651 128.682 71.6855 128.056 71.6855 127.279C71.6855 126.814 71.7945 126.393 72.0125 126.013C72.2306 125.634 72.5482 125.336 72.9653 125.118C73.3824 124.89 73.8896 124.776 74.4868 124.776C74.8945 124.776 75.2642 124.833 75.596 124.947H78.1982V125.843L76.8758 125.9C77.1507 126.298 77.2882 126.758 77.2882 127.279C77.2882 127.743 77.1744 128.165 76.9469 128.545C76.7288 128.924 76.4113 129.227 75.9941 129.455C75.5865 129.673 75.0841 129.782 74.4868 129.782ZM74.4868 128.8C74.9893 128.8 75.3874 128.673 75.6813 128.417C75.9847 128.151 76.1363 127.772 76.1363 127.279C76.1363 126.795 75.9847 126.426 75.6813 126.17C75.3874 125.904 74.9893 125.772 74.4868 125.772C73.9749 125.772 73.5673 125.904 73.2639 126.17C72.97 126.426 72.8231 126.795 72.8231 127.279C72.8231 127.772 72.97 128.151 73.2639 128.417C73.5673 128.673 73.9749 128.8 74.4868 128.8ZM72.4107 132.91C72.4107 133.384 72.6098 133.735 73.0079 133.962C73.4061 134.199 73.9038 134.318 74.501 134.318C75.0888 134.318 75.5581 134.19 75.9088 133.934C76.2691 133.678 76.4492 133.337 76.4492 132.91C76.4492 132.607 76.3259 132.341 76.0795 132.114C75.833 131.896 75.3779 131.768 74.7143 131.73C74.1929 131.692 73.7426 131.644 73.3634 131.588C72.9748 131.796 72.7188 132.019 72.5956 132.256C72.4723 132.502 72.4107 132.72 72.4107 132.91ZM82.439 132.171C81.7659 132.171 81.1687 132.019 80.6473 131.716C80.1259 131.403 79.7135 130.971 79.4102 130.422C79.1163 129.872 78.9693 129.222 78.9693 128.473C78.9693 127.734 79.1163 127.089 79.4102 126.54C79.704 125.98 80.1117 125.549 80.6331 125.245C81.164 124.933 81.7754 124.776 82.4675 124.776C83.15 124.776 83.7378 124.933 84.2307 125.245C84.7332 125.549 85.1171 125.952 85.3826 126.454C85.648 126.957 85.7807 127.497 85.7807 128.075C85.7807 128.18 85.776 128.284 85.7665 128.388C85.7665 128.492 85.7665 128.611 85.7665 128.744H80.1496C80.178 129.284 80.3013 129.734 80.5193 130.095C80.7468 130.445 81.0265 130.711 81.3583 130.891C81.6996 131.071 82.0598 131.161 82.439 131.161C82.932 131.161 83.3444 131.047 83.6762 130.82C84.008 130.592 84.2497 130.284 84.4014 129.895H85.5816C85.392 130.55 85.0271 131.095 84.4867 131.531C83.9558 131.957 83.2733 132.171 82.439 132.171ZM82.439 125.786C81.8702 125.786 81.363 125.961 80.9175 126.312C80.4814 126.653 80.2302 127.156 80.1638 127.819H84.6005C84.572 127.184 84.354 126.686 83.9463 126.326C83.5387 125.966 83.0363 125.786 82.439 125.786ZM87.3639 132V124.947H88.4446L88.5157 126.212C88.7433 125.767 89.0703 125.416 89.4969 125.16C89.9235 124.904 90.407 124.776 90.9474 124.776C91.7816 124.776 92.4452 125.032 92.9382 125.544C93.4406 126.047 93.6918 126.824 93.6918 127.876V132H92.4973V128.004C92.4973 126.535 91.8906 125.8 90.6772 125.8C90.0705 125.8 89.5633 126.023 89.1556 126.468C88.7575 126.904 88.5584 127.53 88.5584 128.345V132H87.3639ZM99.3359 132V122.046H102.393C104.147 122.046 105.436 122.492 106.261 123.383C107.095 124.274 107.512 125.497 107.512 127.051C107.512 128.578 107.095 129.786 106.261 130.678C105.436 131.559 104.147 132 102.393 132H99.3359ZM100.53 131.005H102.365C103.332 131.005 104.1 130.848 104.668 130.535C105.247 130.213 105.659 129.758 105.906 129.17C106.152 128.573 106.275 127.867 106.275 127.051C106.275 126.217 106.152 125.501 105.906 124.904C105.659 124.307 105.247 123.847 104.668 123.525C104.1 123.203 103.332 123.041 102.365 123.041H100.53V131.005ZM112.337 132.171C111.664 132.171 111.067 132.019 110.545 131.716C110.024 131.403 109.612 130.971 109.308 130.422C109.014 129.872 108.867 129.222 108.867 128.473C108.867 127.734 109.014 127.089 109.308 126.54C109.602 125.98 110.01 125.549 110.531 125.245C111.062 124.933 111.674 124.776 112.366 124.776C113.048 124.776 113.636 124.933 114.129 125.245C114.631 125.549 115.015 125.952 115.281 126.454C115.546 126.957 115.679 127.497 115.679 128.075C115.679 128.18 115.674 128.284 115.665 128.388C115.665 128.492 115.665 128.611 115.665 128.744H110.048C110.076 129.284 110.199 129.734 110.417 130.095C110.645 130.445 110.925 130.711 111.256 130.891C111.598 131.071 111.958 131.161 112.337 131.161C112.83 131.161 113.242 131.047 113.574 130.82C113.906 130.592 114.148 130.284 114.299 129.895H115.48C115.29 130.55 114.925 131.095 114.385 131.531C113.854 131.957 113.171 132.171 112.337 132.171ZM112.337 125.786C111.768 125.786 111.261 125.961 110.816 126.312C110.38 126.653 110.128 127.156 110.062 127.819H114.499C114.47 127.184 114.252 126.686 113.844 126.326C113.437 125.966 112.934 125.786 112.337 125.786ZM121.096 132V122.046H124.367C125.144 122.046 125.784 122.174 126.287 122.43C126.789 122.686 127.159 123.032 127.396 123.468C127.642 123.904 127.766 124.397 127.766 124.947C127.766 125.487 127.647 125.975 127.41 126.412C127.173 126.848 126.803 127.198 126.301 127.464C125.799 127.72 125.154 127.848 124.367 127.848H122.291V132H121.096ZM122.291 126.838H124.339C125.135 126.838 125.699 126.672 126.031 126.34C126.372 125.999 126.543 125.535 126.543 124.947C126.543 124.35 126.372 123.885 126.031 123.553C125.699 123.212 125.135 123.041 124.339 123.041H122.291V126.838ZM132.015 132.171C131.342 132.171 130.744 132.019 130.223 131.716C129.701 131.403 129.289 130.971 128.986 130.422C128.692 129.872 128.545 129.222 128.545 128.473C128.545 127.734 128.692 127.089 128.986 126.54C129.28 125.98 129.687 125.549 130.209 125.245C130.74 124.933 131.351 124.776 132.043 124.776C132.726 124.776 133.313 124.933 133.806 125.245C134.309 125.549 134.693 125.952 134.958 126.454C135.224 126.957 135.356 127.497 135.356 128.075C135.356 128.18 135.352 128.284 135.342 128.388C135.342 128.492 135.342 128.611 135.342 128.744H129.725C129.754 129.284 129.877 129.734 130.095 130.095C130.322 130.445 130.602 130.711 130.934 130.891C131.275 131.071 131.635 131.161 132.015 131.161C132.508 131.161 132.92 131.047 133.252 130.82C133.584 130.592 133.825 130.284 133.977 129.895H135.157C134.968 130.55 134.603 131.095 134.062 131.531C133.531 131.957 132.849 132.171 132.015 132.171ZM132.015 125.786C131.446 125.786 130.939 125.961 130.493 126.312C130.057 126.653 129.806 127.156 129.739 127.819H134.176C134.148 127.184 133.93 126.686 133.522 126.326C133.114 125.966 132.612 125.786 132.015 125.786ZM136.94 132V124.947H138.02L138.12 126.298C138.338 125.833 138.67 125.464 139.115 125.189C139.561 124.914 140.111 124.776 140.765 124.776V126.028H140.438C140.021 126.028 139.637 126.103 139.286 126.255C138.935 126.397 138.655 126.644 138.447 126.995C138.238 127.345 138.134 127.829 138.134 128.445V132H136.94ZM142.489 132V125.956H141.423V124.947H142.489V123.724C142.489 123.041 142.66 122.544 143.001 122.231C143.343 121.918 143.84 121.762 144.494 121.762H145.205V122.785H144.679C144.319 122.785 144.063 122.861 143.911 123.013C143.76 123.155 143.684 123.402 143.684 123.752V124.947H148.064V132H146.869V125.956H143.684V132H142.489ZM147.481 123.596C147.253 123.596 147.059 123.52 146.898 123.368C146.736 123.207 146.656 123.008 146.656 122.771C146.656 122.544 146.736 122.354 146.898 122.202C147.059 122.051 147.253 121.975 147.481 121.975C147.718 121.975 147.912 122.051 148.064 122.202C148.225 122.354 148.305 122.544 148.305 122.771C148.305 123.008 148.225 123.207 148.064 123.368C147.912 123.52 147.718 123.596 147.481 123.596ZM150.174 132V121.762H151.368V132H150.174Z" fill="#727272"/>
<path d="M47.4266 239L51.0954 229.046H52.3609L56.0155 239H54.7499L53.8398 236.44H49.6023L48.678 239H47.4266ZM49.9578 235.473H53.4843L51.721 230.553L49.9578 235.473ZM60.2775 239.171C59.6044 239.171 58.9977 239.019 58.4573 238.716C57.9264 238.403 57.5046 237.971 57.1917 237.422C56.8884 236.862 56.7367 236.213 56.7367 235.473C56.7367 234.734 56.8884 234.089 57.1917 233.54C57.5046 232.98 57.9264 232.549 58.4573 232.245C58.9977 231.933 59.6044 231.776 60.2775 231.776C61.1117 231.776 61.8132 231.994 62.382 232.43C62.9603 232.866 63.3253 233.449 63.477 234.179H62.2541C62.1593 233.743 61.927 233.407 61.5573 233.17C61.1876 232.923 60.7562 232.8 60.2633 232.8C59.8651 232.8 59.4906 232.9 59.1399 233.099C58.7891 233.298 58.5047 233.596 58.2867 233.995C58.0686 234.393 57.9596 234.886 57.9596 235.473C57.9596 236.061 58.0686 236.554 58.2867 236.952C58.5047 237.35 58.7891 237.654 59.1399 237.862C59.4906 238.061 59.8651 238.161 60.2633 238.161C60.7562 238.161 61.1876 238.043 61.5573 237.806C61.927 237.559 62.1593 237.213 62.2541 236.767H63.477C63.3348 237.478 62.9745 238.057 62.3963 238.502C61.818 238.948 61.1117 239.171 60.2775 239.171ZM68.3162 239.171C67.6431 239.171 67.0459 239.019 66.5245 238.716C66.0031 238.403 65.5907 237.971 65.2874 237.422C64.9935 236.872 64.8465 236.222 64.8465 235.473C64.8465 234.734 64.9935 234.089 65.2874 233.54C65.5812 232.98 65.9889 232.549 66.5103 232.245C67.0412 231.933 67.6526 231.776 68.3447 231.776C69.0272 231.776 69.615 231.933 70.1079 232.245C70.6104 232.549 70.9943 232.952 71.2598 233.454C71.5252 233.957 71.6579 234.497 71.6579 235.075C71.6579 235.18 71.6532 235.284 71.6437 235.388C71.6437 235.492 71.6437 235.611 71.6437 235.744H66.0268C66.0552 236.284 66.1785 236.734 66.3965 237.095C66.624 237.445 66.9037 237.711 67.2355 237.891C67.5768 238.071 67.937 238.161 68.3162 238.161C68.8092 238.161 69.2216 238.047 69.5534 237.82C69.8852 237.592 70.1269 237.284 70.2786 236.895H71.4588C71.2692 237.55 70.9043 238.095 70.3639 238.531C69.833 238.957 69.1505 239.171 68.3162 239.171ZM68.3162 232.786C67.7474 232.786 67.2402 232.961 66.7947 233.312C66.3586 233.653 66.1074 234.156 66.041 234.819H70.4777C70.4492 234.184 70.2312 233.686 69.8235 233.326C69.4159 232.966 68.9135 232.786 68.3162 232.786ZM73.2411 239V231.947H74.3218L74.4214 233.298C74.6394 232.833 74.9712 232.464 75.4168 232.189C75.8623 231.914 76.4122 231.776 77.0663 231.776V233.028H76.7392C76.3221 233.028 75.9382 233.103 75.5874 233.255C75.2367 233.397 74.957 233.644 74.7484 233.995C74.5399 234.345 74.4356 234.829 74.4356 235.445V239H73.2411ZM81.3853 239.171C80.7122 239.171 80.1055 239.019 79.5651 238.716C79.0343 238.403 78.6124 237.971 78.2996 237.422C77.9962 236.862 77.8445 236.213 77.8445 235.473C77.8445 234.734 77.9962 234.089 78.2996 233.54C78.6124 232.98 79.0343 232.549 79.5651 232.245C80.1055 231.933 80.7122 231.776 81.3853 231.776C82.2195 231.776 82.9211 231.994 83.4899 232.43C84.0681 232.866 84.4331 233.449 84.5848 234.179H83.3619C83.2671 233.743 83.0348 233.407 82.6651 233.17C82.2954 232.923 81.864 232.8 81.3711 232.8C80.9729 232.8 80.5985 232.9 80.2477 233.099C79.8969 233.298 79.6125 233.596 79.3945 233.995C79.1765 234.393 79.0674 234.886 79.0674 235.473C79.0674 236.061 79.1765 236.554 79.3945 236.952C79.6125 237.35 79.8969 237.654 80.2477 237.862C80.5985 238.061 80.9729 238.161 81.3711 238.161C81.864 238.161 82.2954 238.043 82.6651 237.806C83.0348 237.559 83.2671 237.213 83.3619 236.767H84.5848C84.4426 237.478 84.0824 238.057 83.5041 238.502C82.9258 238.948 82.2195 239.171 81.3853 239.171ZM88.5993 239.171C88.0115 239.171 87.5233 239.071 87.1346 238.872C86.7459 238.673 86.4568 238.407 86.2672 238.076C86.0776 237.744 85.9828 237.384 85.9828 236.995C85.9828 236.274 86.2577 235.72 86.8076 235.331C87.3574 234.943 88.1063 234.748 89.0543 234.748H90.9598V234.663C90.9598 234.047 90.7986 233.582 90.4763 233.269C90.154 232.947 89.7227 232.786 89.1823 232.786C88.7178 232.786 88.3149 232.904 87.9736 233.141C87.6418 233.369 87.4332 233.705 87.3479 234.151H86.125C86.1724 233.639 86.343 233.208 86.6369 232.857C86.9403 232.506 87.3147 232.241 87.7603 232.061C88.2059 231.871 88.6799 231.776 89.1823 231.776C90.1682 231.776 90.9077 232.042 91.4006 232.573C91.9031 233.094 92.1543 233.791 92.1543 234.663V239H91.0878L91.0167 237.734C90.8176 238.133 90.5237 238.474 90.135 238.758C89.7558 239.033 89.2439 239.171 88.5993 239.171ZM88.7841 238.161C89.2392 238.161 89.6279 238.043 89.9502 237.806C90.282 237.569 90.5332 237.26 90.7038 236.881C90.8745 236.502 90.9598 236.104 90.9598 235.687V235.673H89.1539C88.4523 235.673 87.9546 235.796 87.6608 236.042C87.3764 236.279 87.2342 236.578 87.2342 236.938C87.2342 237.308 87.3669 237.606 87.6323 237.834C87.9072 238.052 88.2912 238.161 88.7841 238.161ZM97.7806 239V229.046H100.838C102.592 229.046 103.881 229.492 104.706 230.383C105.54 231.274 105.957 232.497 105.957 234.051C105.957 235.578 105.54 236.786 104.706 237.678C103.881 238.559 102.592 239 100.838 239H97.7806ZM98.9751 238.005H100.809C101.776 238.005 102.544 237.848 103.113 237.535C103.691 237.213 104.104 236.758 104.35 236.17C104.597 235.573 104.72 234.867 104.72 234.051C104.72 233.217 104.597 232.501 104.35 231.904C104.104 231.307 103.691 230.847 103.113 230.525C102.544 230.203 101.776 230.041 100.809 230.041H98.9751V238.005ZM110.782 239.171C110.109 239.171 109.511 239.019 108.99 238.716C108.469 238.403 108.056 237.971 107.753 237.422C107.459 236.872 107.312 236.222 107.312 235.473C107.312 234.734 107.459 234.089 107.753 233.54C108.047 232.98 108.454 232.549 108.976 232.245C109.507 231.933 110.118 231.776 110.81 231.776C111.493 231.776 112.081 231.933 112.574 232.245C113.076 232.549 113.46 232.952 113.725 233.454C113.991 233.957 114.124 234.497 114.124 235.075C114.124 235.18 114.119 235.284 114.109 235.388C114.109 235.492 114.109 235.611 114.109 235.744H108.492C108.521 236.284 108.644 236.734 108.862 237.095C109.09 237.445 109.369 237.711 109.701 237.891C110.042 238.071 110.403 238.161 110.782 238.161C111.275 238.161 111.687 238.047 112.019 237.82C112.351 237.592 112.592 237.284 112.744 236.895H113.924C113.735 237.55 113.37 238.095 112.829 238.531C112.299 238.957 111.616 239.171 110.782 239.171ZM110.782 232.786C110.213 232.786 109.706 232.961 109.26 233.312C108.824 233.653 108.573 234.156 108.507 234.819H112.943C112.915 234.184 112.697 233.686 112.289 233.326C111.881 232.966 111.379 232.786 110.782 232.786ZM121.873 239V230.027H118.901V229.046H126.04V230.027H123.068V239H121.873ZM128.152 230.383C127.915 230.383 127.716 230.307 127.555 230.155C127.403 229.994 127.328 229.795 127.328 229.558C127.328 229.33 127.403 229.141 127.555 228.989C127.716 228.837 127.915 228.762 128.152 228.762C128.38 228.762 128.574 228.837 128.735 228.989C128.897 229.141 128.977 229.33 128.977 229.558C128.977 229.795 128.897 229.994 128.735 230.155C128.574 230.307 128.38 230.383 128.152 230.383ZM127.555 239V231.947H128.75V239H127.555Z" fill="#727272"/>
<g clip-path="url(#clip0_1479_7314)">
<mask id="mask0_1479_7314" style="mask-type:luminance" maskUnits="userSpaceOnUse" x="9" y="9" width="15" height="15">
<path d="M9.61133 9.81445H23.3891V23.3431H9.61133V9.81445Z" fill="white"/>
</mask>
<g mask="url(#mask0_1479_7314)">
<path d="M22.8512 10.0019C22.3126 9.65237 21.5936 9.80579 21.2448 10.3445L14.7358 20.3859L11.5615 17.4484C11.0902 17.0124 10.3557 17.041 9.9201 17.5127C9.48455 17.9839 9.5132 18.7199 9.98441 19.1554L14.1523 23.0122C14.1523 23.0122 14.272 23.1153 14.3273 23.1513C14.5225 23.2784 14.7416 23.3389 14.9584 23.3389C15.3386 23.3389 15.7116 23.1521 15.9342 22.8087L23.1935 11.6098C23.5428 11.0711 23.3894 10.3511 22.8512 10.0019Z" fill="white"/>
</g>
</g>
<defs>
<clipPath id="clip0_1479_7314">
<rect width="15" height="15" fill="white" transform="translate(9 9)"/>
</clipPath>
</defs>
</svg>
