<svg width="174" height="26" viewBox="0 0 174 26" fill="none" xmlns="http://www.w3.org/2000/svg">
<path d="M3.29567 8.97789C2.60375 8.97789 2.03676 8.77608 1.5947 8.37246C1.17186 7.94962 0.96044 7.43068 0.96044 6.81564C0.96044 6.2006 1.17186 5.69127 1.5947 5.28765C2.03676 4.86481 2.60375 4.65339 3.29567 4.65339C3.94915 4.65339 4.48731 4.86481 4.91015 5.28765C5.35221 5.69127 5.57324 6.2006 5.57324 6.81564C5.57324 7.43068 5.35221 7.94962 4.91015 8.37246C4.48731 8.77608 3.94915 8.97789 3.29567 8.97789ZM1.24874 25.0074L1.65236 11.2266H4.766L5.19845 25.0074H1.24874ZM9.49119 21V0.818999H22.5224V3.78849H13.1814V9.43917H20.7349V12.351H13.1814V21H9.49119ZM31.4716 21.346C30.0301 21.346 28.752 21.0384 27.6372 20.4234C26.5224 19.8084 25.6479 18.9435 25.0137 17.8287C24.3794 16.7139 24.0623 15.4262 24.0623 13.9655C24.0623 12.4855 24.3698 11.169 24.9848 10.0158C25.6191 8.86257 26.484 7.96884 27.5795 7.33458C28.6943 6.6811 30.0013 6.35436 31.5004 6.35436C32.9035 6.35436 34.1432 6.66188 35.2195 7.27692C36.2958 7.89196 37.1319 8.73764 37.7277 9.81396C38.3427 10.8711 38.6503 12.0531 38.6503 13.36C38.6503 13.5715 38.6406 13.7925 38.6214 14.0231C38.6214 14.2538 38.6118 14.494 38.5926 14.7439H27.7237C27.8006 15.8586 28.185 16.7332 28.8769 17.3674C29.588 18.0017 30.4433 18.3188 31.4428 18.3188C32.1923 18.3188 32.817 18.1554 33.3167 17.8287C33.8356 17.4827 34.22 17.0407 34.4699 16.5025H38.2178C37.9487 17.4059 37.4971 18.2323 36.8628 18.9819C36.2478 19.7123 35.479 20.2889 34.5564 20.7117C33.6531 21.1345 32.6248 21.346 31.4716 21.346ZM31.5004 9.35268C30.5971 9.35268 29.7994 9.61215 29.1075 10.1311C28.4156 10.6308 27.9735 11.3996 27.7813 12.4375H34.9024C34.8447 11.4957 34.4987 10.7461 33.8645 10.1887C33.2302 9.63137 32.4422 9.35268 31.5004 9.35268ZM41.754 21V0.242399H45.4442V21H41.754ZM51.2041 4.48041C50.5314 4.48041 49.9741 4.2786 49.532 3.87498C49.1092 3.47136 48.8977 2.96203 48.8977 2.34699C48.8977 1.73195 49.1092 1.23223 49.532 0.847828C49.9741 0.444209 50.5314 0.242399 51.2041 0.242399C51.8768 0.242399 52.4246 0.444209 52.8475 0.847828C53.2895 1.23223 53.5105 1.73195 53.5105 2.34699C53.5105 2.96203 53.2895 3.47136 52.8475 3.87498C52.4246 4.2786 51.8768 4.48041 51.2041 4.48041ZM49.359 21V6.70032H53.0493V21H49.359ZM63.9067 21.346C62.446 21.346 61.1582 21.0288 60.0435 20.3946C58.9287 19.7603 58.0446 18.8762 57.3911 17.7422C56.7569 16.6082 56.4397 15.3109 56.4397 13.8502C56.4397 12.3894 56.7569 11.0921 57.3911 9.95811C58.0446 8.82413 58.9287 7.94001 60.0435 7.30575C61.1582 6.67149 62.446 6.35436 63.9067 6.35436C65.7326 6.35436 67.2702 6.83486 68.5195 7.79586C69.7688 8.73764 70.5664 10.0446 70.9124 11.7167H67.0203C66.8281 11.0248 66.4437 10.4867 65.8671 10.1023C65.3098 9.69864 64.6467 9.49683 63.8779 9.49683C62.8592 9.49683 61.9943 9.88123 61.2832 10.65C60.572 11.4188 60.2165 12.4855 60.2165 13.8502C60.2165 15.2148 60.572 16.2815 61.2832 17.0503C61.9943 17.8191 62.8592 18.2035 63.8779 18.2035C64.6467 18.2035 65.3098 18.0113 65.8671 17.6269C66.4437 17.2425 66.8281 16.6947 67.0203 15.9836H70.9124C70.5664 17.5981 69.7688 18.8954 68.5195 19.8756C67.2702 20.8558 65.7326 21.346 63.9067 21.346ZM76.177 4.48041C75.5043 4.48041 74.9469 4.2786 74.5049 3.87498C74.082 3.47136 73.8706 2.96203 73.8706 2.34699C73.8706 1.73195 74.082 1.23223 74.5049 0.847828C74.9469 0.444209 75.5043 0.242399 76.177 0.242399C76.8497 0.242399 77.3975 0.444209 77.8203 0.847828C78.2624 1.23223 78.4834 1.73195 78.4834 2.34699C78.4834 2.96203 78.2624 3.47136 77.8203 3.87498C77.3975 4.2786 76.8497 4.48041 76.177 4.48041ZM74.3319 21V6.70032H78.0221V21H74.3319ZM88.4471 21.346C87.1017 21.346 85.9004 21.0192 84.8433 20.3657C83.7862 19.7123 82.9502 18.8185 82.3351 17.6845C81.7201 16.5506 81.4126 15.2628 81.4126 13.8213C81.4126 12.3798 81.7201 11.1017 82.3351 9.98694C82.9502 8.85296 83.7862 7.96884 84.8433 7.33458C85.9004 6.6811 87.1017 6.35436 88.4471 6.35436C89.5234 6.35436 90.4652 6.55617 91.2724 6.95979C92.0797 7.36341 92.7332 7.9304 93.2329 8.66076V0.242399H96.9231V21H93.6365L93.2329 18.9531C92.7716 19.5873 92.1566 20.1447 91.3878 20.6252C90.6382 21.1057 89.658 21.346 88.4471 21.346ZM89.2255 18.117C90.4171 18.117 91.3878 17.723 92.1373 16.935C92.9061 16.1277 93.2905 15.0995 93.2905 13.8502C93.2905 12.6009 92.9061 11.5822 92.1373 10.7942C91.3878 9.98694 90.4171 9.58332 89.2255 9.58332C88.0531 9.58332 87.0825 9.97733 86.3137 10.7653C85.5449 11.5534 85.1605 12.572 85.1605 13.8213C85.1605 15.0706 85.5449 16.0989 86.3137 16.9061C87.0825 17.7134 88.0531 18.117 89.2255 18.117ZM105.611 21.346C104.381 21.346 103.372 21.1538 102.584 20.7694C101.796 20.3657 101.209 19.8372 100.825 19.1837C100.441 18.5302 100.248 17.8095 100.248 17.0215C100.248 15.6953 100.767 14.619 101.805 13.7925C102.843 12.966 104.4 12.5528 106.476 12.5528H110.108V12.2068C110.108 11.2266 109.83 10.5059 109.272 10.0446C108.715 9.58332 108.023 9.35268 107.197 9.35268C106.447 9.35268 105.793 9.53527 105.236 9.90045C104.679 10.2464 104.333 10.7653 104.198 11.4573H100.594C100.691 10.4194 101.036 9.51605 101.632 8.74725C102.247 7.97845 103.035 7.39224 103.996 6.98862C104.957 6.56578 106.034 6.35436 107.225 6.35436C109.263 6.35436 110.868 6.86369 112.04 7.88235C113.212 8.90101 113.799 10.3425 113.799 12.2068V21H110.656L110.31 18.6936C109.887 19.4624 109.291 20.0967 108.523 20.5964C107.773 21.0961 106.802 21.346 105.611 21.346ZM106.447 18.463C107.504 18.463 108.321 18.117 108.897 17.4251C109.493 16.7332 109.868 15.8779 110.022 14.8592H106.879C105.899 14.8592 105.198 15.0418 104.775 15.407C104.352 15.7529 104.141 16.1854 104.141 16.7043C104.141 17.2617 104.352 17.6942 104.775 18.0017C105.198 18.3092 105.755 18.463 106.447 18.463ZM123.893 21.346C122.548 21.346 121.347 21.0192 120.29 20.3657C119.233 19.7123 118.396 18.8185 117.781 17.6845C117.166 16.5506 116.859 15.2628 116.859 13.8213C116.859 12.3798 117.166 11.1017 117.781 9.98694C118.396 8.85296 119.233 7.96884 120.29 7.33458C121.347 6.6811 122.548 6.35436 123.893 6.35436C124.97 6.35436 125.911 6.55617 126.719 6.95979C127.526 7.36341 128.179 7.9304 128.679 8.66076V0.242399H132.369V21H129.083L128.679 18.9531C128.218 19.5873 127.603 20.1447 126.834 20.6252C126.084 21.1057 125.104 21.346 123.893 21.346ZM124.672 18.117C125.863 18.117 126.834 17.723 127.584 16.935C128.352 16.1277 128.737 15.0995 128.737 13.8502C128.737 12.6009 128.352 11.5822 127.584 10.7942C126.834 9.98694 125.863 9.58332 124.672 9.58332C123.499 9.58332 122.529 9.97733 121.76 10.7653C120.991 11.5534 120.607 12.572 120.607 13.8213C120.607 15.0706 120.991 16.0989 121.76 16.9061C122.529 17.7134 123.499 18.117 124.672 18.117ZM143.075 21.346C141.634 21.346 140.356 21.0384 139.241 20.4234C138.126 19.8084 137.252 18.9435 136.617 17.8287C135.983 16.7139 135.666 15.4262 135.666 13.9655C135.666 12.4855 135.973 11.169 136.588 10.0158C137.223 8.86257 138.088 7.96884 139.183 7.33458C140.298 6.6811 141.605 6.35436 143.104 6.35436C144.507 6.35436 145.747 6.66188 146.823 7.27692C147.899 7.89196 148.736 8.73764 149.331 9.81396C149.946 10.8711 150.254 12.0531 150.254 13.36C150.254 13.5715 150.244 13.7925 150.225 14.0231C150.225 14.2538 150.215 14.494 150.196 14.7439H139.327C139.404 15.8586 139.789 16.7332 140.481 17.3674C141.192 18.0017 142.047 18.3188 143.046 18.3188C143.796 18.3188 144.421 18.1554 144.92 17.8287C145.439 17.4827 145.824 17.0407 146.074 16.5025H149.821C149.552 17.4059 149.101 18.2323 148.466 18.9819C147.851 19.7123 147.083 20.2889 146.16 20.7117C145.257 21.1345 144.228 21.346 143.075 21.346ZM143.104 9.35268C142.201 9.35268 141.403 9.61215 140.711 10.1311C140.019 10.6308 139.577 11.3996 139.385 12.4375H146.506C146.448 11.4957 146.102 10.7461 145.468 10.1887C144.834 9.63137 144.046 9.35268 143.104 9.35268ZM159.268 21.346C157.999 21.346 156.884 21.1441 155.923 20.7405C154.962 20.3177 154.194 19.7411 153.617 19.0107C153.04 18.2804 152.695 17.4347 152.579 16.4737H156.298C156.414 17.0311 156.721 17.5116 157.221 17.9152C157.74 18.2996 158.403 18.4918 159.21 18.4918C160.017 18.4918 160.604 18.3284 160.969 18.0017C161.353 17.6749 161.545 17.3001 161.545 16.8773C161.545 16.2623 161.276 15.849 160.738 15.6376C160.2 15.407 159.45 15.1859 158.489 14.9745C157.874 14.84 157.25 14.6766 156.615 14.4844C155.981 14.2922 155.395 14.052 154.857 13.7637C154.338 13.4561 153.915 13.0717 153.588 12.6105C153.262 12.13 153.098 11.5438 153.098 10.8518C153.098 9.58332 153.598 8.51661 154.597 7.65171C155.616 6.78681 157.038 6.35436 158.864 6.35436C160.556 6.35436 161.901 6.74837 162.9 7.53639C163.919 8.32441 164.524 9.41034 164.717 10.7942H161.228C161.017 9.73708 160.219 9.20853 158.835 9.20853C158.143 9.20853 157.605 9.34307 157.221 9.61215C156.856 9.88123 156.673 10.2176 156.673 10.6212C156.673 11.044 156.952 11.3804 157.509 11.6302C158.067 11.8801 158.806 12.1107 159.729 12.3222C160.728 12.5528 161.641 12.8123 162.468 13.1006C163.314 13.3697 163.986 13.7829 164.486 14.3403C164.986 14.8784 165.236 15.6568 165.236 16.6755C165.255 17.5596 165.024 18.3572 164.544 19.0684C164.063 19.7795 163.371 20.3369 162.468 20.7405C161.565 21.1441 160.498 21.346 159.268 21.346ZM169.283 14.6286L168.879 0.818999H172.829L172.397 14.6286H169.283ZM170.926 21.2018C170.234 21.2018 169.667 20.9904 169.225 20.5675C168.803 20.1447 168.591 19.6354 168.591 19.0396C168.591 18.4245 168.803 17.9056 169.225 17.4827C169.667 17.0599 170.234 16.8485 170.926 16.8485C171.58 16.8485 172.118 17.0599 172.541 17.4827C172.983 17.9056 173.204 18.4245 173.204 19.0396C173.204 19.6354 172.983 20.1447 172.541 20.5675C172.118 20.9904 171.58 21.2018 170.926 21.2018Z" fill="black"/>
</svg>
