<svg width="17" height="19" viewBox="0 0 17 19" fill="none" xmlns="http://www.w3.org/2000/svg">
<g id="Group 33520">
<path id="Vector 26 (Stroke)" fill-rule="evenodd" clip-rule="evenodd" d="M12 17.375L12 12.154C12 11.6708 12.3918 11.279 12.875 11.279C13.3582 11.279 13.75 11.6708 13.75 12.154L13.75 17.375C13.75 17.8582 13.3582 18.25 12.875 18.25C12.3918 18.25 12 17.8582 12 17.375Z" fill="#86888A"/>
<path id="Vector 27 (Stroke)" fill-rule="evenodd" clip-rule="evenodd" d="M4.125 7.75C3.64175 7.75 3.25 7.35825 3.25 6.875L3.25 1.625C3.25 1.14175 3.64175 0.75 4.125 0.749999C4.60825 0.749999 5 1.14175 5 1.625L5 6.875C5 7.35825 4.60825 7.75 4.125 7.75Z" fill="#86888A"/>
<path id="Vector 28 (Stroke)" fill-rule="evenodd" clip-rule="evenodd" d="M4.125 18.25C3.64175 18.25 3.25 17.8582 3.25 17.375L3.25 17.3662C3.25 16.883 3.64175 16.4912 4.125 16.4912C4.60825 16.4912 5 16.883 5 17.3662L5 17.375C5 17.8582 4.60825 18.25 4.125 18.25Z" fill="#86888A"/>
<path id="Vector 29 (Stroke)" fill-rule="evenodd" clip-rule="evenodd" d="M12.875 2.5C12.3918 2.5 12 2.10825 12 1.625L12 1.61625C12 1.133 12.3918 0.74125 12.875 0.74125C13.3582 0.74125 13.75 1.133 13.75 1.61625L13.75 1.625C13.75 2.10825 13.3582 2.5 12.875 2.5Z" fill="#86888A"/>
<path id="Union" fill-rule="evenodd" clip-rule="evenodd" d="M9.375 6.875C9.375 8.81258 10.9466 10.375 12.875 10.375C14.8034 10.375 16.375 8.81258 16.375 6.875C16.375 4.93742 14.8034 3.375 12.875 3.375C10.9466 3.375 9.375 4.93742 9.375 6.875Z" fill="#86888A"/>
<path id="Union_2" fill-rule="evenodd" clip-rule="evenodd" d="M0.625 12.125C0.625 14.0626 2.19658 15.625 4.125 15.625C6.05342 15.625 7.625 14.0626 7.625 12.125C7.625 10.1874 6.05342 8.625 4.125 8.625C2.19658 8.625 0.625 10.1874 0.625 12.125Z" fill="#86888A"/>
</g>
</svg>
