<svg width="315" height="48" viewBox="0 0 315 48" fill="none" xmlns="http://www.w3.org/2000/svg">
<path d="M32.0312 9L289.031 9.00002" stroke="#1ABAD6" stroke-opacity="0.4" stroke-width="0.547231"/>
<circle cx="31.7869" cy="8.7557" r="8.7557" fill="#1ABAD6"/>
<circle cx="164.756" cy="8.7557" r="8.7557" fill="#1ABAD6"/>
<path d="M0.981184 33.7207V27.5917H4.87747V28.3447H1.90929V30.2534H4.6148V30.9889H1.90929V32.9677H4.87747V33.7207H0.981184ZM5.9482 33.7207V29.3779H6.77123L6.84128 30.1396C6.97553 29.8711 7.17108 29.661 7.42791 29.5092C7.69058 29.3516 7.99119 29.2728 8.32975 29.2728C8.85509 29.2728 9.26661 29.4362 9.5643 29.7631C9.86783 30.09 10.0196 30.5774 10.0196 31.2253V33.7207H9.10025V31.3216C9.10025 30.4811 8.75586 30.0608 8.06708 30.0608C7.72269 30.0608 7.43667 30.1834 7.20902 30.4286C6.98721 30.6737 6.8763 31.0239 6.8763 31.4792V33.7207H5.9482ZM11.3316 33.7207V30.1571H10.7099V29.3779H11.3316V28.7475C11.3316 28.2747 11.4483 27.9361 11.6818 27.7318C11.9211 27.5217 12.2568 27.4166 12.6887 27.4166H13.144V28.2046H12.8288C12.6245 28.2046 12.4786 28.2484 12.391 28.3359C12.3035 28.4177 12.2597 28.5578 12.2597 28.7562V29.3779H13.2578V30.1571H12.2597V33.7207H11.3316ZM15.9999 33.8258C15.5738 33.8258 15.1944 33.7324 14.8616 33.5456C14.5348 33.353 14.2779 33.0874 14.0911 32.7488C13.9043 32.4103 13.811 32.0163 13.811 31.5668C13.811 31.1115 13.9014 30.7117 14.0824 30.3673C14.2692 30.0229 14.526 29.7544 14.8529 29.5617C15.1856 29.3691 15.5708 29.2728 16.0086 29.2728C16.4347 29.2728 16.8054 29.3691 17.1206 29.5617C17.4358 29.7485 17.681 29.9995 17.8561 30.3147C18.0312 30.6299 18.1188 30.9773 18.1188 31.3567C18.1188 31.415 18.1158 31.4792 18.11 31.5493C18.11 31.6135 18.1071 31.6865 18.1012 31.7682H14.7215C14.7507 32.1885 14.8879 32.5095 15.1331 32.7313C15.3841 32.9473 15.673 33.0553 15.9999 33.0553C16.2625 33.0553 16.4814 32.9969 16.6566 32.8802C16.8375 32.7576 16.9718 32.5941 17.0593 32.3898H17.9874C17.8707 32.7984 17.6372 33.1399 17.287 33.4143C16.9426 33.6886 16.5135 33.8258 15.9999 33.8258ZM15.9999 30.0346C15.6905 30.0346 15.4162 30.1279 15.1768 30.3147C14.9375 30.4957 14.7916 30.77 14.7391 31.1378H17.1907C17.1731 30.7992 17.0535 30.5307 16.8317 30.3322C16.6099 30.1338 16.3326 30.0346 15.9999 30.0346ZM19.0817 33.7207V29.3779H19.9135L19.9923 30.2009C20.1441 29.9149 20.3542 29.6902 20.6228 29.5267C20.8971 29.3574 21.2269 29.2728 21.6121 29.2728V30.2447H21.3582C21.1014 30.2447 20.8708 30.2885 20.6665 30.376C20.4681 30.4577 20.3075 30.6008 20.185 30.8051C20.0682 31.0035 20.0099 31.2808 20.0099 31.6368V33.7207H19.0817ZM22.4079 33.7207V29.3779H23.2309L23.3097 29.9908C23.4498 29.769 23.6337 29.5938 23.8613 29.4654C24.0948 29.337 24.3633 29.2728 24.6669 29.2728C25.3556 29.2728 25.8343 29.5442 26.1028 30.0871C26.2604 29.8361 26.4705 29.6376 26.7332 29.4917C27.0017 29.3458 27.2906 29.2728 27.6 29.2728C28.1429 29.2728 28.569 29.4362 28.8783 29.7631C29.1877 30.09 29.3424 30.5774 29.3424 31.2253V33.7207H28.4143V31.3216C28.4143 30.4811 28.0933 30.0608 27.4512 30.0608C27.1243 30.0608 26.8558 30.1834 26.6456 30.4286C26.4413 30.6737 26.3392 31.0239 26.3392 31.4792V33.7207H25.4111V31.3216C25.4111 30.4811 25.0871 30.0608 24.4392 30.0608C24.1182 30.0608 23.8526 30.1834 23.6424 30.4286C23.4381 30.6737 23.336 31.0239 23.336 31.4792V33.7207H22.4079ZM32.4596 33.8258C32.0335 33.8258 31.654 33.7324 31.3213 33.5456C30.9944 33.353 30.7376 33.0874 30.5508 32.7488C30.364 32.4103 30.2706 32.0163 30.2706 31.5668C30.2706 31.1115 30.3611 30.7117 30.5421 30.3673C30.7289 30.0229 30.9857 29.7544 31.3126 29.5617C31.6453 29.3691 32.0305 29.2728 32.4683 29.2728C32.8944 29.2728 33.2651 29.3691 33.5803 29.5617C33.8955 29.7485 34.1407 29.9995 34.3158 30.3147C34.4909 30.6299 34.5784 30.9773 34.5784 31.3567C34.5784 31.415 34.5755 31.4792 34.5697 31.5493C34.5697 31.6135 34.5668 31.6865 34.5609 31.7682H31.1812C31.2104 32.1885 31.3476 32.5095 31.5928 32.7313C31.8438 32.9473 32.1327 33.0553 32.4596 33.0553C32.7222 33.0553 32.9411 32.9969 33.1162 32.8802C33.2972 32.7576 33.4315 32.5941 33.519 32.3898H34.4471C34.3304 32.7984 34.0969 33.1399 33.7467 33.4143C33.4023 33.6886 32.9732 33.8258 32.4596 33.8258ZM32.4596 30.0346C32.1502 30.0346 31.8759 30.1279 31.6365 30.3147C31.3972 30.4957 31.2513 30.77 31.1987 31.1378H33.6503C33.6328 30.7992 33.5132 30.5307 33.2914 30.3322C33.0695 30.1338 32.7923 30.0346 32.4596 30.0346ZM37.5202 33.8258C37.1 33.8258 36.7293 33.7265 36.4082 33.5281C36.0872 33.3296 35.8362 33.0582 35.6553 32.7138C35.4743 32.3694 35.3838 31.9783 35.3838 31.5405C35.3838 31.1027 35.4743 30.7146 35.6553 30.376C35.8362 30.0316 36.0872 29.7631 36.4082 29.5705C36.7351 29.372 37.1087 29.2728 37.529 29.2728C37.8734 29.2728 38.174 29.3399 38.4308 29.4742C38.6935 29.6084 38.8978 29.7981 39.0437 30.0433V27.4166H39.9718V33.7207H39.14L39.0437 33.0465C38.9036 33.2508 38.711 33.4318 38.4658 33.5894C38.2207 33.747 37.9055 33.8258 37.5202 33.8258ZM37.6866 33.0202C38.0835 33.0202 38.4075 32.8831 38.6585 32.6087C38.9153 32.3344 39.0437 31.9812 39.0437 31.5493C39.0437 31.1115 38.9153 30.7584 38.6585 30.4898C38.4075 30.2155 38.0835 30.0783 37.6866 30.0783C37.2897 30.0783 36.9628 30.2155 36.7059 30.4898C36.4491 30.7584 36.3207 31.1115 36.3207 31.5493C36.3207 31.8353 36.3791 32.0892 36.4958 32.311C36.6125 32.5328 36.7731 32.708 36.9774 32.8364C37.1875 32.959 37.4239 33.0202 37.6866 33.0202ZM42.613 33.8258C42.2452 33.8258 41.9417 33.7645 41.7024 33.6419C41.463 33.5193 41.285 33.3588 41.1683 33.1603C41.0515 32.956 40.9932 32.7342 40.9932 32.4949C40.9932 32.0746 41.1566 31.7419 41.4835 31.4968C41.8104 31.2516 42.2773 31.129 42.8844 31.129H44.0226V31.0502C44.0226 30.7117 43.9292 30.4577 43.7424 30.2885C43.5615 30.1192 43.3251 30.0346 43.0332 30.0346C42.7764 30.0346 42.5517 30.0988 42.359 30.2272C42.1723 30.3498 42.0584 30.5336 42.0176 30.7788H41.0895C41.1187 30.4636 41.2237 30.1951 41.4047 29.9733C41.5915 29.7456 41.825 29.5734 42.1051 29.4567C42.3912 29.3341 42.7034 29.2728 43.042 29.2728C43.6491 29.2728 44.1189 29.4333 44.4517 29.7544C44.7844 30.0696 44.9507 30.5015 44.9507 31.0502V33.7207H44.1452L44.0664 32.9765C43.9438 33.2158 43.7658 33.4172 43.5323 33.5806C43.2988 33.7441 42.9924 33.8258 42.613 33.8258ZM42.7968 33.0728C43.0478 33.0728 43.258 33.0144 43.4272 32.8977C43.6024 32.7751 43.7366 32.6146 43.83 32.4161C43.9292 32.2176 43.9905 31.9987 44.0139 31.7594H42.9807C42.613 31.7594 42.3503 31.8236 42.1927 31.9521C42.0409 32.0805 41.965 32.241 41.965 32.4336C41.965 32.6321 42.038 32.7897 42.1839 32.9064C42.3357 33.0173 42.54 33.0728 42.7968 33.0728ZM48.0117 33.8258C47.5914 33.8258 47.2207 33.7265 46.8997 33.5281C46.5787 33.3296 46.3277 33.0582 46.1467 32.7138C45.9658 32.3694 45.8753 31.9783 45.8753 31.5405C45.8753 31.1027 45.9658 30.7146 46.1467 30.376C46.3277 30.0316 46.5787 29.7631 46.8997 29.5705C47.2266 29.372 47.6002 29.2728 48.0204 29.2728C48.3648 29.2728 48.6654 29.3399 48.9223 29.4742C49.1849 29.6084 49.3892 29.7981 49.5352 30.0433V27.4166H50.4633V33.7207H49.6315L49.5352 33.0465C49.3951 33.2508 49.2024 33.4318 48.9573 33.5894C48.7121 33.747 48.3969 33.8258 48.0117 33.8258ZM48.178 33.0202C48.575 33.0202 48.8989 32.8831 49.1499 32.6087C49.4067 32.3344 49.5352 31.9812 49.5352 31.5493C49.5352 31.1115 49.4067 30.7584 49.1499 30.4898C48.8989 30.2155 48.575 30.0783 48.178 30.0783C47.7811 30.0783 47.4542 30.2155 47.1974 30.4898C46.9406 30.7584 46.8121 31.1115 46.8121 31.5493C46.8121 31.8353 46.8705 32.0892 46.9873 32.311C47.104 32.5328 47.2645 32.708 47.4688 32.8364C47.679 32.959 47.9154 33.0202 48.178 33.0202ZM53.6648 33.8258C53.2387 33.8258 52.8593 33.7324 52.5265 33.5456C52.1997 33.353 51.9428 33.0874 51.756 32.7488C51.5692 32.4103 51.4759 32.0163 51.4759 31.5668C51.4759 31.1115 51.5663 30.7117 51.7473 30.3673C51.9341 30.0229 52.1909 29.7544 52.5178 29.5617C52.8505 29.3691 53.2357 29.2728 53.6735 29.2728C54.0996 29.2728 54.4703 29.3691 54.7855 29.5617C55.1007 29.7485 55.3459 29.9995 55.521 30.3147C55.6961 30.6299 55.7837 30.9773 55.7837 31.3567C55.7837 31.415 55.7807 31.4792 55.7749 31.5493C55.7749 31.6135 55.772 31.6865 55.7661 31.7682H52.3864C52.4156 32.1885 52.5528 32.5095 52.798 32.7313C53.049 32.9473 53.3379 33.0553 53.6648 33.0553C53.9274 33.0553 54.1463 32.9969 54.3215 32.8802C54.5024 32.7576 54.6367 32.5941 54.7242 32.3898H55.6523C55.5356 32.7984 55.3021 33.1399 54.9519 33.4143C54.6075 33.6886 54.1784 33.8258 53.6648 33.8258ZM53.6648 30.0346C53.3554 30.0346 53.0811 30.1279 52.8417 30.3147C52.6024 30.4957 52.4565 30.77 52.404 31.1378H54.8556C54.838 30.7992 54.7184 30.5307 54.4966 30.3322C54.2748 30.1338 53.9975 30.0346 53.6648 30.0346ZM58.4803 33.8258C57.9316 33.8258 57.4792 33.6915 57.1231 33.423C56.7671 33.1545 56.5628 32.7984 56.5102 32.3548H57.4471C57.4938 32.5533 57.6047 32.7255 57.7798 32.8714C57.9549 33.0115 58.1855 33.0815 58.4715 33.0815C58.7517 33.0815 58.956 33.0232 59.0844 32.9064C59.2128 32.7897 59.277 32.6554 59.277 32.5037C59.277 32.2818 59.1866 32.133 59.0056 32.0571C58.8305 31.9754 58.5853 31.9024 58.2701 31.8382C58.025 31.7857 57.7798 31.7156 57.5347 31.6281C57.2953 31.5405 57.094 31.418 56.9305 31.2604C56.7729 31.0969 56.6941 30.878 56.6941 30.6037C56.6941 30.2243 56.84 29.9091 57.1319 29.6581C57.4238 29.4012 57.8324 29.2728 58.3577 29.2728C58.8422 29.2728 59.2333 29.3895 59.531 29.623C59.8345 29.8565 60.0125 30.1863 60.0651 30.6124H59.172C59.1428 30.4256 59.0552 30.2797 58.9093 30.1746C58.7692 30.0696 58.5795 30.017 58.3402 30.017C58.1067 30.017 57.9258 30.0667 57.7973 30.1659C57.6689 30.2593 57.6047 30.3819 57.6047 30.5336C57.6047 30.6854 57.6923 30.8051 57.8674 30.8926C58.0483 30.9802 58.2847 31.059 58.5766 31.129C58.8684 31.1932 59.137 31.2691 59.3821 31.3567C59.6331 31.4384 59.8345 31.561 59.9863 31.7244C60.138 31.8878 60.2139 32.1272 60.2139 32.4424C60.2197 32.8393 60.0651 33.1691 59.7499 33.4318C59.4405 33.6944 59.0173 33.8258 58.4803 33.8258ZM14.5032 44.7207V39.3447H12.6908V38.5917H17.235V39.3447H15.4313V44.7207H14.5032ZM17.6068 44.7207V40.3779H18.4386L18.5174 41.2009C18.6691 40.9149 18.8793 40.6902 19.1478 40.5267C19.4221 40.3574 19.7519 40.2728 20.1372 40.2728V41.2447H19.8833C19.6264 41.2447 19.3959 41.2885 19.1916 41.376C18.9931 41.4577 18.8326 41.6008 18.71 41.8051C18.5933 42.0035 18.5349 42.2808 18.5349 42.6368V44.7207H17.6068ZM22.4039 44.8258C22.0361 44.8258 21.7326 44.7645 21.4933 44.6419C21.254 44.5193 21.0759 44.3588 20.9592 44.1603C20.8425 43.956 20.7841 43.7342 20.7841 43.4949C20.7841 43.0746 20.9475 42.7419 21.2744 42.4968C21.6013 42.2516 22.0682 42.129 22.6753 42.129H23.8136V42.0502C23.8136 41.7117 23.7202 41.4577 23.5334 41.2885C23.3524 41.1192 23.116 41.0346 22.8242 41.0346C22.5673 41.0346 22.3426 41.0988 22.15 41.2272C21.9632 41.3498 21.8494 41.5336 21.8085 41.7788H20.8804C20.9096 41.4636 21.0146 41.1951 21.1956 40.9733C21.3824 40.7456 21.6159 40.5734 21.8961 40.4567C22.1821 40.3341 22.4944 40.2728 22.8329 40.2728C23.44 40.2728 23.9099 40.4333 24.2426 40.7544C24.5753 41.0696 24.7417 41.5015 24.7417 42.0502V44.7207H23.9361L23.8573 43.9765C23.7348 44.2158 23.5567 44.4172 23.3232 44.5806C23.0897 44.7441 22.7833 44.8258 22.4039 44.8258ZM22.5878 44.0728C22.8388 44.0728 23.0489 44.0144 23.2182 43.8977C23.3933 43.7751 23.5275 43.6146 23.6209 43.4161C23.7202 43.2176 23.7814 42.9987 23.8048 42.7594H22.7716C22.4039 42.7594 22.1412 42.8236 21.9836 42.9521C21.8318 43.0805 21.756 43.241 21.756 43.4336C21.756 43.6321 21.8289 43.7897 21.9749 43.9064C22.1266 44.0173 22.3309 44.0728 22.5878 44.0728ZM27.5595 44.7207C27.1334 44.7207 26.7948 44.6186 26.5438 44.4143C26.2928 44.2041 26.1673 43.8335 26.1673 43.3023V41.1571H25.4231V40.3779H26.1673L26.2812 39.2747H27.0954V40.3779H28.3212V41.1571H27.0954V43.3023C27.0954 43.5416 27.1451 43.708 27.2443 43.8014C27.3494 43.8889 27.5274 43.9327 27.7784 43.9327H28.2775V44.7207H27.5595ZM30.7492 44.8258C30.3814 44.8258 30.0779 44.7645 29.8386 44.6419C29.5992 44.5193 29.4212 44.3588 29.3045 44.1603C29.1877 43.956 29.1294 43.7342 29.1294 43.4949C29.1294 43.0746 29.2928 42.7419 29.6197 42.4968C29.9466 42.2516 30.4135 42.129 31.0206 42.129H32.1588V42.0502C32.1588 41.7117 32.0654 41.4577 31.8786 41.2885C31.6977 41.1192 31.4613 41.0346 31.1694 41.0346C30.9126 41.0346 30.6879 41.0988 30.4952 41.2272C30.3085 41.3498 30.1946 41.5336 30.1538 41.7788H29.2257C29.2549 41.4636 29.3599 41.1951 29.5409 40.9733C29.7277 40.7456 29.9611 40.5734 30.2413 40.4567C30.5274 40.3341 30.8396 40.2728 31.1782 40.2728C31.7853 40.2728 32.2551 40.4333 32.5879 40.7544C32.9206 41.0696 33.0869 41.5015 33.0869 42.0502V44.7207H32.2814L32.2026 43.9765C32.08 44.2158 31.902 44.4172 31.6685 44.5806C31.435 44.7441 31.1286 44.8258 30.7492 44.8258ZM30.933 44.0728C31.184 44.0728 31.3942 44.0144 31.5634 43.8977C31.7386 43.7751 31.8728 43.6146 31.9662 43.4161C32.0654 43.2176 32.1267 42.9987 32.1501 42.7594H31.1169C30.7492 42.7594 30.4865 42.8236 30.3289 42.9521C30.1771 43.0805 30.1012 43.241 30.1012 43.4336C30.1012 43.6321 30.1742 43.7897 30.3201 43.9064C30.4719 44.0173 30.6762 44.0728 30.933 44.0728ZM36.1479 44.8258C35.7276 44.8258 35.3569 44.7265 35.0359 44.5281C34.7149 44.3296 34.4639 44.0582 34.2829 43.7138C34.102 43.3694 34.0115 42.9783 34.0115 42.5405C34.0115 42.1027 34.102 41.7146 34.2829 41.376C34.4639 41.0316 34.7149 40.7631 35.0359 40.5705C35.3628 40.372 35.7364 40.2728 36.1566 40.2728C36.501 40.2728 36.8016 40.3399 37.0585 40.4742C37.3211 40.6084 37.5254 40.7981 37.6714 41.0433V38.4166H38.5995V44.7207H37.7677L37.6714 44.0465C37.5313 44.2508 37.3386 44.4318 37.0935 44.5894C36.8483 44.747 36.5331 44.8258 36.1479 44.8258ZM36.3142 44.0202C36.7112 44.0202 37.0351 43.8831 37.2861 43.6087C37.5429 43.3344 37.6714 42.9812 37.6714 42.5493C37.6714 42.1115 37.5429 41.7584 37.2861 41.4898C37.0351 41.2155 36.7112 41.0783 36.3142 41.0783C35.9173 41.0783 35.5904 41.2155 35.3336 41.4898C35.0768 41.7584 34.9483 42.1115 34.9483 42.5493C34.9483 42.8353 35.0067 43.0892 35.1235 43.311C35.2402 43.5328 35.4007 43.708 35.605 43.8364C35.8152 43.959 36.0516 44.0202 36.3142 44.0202ZM41.2406 44.8258C40.8729 44.8258 40.5693 44.7645 40.33 44.6419C40.0907 44.5193 39.9127 44.3588 39.7959 44.1603C39.6792 43.956 39.6208 43.7342 39.6208 43.4949C39.6208 43.0746 39.7842 42.7419 40.1111 42.4968C40.438 42.2516 40.905 42.129 41.512 42.129H42.6503V42.0502C42.6503 41.7117 42.5569 41.4577 42.3701 41.2885C42.1891 41.1192 41.9527 41.0346 41.6609 41.0346C41.4041 41.0346 41.1793 41.0988 40.9867 41.2272C40.7999 41.3498 40.6861 41.5336 40.6452 41.7788H39.7171C39.7463 41.4636 39.8514 41.1951 40.0323 40.9733C40.2191 40.7456 40.4526 40.5734 40.7328 40.4567C41.0188 40.3341 41.3311 40.2728 41.6696 40.2728C42.2767 40.2728 42.7466 40.4333 43.0793 40.7544C43.412 41.0696 43.5784 41.5015 43.5784 42.0502V44.7207H42.7729L42.6941 43.9765C42.5715 44.2158 42.3934 44.4172 42.16 44.5806C41.9265 44.7441 41.62 44.8258 41.2406 44.8258ZM41.4245 44.0728C41.6755 44.0728 41.8856 44.0144 42.0549 43.8977C42.23 43.7751 42.3643 43.6146 42.4577 43.4161C42.5569 43.2176 42.6182 42.9987 42.6415 42.7594H41.6084C41.2406 42.7594 40.9779 42.8236 40.8203 42.9521C40.6686 43.0805 40.5927 43.241 40.5927 43.4336C40.5927 43.6321 40.6657 43.7897 40.8116 43.9064C40.9633 44.0173 41.1676 44.0728 41.4245 44.0728ZM46.3942 44.8258C45.8455 44.8258 45.3931 44.6915 45.037 44.423C44.681 44.1545 44.4767 43.7984 44.4241 43.3548H45.361C45.4077 43.5533 45.5186 43.7255 45.6937 43.8714C45.8688 44.0115 46.0994 44.0815 46.3854 44.0815C46.6656 44.0815 46.8699 44.0232 46.9983 43.9064C47.1267 43.7897 47.1909 43.6554 47.1909 43.5037C47.1909 43.2818 47.1005 43.133 46.9195 43.0571C46.7444 42.9754 46.4992 42.9024 46.184 42.8382C45.9389 42.7857 45.6937 42.7156 45.4485 42.6281C45.2092 42.5405 45.0078 42.418 44.8444 42.2604C44.6868 42.0969 44.608 41.878 44.608 41.6037C44.608 41.2243 44.7539 40.9091 45.0458 40.6581C45.3376 40.4012 45.7462 40.2728 46.2716 40.2728C46.7561 40.2728 47.1471 40.3895 47.4448 40.623C47.7484 40.8565 47.9264 41.1863 47.9789 41.6124H47.0859C47.0567 41.4256 46.9691 41.2797 46.8232 41.1746C46.6831 41.0696 46.4934 41.017 46.2541 41.017C46.0206 41.017 45.8396 41.0667 45.7112 41.1659C45.5828 41.2593 45.5186 41.3819 45.5186 41.5336C45.5186 41.6854 45.6061 41.8051 45.7813 41.8926C45.9622 41.9802 46.1986 42.059 46.4905 42.129C46.7823 42.1932 47.0508 42.2691 47.296 42.3567C47.547 42.4384 47.7484 42.561 47.9001 42.7244C48.0519 42.8878 48.1278 43.1272 48.1278 43.4424C48.1336 43.8393 47.9789 44.1691 47.6637 44.4318C47.3544 44.6944 46.9312 44.8258 46.3942 44.8258Z" fill="#89868D"/>
<path d="M34.9042 6.08313C34.6653 5.92811 34.3464 5.99616 34.1917 6.23508L31.3049 10.6885L29.8971 9.38567C29.6881 9.19231 29.3624 9.20501 29.1692 9.41419C28.976 9.62317 28.9887 9.94958 29.1977 10.1427L31.0462 11.8532C31.0462 11.8532 31.0992 11.899 31.1238 11.9149C31.2103 11.9713 31.3075 11.9981 31.4037 11.9981C31.5723 11.9981 31.7377 11.9153 31.8364 11.763L35.056 6.79622C35.2109 6.55734 35.1429 6.23799 34.9042 6.08313Z" fill="white"/>
<path d="M167.873 6.08313C167.634 5.92811 167.315 5.99616 167.16 6.23508L164.274 10.6885L162.866 9.38567C162.657 9.19231 162.331 9.20501 162.138 9.41419C161.945 9.62317 161.957 9.94958 162.166 10.1427L164.015 11.8532C164.015 11.8532 164.068 11.899 164.093 11.9149C164.179 11.9713 164.276 11.9981 164.372 11.9981C164.541 11.9981 164.706 11.9153 164.805 11.763L168.025 6.79622C168.18 6.55734 168.112 6.23799 167.873 6.08313Z" fill="white"/>
<path d="M136.175 33.7207L138.434 27.5917H139.45L141.691 33.7207H140.711L140.185 32.2235H137.681L137.156 33.7207H136.175ZM137.944 31.488H139.922L138.933 28.6949L137.944 31.488ZM144.244 33.8258C143.696 33.8258 143.243 33.6915 142.887 33.423C142.531 33.1545 142.327 32.7984 142.274 32.3548H143.211C143.258 32.5533 143.369 32.7255 143.544 32.8714C143.719 33.0115 143.95 33.0815 144.236 33.0815C144.516 33.0815 144.72 33.0232 144.849 32.9064C144.977 32.7897 145.041 32.6554 145.041 32.5037C145.041 32.2818 144.951 32.133 144.77 32.0571C144.595 31.9754 144.35 31.9024 144.034 31.8382C143.789 31.7857 143.544 31.7156 143.299 31.6281C143.06 31.5405 142.858 31.418 142.695 31.2604C142.537 31.0969 142.458 30.878 142.458 30.6037C142.458 30.2243 142.604 29.9091 142.896 29.6581C143.188 29.4012 143.597 29.2728 144.122 29.2728C144.606 29.2728 144.997 29.3895 145.295 29.623C145.599 29.8565 145.777 30.1863 145.829 30.6124H144.936C144.907 30.4256 144.819 30.2797 144.673 30.1746C144.533 30.0696 144.344 30.017 144.104 30.017C143.871 30.017 143.69 30.0667 143.562 30.1659C143.433 30.2593 143.369 30.3819 143.369 30.5336C143.369 30.6854 143.456 30.8051 143.632 30.8926C143.813 30.9802 144.049 31.059 144.341 31.129C144.633 31.1932 144.901 31.2691 145.146 31.3567C145.397 31.4384 145.599 31.561 145.75 31.7244C145.902 31.8878 145.978 32.1272 145.978 32.4424C145.984 32.8393 145.829 33.1691 145.514 33.4318C145.205 33.6944 144.781 33.8258 144.244 33.8258ZM149.023 33.8258C148.596 33.8258 148.217 33.7324 147.884 33.5456C147.557 33.353 147.301 33.0874 147.114 32.7488C146.927 32.4103 146.834 32.0163 146.834 31.5668C146.834 31.1115 146.924 30.7117 147.105 30.3673C147.292 30.0229 147.549 29.7544 147.876 29.5617C148.208 29.3691 148.594 29.2728 149.031 29.2728C149.457 29.2728 149.828 29.3691 150.143 29.5617C150.459 29.7485 150.704 29.9995 150.879 30.3147C151.054 30.6299 151.141 30.9773 151.141 31.3567C151.141 31.415 151.139 31.4792 151.133 31.5493C151.133 31.6135 151.13 31.6865 151.124 31.7682H147.744C147.773 32.1885 147.911 32.5095 148.156 32.7313C148.407 32.9473 148.696 33.0553 149.023 33.0553C149.285 33.0553 149.504 32.9969 149.679 32.8802C149.86 32.7576 149.994 32.5941 150.082 32.3898H151.01C150.893 32.7984 150.66 33.1399 150.31 33.4143C149.965 33.6886 149.536 33.8258 149.023 33.8258ZM149.023 30.0346C148.713 30.0346 148.439 30.1279 148.2 30.3147C147.96 30.4957 147.814 30.77 147.762 31.1378H150.213C150.196 30.7992 150.076 30.5307 149.854 30.3322C149.633 30.1338 149.355 30.0346 149.023 30.0346ZM153.822 32.3898C153.594 32.3898 153.384 32.3636 153.192 32.311L152.815 32.6788C152.879 32.7196 152.958 32.7547 153.052 32.7838C153.145 32.813 153.276 32.8393 153.446 32.8626C153.615 32.886 153.845 32.9093 154.137 32.9327C154.715 32.9852 155.132 33.1253 155.389 33.353C155.646 33.5748 155.775 33.8725 155.775 34.246C155.775 34.5029 155.705 34.7451 155.564 34.9728C155.43 35.2063 155.217 35.393 154.925 35.5331C154.639 35.6791 154.271 35.752 153.822 35.752C153.215 35.752 152.722 35.6353 152.342 35.4018C151.969 35.1741 151.782 34.8268 151.782 34.3599C151.782 34.1789 151.829 33.998 151.922 33.817C152.021 33.6419 152.176 33.4755 152.386 33.3179C152.264 33.2654 152.156 33.21 152.062 33.1516C151.975 33.0874 151.896 33.0232 151.826 32.959V32.7488L152.579 31.9783C152.24 31.6865 152.071 31.3041 152.071 30.8313C152.071 30.5453 152.138 30.2855 152.272 30.0521C152.412 29.8127 152.614 29.623 152.876 29.4829C153.139 29.3429 153.454 29.2728 153.822 29.2728C154.067 29.2728 154.295 29.3078 154.505 29.3779H156.125V29.9908L155.354 30.0346C155.494 30.2739 155.564 30.5395 155.564 30.8313C155.564 31.1232 155.494 31.3858 155.354 31.6193C155.22 31.8528 155.022 32.0396 154.759 32.1797C154.502 32.3198 154.19 32.3898 153.822 32.3898ZM153.822 31.6631C154.091 31.6631 154.307 31.5931 154.47 31.453C154.639 31.307 154.724 31.1027 154.724 30.8401C154.724 30.5716 154.639 30.3673 154.47 30.2272C154.307 30.0871 154.091 30.017 153.822 30.017C153.548 30.017 153.326 30.0871 153.157 30.2272C152.993 30.3673 152.911 30.5716 152.911 30.8401C152.911 31.1027 152.993 31.307 153.157 31.453C153.326 31.5931 153.548 31.6631 153.822 31.6631ZM152.658 34.2723C152.658 34.5233 152.768 34.7101 152.99 34.8327C153.212 34.9611 153.489 35.0253 153.822 35.0253C154.143 35.0253 154.403 34.9553 154.601 34.8152C154.8 34.6809 154.899 34.5 154.899 34.2723C154.899 34.103 154.832 33.9571 154.698 33.8345C154.563 33.7178 154.309 33.6448 153.936 33.6156C153.656 33.5981 153.408 33.5719 153.192 33.5368C152.987 33.6477 152.847 33.7674 152.771 33.8958C152.695 34.0242 152.658 34.1497 152.658 34.2723ZM158.555 33.8258C158.03 33.8258 157.615 33.6623 157.312 33.3355C157.014 33.0086 156.865 32.5212 156.865 31.8733V29.3779H157.793V31.7769C157.793 32.6175 158.138 33.0378 158.826 33.0378C159.171 33.0378 159.454 32.9152 159.676 32.67C159.897 32.4249 160.008 32.0746 160.008 31.6193V29.3779H160.936V33.7207H160.113L160.043 32.959C159.909 33.2275 159.711 33.4405 159.448 33.5981C159.191 33.7499 158.893 33.8258 158.555 33.8258ZM162.117 33.7207V29.3779H162.949L163.028 30.2009C163.179 29.9149 163.39 29.6902 163.658 29.5267C163.932 29.3574 164.262 29.2728 164.647 29.2728V30.2447H164.394C164.137 30.2447 163.906 30.2885 163.702 30.376C163.503 30.4577 163.343 30.6008 163.22 30.8051C163.104 31.0035 163.045 31.2808 163.045 31.6368V33.7207H162.117ZM166.914 33.8258C166.546 33.8258 166.243 33.7645 166.004 33.6419C165.764 33.5193 165.586 33.3588 165.47 33.1603C165.353 32.956 165.294 32.7342 165.294 32.4949C165.294 32.0746 165.458 31.7419 165.785 31.4968C166.112 31.2516 166.579 31.129 167.186 31.129H168.324V31.0502C168.324 30.7117 168.23 30.4577 168.044 30.2885C167.863 30.1192 167.626 30.0346 167.334 30.0346C167.078 30.0346 166.853 30.0988 166.66 30.2272C166.473 30.3498 166.36 30.5336 166.319 30.7788H165.391C165.42 30.4636 165.525 30.1951 165.706 29.9733C165.893 29.7456 166.126 29.5734 166.406 29.4567C166.692 29.3341 167.005 29.2728 167.343 29.2728C167.95 29.2728 168.42 29.4333 168.753 29.7544C169.086 30.0696 169.252 30.5015 169.252 31.0502V33.7207H168.446L168.368 32.9765C168.245 33.2158 168.067 33.4172 167.834 33.5806C167.6 33.7441 167.294 33.8258 166.914 33.8258ZM167.098 33.0728C167.349 33.0728 167.559 33.0144 167.728 32.8977C167.904 32.7751 168.038 32.6146 168.131 32.4161C168.23 32.2176 168.292 31.9987 168.315 31.7594H167.282C166.914 31.7594 166.652 31.8236 166.494 31.9521C166.342 32.0805 166.266 32.241 166.266 32.4336C166.266 32.6321 166.339 32.7897 166.485 32.9064C166.637 33.0173 166.841 33.0728 167.098 33.0728ZM172.313 33.8258C171.893 33.8258 171.522 33.7265 171.201 33.5281C170.88 33.3296 170.629 33.0582 170.448 32.7138C170.267 32.3694 170.177 31.9783 170.177 31.5405C170.177 31.1027 170.267 30.7146 170.448 30.376C170.629 30.0316 170.88 29.7631 171.201 29.5705C171.528 29.372 171.901 29.2728 172.322 29.2728C172.666 29.2728 172.967 29.3399 173.223 29.4742C173.486 29.6084 173.69 29.7981 173.836 30.0433V27.4166H174.764V33.7207H173.933L173.836 33.0465C173.696 33.2508 173.504 33.4318 173.259 33.5894C173.013 33.747 172.698 33.8258 172.313 33.8258ZM172.479 33.0202C172.876 33.0202 173.2 32.8831 173.451 32.6087C173.708 32.3344 173.836 31.9812 173.836 31.5493C173.836 31.1115 173.708 30.7584 173.451 30.4898C173.2 30.2155 172.876 30.0783 172.479 30.0783C172.082 30.0783 171.755 30.2155 171.499 30.4898C171.242 30.7584 171.113 31.1115 171.113 31.5493C171.113 31.8353 171.172 32.0892 171.288 32.311C171.405 32.5328 171.566 32.708 171.77 32.8364C171.98 32.959 172.217 33.0202 172.479 33.0202ZM177.966 33.8258C177.552 33.8258 177.178 33.7324 176.845 33.5456C176.518 33.353 176.259 33.0874 176.066 32.7488C175.873 32.4044 175.777 32.0046 175.777 31.5493C175.777 31.094 175.873 30.6971 176.066 30.3585C176.264 30.0141 176.53 29.7485 176.863 29.5617C177.196 29.3691 177.566 29.2728 177.975 29.2728C178.389 29.2728 178.76 29.3691 179.087 29.5617C179.419 29.7485 179.682 30.0141 179.875 30.3585C180.073 30.6971 180.172 31.094 180.172 31.5493C180.172 32.0046 180.073 32.4044 179.875 32.7488C179.682 33.0874 179.419 33.353 179.087 33.5456C178.754 33.7324 178.38 33.8258 177.966 33.8258ZM177.966 33.029C178.188 33.029 178.392 32.9736 178.579 32.8626C178.772 32.7517 178.926 32.5883 179.043 32.3723C179.16 32.1505 179.218 31.8762 179.218 31.5493C179.218 31.2224 179.16 30.951 179.043 30.735C178.932 30.5132 178.78 30.3468 178.588 30.2359C178.401 30.125 178.197 30.0696 177.975 30.0696C177.753 30.0696 177.546 30.125 177.353 30.2359C177.166 30.3468 177.015 30.5132 176.898 30.735C176.781 30.951 176.723 31.2224 176.723 31.5493C176.723 31.8762 176.781 32.1505 176.898 32.3723C177.015 32.5883 177.166 32.7517 177.353 32.8626C177.54 32.9736 177.744 33.029 177.966 33.029ZM181.176 33.7207V29.3779H182.008L182.087 30.2009C182.238 29.9149 182.449 29.6902 182.717 29.5267C182.991 29.3574 183.321 29.2728 183.707 29.2728V30.2447H183.453C183.196 30.2447 182.965 30.2885 182.761 30.376C182.562 30.4577 182.402 30.6008 182.279 30.8051C182.163 31.0035 182.104 31.2808 182.104 31.6368V33.7207H181.176ZM185.973 33.8258C185.605 33.8258 185.302 33.7645 185.063 33.6419C184.823 33.5193 184.645 33.3588 184.529 33.1603C184.412 32.956 184.353 32.7342 184.353 32.4949C184.353 32.0746 184.517 31.7419 184.844 31.4968C185.171 31.2516 185.638 31.129 186.245 31.129H187.383V31.0502C187.383 30.7117 187.29 30.4577 187.103 30.2885C186.922 30.1192 186.685 30.0346 186.394 30.0346C186.137 30.0346 185.912 30.0988 185.719 30.2272C185.533 30.3498 185.419 30.5336 185.378 30.7788H184.45C184.479 30.4636 184.584 30.1951 184.765 29.9733C184.952 29.7456 185.185 29.5734 185.465 29.4567C185.751 29.3341 186.064 29.2728 186.402 29.2728C187.009 29.2728 187.479 29.4333 187.812 29.7544C188.145 30.0696 188.311 30.5015 188.311 31.0502V33.7207H187.505L187.427 32.9765C187.304 33.2158 187.126 33.4172 186.893 33.5806C186.659 33.7441 186.353 33.8258 185.973 33.8258ZM186.157 33.0728C186.408 33.0728 186.618 33.0144 186.788 32.8977C186.963 32.7751 187.097 32.6146 187.19 32.4161C187.29 32.2176 187.351 31.9987 187.374 31.7594H186.341C185.973 31.7594 185.711 31.8236 185.553 31.9521C185.401 32.0805 185.325 32.241 185.325 32.4336C185.325 32.6321 185.398 32.7897 185.544 32.9064C185.696 33.0173 185.9 33.0728 186.157 33.0728ZM191.127 33.8258C190.578 33.8258 190.126 33.6915 189.77 33.423C189.414 33.1545 189.209 32.7984 189.157 32.3548H190.094C190.14 32.5533 190.251 32.7255 190.426 32.8714C190.601 33.0115 190.832 33.0815 191.118 33.0815C191.398 33.0815 191.603 33.0232 191.731 32.9064C191.859 32.7897 191.924 32.6554 191.924 32.5037C191.924 32.2818 191.833 32.133 191.652 32.0571C191.477 31.9754 191.232 31.9024 190.917 31.8382C190.671 31.7857 190.426 31.7156 190.181 31.6281C189.942 31.5405 189.74 31.418 189.577 31.2604C189.419 31.0969 189.341 30.878 189.341 30.6037C189.341 30.2243 189.487 29.9091 189.778 29.6581C190.07 29.4012 190.479 29.2728 191.004 29.2728C191.489 29.2728 191.88 29.3895 192.177 29.623C192.481 29.8565 192.659 30.1863 192.712 30.6124H191.818C191.789 30.4256 191.702 30.2797 191.556 30.1746C191.416 30.0696 191.226 30.017 190.987 30.017C190.753 30.017 190.572 30.0667 190.444 30.1659C190.315 30.2593 190.251 30.3819 190.251 30.5336C190.251 30.6854 190.339 30.8051 190.514 30.8926C190.695 30.9802 190.931 31.059 191.223 31.129C191.515 31.1932 191.783 31.2691 192.029 31.3567C192.28 31.4384 192.481 31.561 192.633 31.7244C192.785 31.8878 192.86 32.1272 192.86 32.4424C192.866 32.8393 192.712 33.1691 192.396 33.4318C192.087 33.6944 191.664 33.8258 191.127 33.8258ZM142.434 44.7207L144.693 38.5917H145.709L147.95 44.7207H146.969L146.444 43.2235H143.94L143.415 44.7207H142.434ZM144.203 42.488H146.181L145.192 39.6949L144.203 42.488ZM150.605 44.8258C150.179 44.8258 149.797 44.7295 149.458 44.5368C149.125 44.3442 148.863 44.0786 148.67 43.7401C148.483 43.3957 148.39 42.9987 148.39 42.5493C148.39 42.0998 148.483 41.7058 148.67 41.3673C148.863 41.0229 149.125 40.7544 149.458 40.5617C149.797 40.3691 150.179 40.2728 150.605 40.2728C151.142 40.2728 151.592 40.4129 151.953 40.6931C152.321 40.9733 152.558 41.3527 152.663 41.8313H151.691C151.632 41.592 151.504 41.4052 151.306 41.271C151.107 41.1367 150.874 41.0696 150.605 41.0696C150.377 41.0696 150.167 41.1279 149.975 41.2447C149.782 41.3556 149.627 41.522 149.511 41.7438C149.394 41.9597 149.335 42.2282 149.335 42.5493C149.335 42.8703 149.394 43.1418 149.511 43.3636C149.627 43.5795 149.782 43.7459 149.975 43.8626C150.167 43.9794 150.377 44.0378 150.605 44.0378C150.874 44.0378 151.107 43.9706 151.306 43.8364C151.504 43.7021 151.632 43.5124 151.691 43.2673H152.663C152.563 43.7342 152.33 44.1107 151.962 44.3967C151.594 44.6828 151.142 44.8258 150.605 44.8258ZM155.701 44.8258C155.274 44.8258 154.895 44.7324 154.562 44.5456C154.235 44.353 153.979 44.0874 153.792 43.7488C153.605 43.4103 153.512 43.0163 153.512 42.5668C153.512 42.1115 153.602 41.7117 153.783 41.3673C153.97 41.0229 154.227 40.7544 154.554 40.5617C154.886 40.3691 155.272 40.2728 155.709 40.2728C156.135 40.2728 156.506 40.3691 156.821 40.5617C157.136 40.7485 157.382 40.9995 157.557 41.3147C157.732 41.6299 157.819 41.9773 157.819 42.3567C157.819 42.415 157.816 42.4792 157.811 42.5493C157.811 42.6135 157.808 42.6865 157.802 42.7682H154.422C154.451 43.1885 154.589 43.5095 154.834 43.7313C155.085 43.9473 155.374 44.0553 155.701 44.0553C155.963 44.0553 156.182 43.9969 156.357 43.8802C156.538 43.7576 156.672 43.5941 156.76 43.3898H157.688C157.571 43.7984 157.338 44.1399 156.988 44.4143C156.643 44.6886 156.214 44.8258 155.701 44.8258ZM155.701 41.0346C155.391 41.0346 155.117 41.1279 154.877 41.3147C154.638 41.4957 154.492 41.77 154.44 42.1378H156.891C156.874 41.7992 156.754 41.5307 156.532 41.3322C156.311 41.1338 156.033 41.0346 155.701 41.0346ZM158.782 46.647V40.3779H159.614L159.711 41.0521C159.851 40.8478 160.043 40.6668 160.288 40.5092C160.534 40.3516 160.849 40.2728 161.234 40.2728C161.654 40.2728 162.025 40.372 162.346 40.5705C162.667 40.769 162.918 41.0404 163.099 41.3848C163.286 41.7292 163.379 42.1203 163.379 42.558C163.379 42.9958 163.286 43.3869 163.099 43.7313C162.918 44.0699 162.667 44.3384 162.346 44.5368C162.025 44.7295 161.651 44.8258 161.225 44.8258C160.887 44.8258 160.586 44.7586 160.323 44.6244C160.067 44.4901 159.862 44.3004 159.711 44.0553V46.647H158.782ZM161.068 44.0202C161.465 44.0202 161.791 43.886 162.048 43.6175C162.305 43.3431 162.434 42.9871 162.434 42.5493C162.434 42.2633 162.375 42.0094 162.258 41.7875C162.142 41.5657 161.981 41.3935 161.777 41.271C161.573 41.1425 161.336 41.0783 161.068 41.0783C160.671 41.0783 160.344 41.2155 160.087 41.4898C159.836 41.7642 159.711 42.1173 159.711 42.5493C159.711 42.9871 159.836 43.3431 160.087 43.6175C160.344 43.886 160.671 44.0202 161.068 44.0202ZM166.033 44.7207C165.607 44.7207 165.268 44.6186 165.017 44.4143C164.766 44.2041 164.641 43.8335 164.641 43.3023V41.1571H163.897V40.3779H164.641L164.755 39.2747H165.569V40.3779H166.795V41.1571H165.569V43.3023C165.569 43.5416 165.619 43.708 165.718 43.8014C165.823 43.8889 166.001 43.9327 166.252 43.9327H166.751V44.7207H166.033ZM169.223 44.8258C168.855 44.8258 168.552 44.7645 168.312 44.6419C168.073 44.5193 167.895 44.3588 167.778 44.1603C167.661 43.956 167.603 43.7342 167.603 43.4949C167.603 43.0746 167.766 42.7419 168.093 42.4968C168.42 42.2516 168.887 42.129 169.494 42.129H170.632V42.0502C170.632 41.7117 170.539 41.4577 170.352 41.2885C170.171 41.1192 169.935 41.0346 169.643 41.0346C169.386 41.0346 169.162 41.0988 168.969 41.2272C168.782 41.3498 168.668 41.5336 168.627 41.7788H167.699C167.729 41.4636 167.834 41.1951 168.015 40.9733C168.201 40.7456 168.435 40.5734 168.715 40.4567C169.001 40.3341 169.313 40.2728 169.652 40.2728C170.259 40.2728 170.729 40.4333 171.062 40.7544C171.394 41.0696 171.561 41.5015 171.561 42.0502V44.7207H170.755L170.676 43.9765C170.554 44.2158 170.376 44.4172 170.142 44.5806C169.909 44.7441 169.602 44.8258 169.223 44.8258ZM169.407 44.0728C169.658 44.0728 169.868 44.0144 170.037 43.8977C170.212 43.7751 170.346 43.6146 170.44 43.4161C170.539 43.2176 170.6 42.9987 170.624 42.7594H169.591C169.223 42.7594 168.96 42.8236 168.803 42.9521C168.651 43.0805 168.575 43.241 168.575 43.4336C168.575 43.6321 168.648 43.7897 168.794 43.9064C168.946 44.0173 169.15 44.0728 169.407 44.0728ZM174.622 44.8258C174.201 44.8258 173.831 44.7265 173.51 44.5281C173.189 44.3296 172.938 44.0582 172.757 43.7138C172.576 43.3694 172.485 42.9783 172.485 42.5405C172.485 42.1027 172.576 41.7146 172.757 41.376C172.938 41.0316 173.189 40.7631 173.51 40.5705C173.836 40.372 174.21 40.2728 174.63 40.2728C174.975 40.2728 175.275 40.3399 175.532 40.4742C175.795 40.6084 175.999 40.7981 176.145 41.0433V38.4166H177.073V44.7207H176.241L176.145 44.0465C176.005 44.2508 175.812 44.4318 175.567 44.5894C175.322 44.747 175.007 44.8258 174.622 44.8258ZM174.788 44.0202C175.185 44.0202 175.509 43.8831 175.76 43.6087C176.017 43.3344 176.145 42.9812 176.145 42.5493C176.145 42.1115 176.017 41.7584 175.76 41.4898C175.509 41.2155 175.185 41.0783 174.788 41.0783C174.391 41.0783 174.064 41.2155 173.807 41.4898C173.55 41.7584 173.422 42.1115 173.422 42.5493C173.422 42.8353 173.48 43.0892 173.597 43.311C173.714 43.5328 173.874 43.708 174.079 43.8364C174.289 43.959 174.525 44.0202 174.788 44.0202ZM179.714 44.8258C179.347 44.8258 179.043 44.7645 178.804 44.6419C178.564 44.5193 178.386 44.3588 178.27 44.1603C178.153 43.956 178.094 43.7342 178.094 43.4949C178.094 43.0746 178.258 42.7419 178.585 42.4968C178.912 42.2516 179.379 42.129 179.986 42.129H181.124V42.0502C181.124 41.7117 181.031 41.4577 180.844 41.2885C180.663 41.1192 180.426 41.0346 180.135 41.0346C179.878 41.0346 179.653 41.0988 179.46 41.2272C179.274 41.3498 179.16 41.5336 179.119 41.7788H178.191C178.22 41.4636 178.325 41.1951 178.506 40.9733C178.693 40.7456 178.926 40.5734 179.206 40.4567C179.492 40.3341 179.805 40.2728 180.143 40.2728C180.75 40.2728 181.22 40.4333 181.553 40.7544C181.886 41.0696 182.052 41.5015 182.052 42.0502V44.7207H181.247L181.168 43.9765C181.045 44.2158 180.867 44.4172 180.634 44.5806C180.4 44.7441 180.094 44.8258 179.714 44.8258ZM179.898 44.0728C180.149 44.0728 180.359 44.0144 180.529 43.8977C180.704 43.7751 180.838 43.6146 180.931 43.4161C181.031 43.2176 181.092 42.9987 181.115 42.7594H180.082C179.714 42.7594 179.452 42.8236 179.294 42.9521C179.142 43.0805 179.066 43.241 179.066 43.4336C179.066 43.6321 179.139 43.7897 179.285 43.9064C179.437 44.0173 179.641 44.0728 179.898 44.0728ZM184.868 44.8258C184.319 44.8258 183.867 44.6915 183.511 44.423C183.155 44.1545 182.95 43.7984 182.898 43.3548H183.835C183.881 43.5533 183.992 43.7255 184.167 43.8714C184.342 44.0115 184.573 44.0815 184.859 44.0815C185.139 44.0815 185.344 44.0232 185.472 43.9064C185.6 43.7897 185.665 43.6554 185.665 43.5037C185.665 43.2818 185.574 43.133 185.393 43.0571C185.218 42.9754 184.973 42.9024 184.658 42.8382C184.413 42.7857 184.167 42.7156 183.922 42.6281C183.683 42.5405 183.482 42.418 183.318 42.2604C183.16 42.0969 183.082 41.878 183.082 41.6037C183.082 41.2243 183.228 40.9091 183.519 40.6581C183.811 40.4012 184.22 40.2728 184.745 40.2728C185.23 40.2728 185.621 40.3895 185.919 40.623C186.222 40.8565 186.4 41.1863 186.453 41.6124H185.56C185.53 41.4256 185.443 41.2797 185.297 41.1746C185.157 41.0696 184.967 41.017 184.728 41.017C184.494 41.017 184.313 41.0667 184.185 41.1659C184.056 41.2593 183.992 41.3819 183.992 41.5336C183.992 41.6854 184.08 41.8051 184.255 41.8926C184.436 41.9802 184.672 42.059 184.964 42.129C185.256 42.1932 185.524 42.2691 185.77 42.3567C186.021 42.4384 186.222 42.561 186.374 42.7244C186.526 42.8878 186.601 43.1272 186.601 43.4424C186.607 43.8393 186.453 44.1691 186.137 44.4318C185.828 44.6944 185.405 44.8258 184.868 44.8258Z" fill="#89868D"/>
<path d="M271.835 33.7207V27.5917H272.763V33.7207H271.835ZM273.972 33.7207V29.3779H274.795L274.874 29.9908C275.014 29.769 275.198 29.5938 275.425 29.4654C275.659 29.337 275.927 29.2728 276.231 29.2728C276.92 29.2728 277.398 29.5442 277.667 30.0871C277.824 29.8361 278.034 29.6376 278.297 29.4917C278.566 29.3458 278.855 29.2728 279.164 29.2728C279.707 29.2728 280.133 29.4362 280.442 29.7631C280.752 30.09 280.906 30.5774 280.906 31.2253V33.7207H279.978V31.3216C279.978 30.4811 279.657 30.0608 279.015 30.0608C278.688 30.0608 278.42 30.1834 278.21 30.4286C278.005 30.6737 277.903 31.0239 277.903 31.4792V33.7207H276.975V31.3216C276.975 30.4811 276.651 30.0608 276.003 30.0608C275.682 30.0608 275.417 30.1834 275.206 30.4286C275.002 30.6737 274.9 31.0239 274.9 31.4792V33.7207H273.972ZM283.463 33.8258C283.095 33.8258 282.792 33.7645 282.553 33.6419C282.313 33.5193 282.135 33.3588 282.018 33.1603C281.902 32.956 281.843 32.7342 281.843 32.4949C281.843 32.0746 282.007 31.7419 282.334 31.4968C282.661 31.2516 283.127 31.129 283.735 31.129H284.873V31.0502C284.873 30.7117 284.779 30.4577 284.593 30.2885C284.412 30.1192 284.175 30.0346 283.883 30.0346C283.627 30.0346 283.402 30.0988 283.209 30.2272C283.022 30.3498 282.909 30.5336 282.868 30.7788H281.94C281.969 30.4636 282.074 30.1951 282.255 29.9733C282.442 29.7456 282.675 29.5734 282.955 29.4567C283.241 29.3341 283.554 29.2728 283.892 29.2728C284.499 29.2728 284.969 29.4333 285.302 29.7544C285.635 30.0696 285.801 30.5015 285.801 31.0502V33.7207H284.995L284.917 32.9765C284.794 33.2158 284.616 33.4172 284.382 33.5806C284.149 33.7441 283.843 33.8258 283.463 33.8258ZM283.647 33.0728C283.898 33.0728 284.108 33.0144 284.277 32.8977C284.453 32.7751 284.587 32.6146 284.68 32.4161C284.779 32.2176 284.841 31.9987 284.864 31.7594H283.831C283.463 31.7594 283.2 31.8236 283.043 31.9521C282.891 32.0805 282.815 32.241 282.815 32.4336C282.815 32.6321 282.888 32.7897 283.034 32.9064C283.186 33.0173 283.39 33.0728 283.647 33.0728ZM288.66 32.3898C288.433 32.3898 288.223 32.3636 288.03 32.311L287.654 32.6788C287.718 32.7196 287.797 32.7547 287.89 32.7838C287.983 32.813 288.115 32.8393 288.284 32.8626C288.453 32.886 288.684 32.9093 288.976 32.9327C289.554 32.9852 289.971 33.1253 290.228 33.353C290.485 33.5748 290.613 33.8725 290.613 34.246C290.613 34.5029 290.543 34.7451 290.403 34.9728C290.269 35.2063 290.056 35.393 289.764 35.5331C289.478 35.6791 289.11 35.752 288.66 35.752C288.053 35.752 287.56 35.6353 287.181 35.4018C286.807 35.1741 286.62 34.8268 286.62 34.3599C286.62 34.1789 286.667 33.998 286.76 33.817C286.86 33.6419 287.014 33.4755 287.225 33.3179C287.102 33.2654 286.994 33.21 286.901 33.1516C286.813 33.0874 286.734 33.0232 286.664 32.959V32.7488L287.417 31.9783C287.079 31.6865 286.909 31.3041 286.909 30.8313C286.909 30.5453 286.976 30.2855 287.111 30.0521C287.251 29.8127 287.452 29.623 287.715 29.4829C287.978 29.3429 288.293 29.2728 288.66 29.2728C288.906 29.2728 289.133 29.3078 289.343 29.3779H290.963V29.9908L290.193 30.0346C290.333 30.2739 290.403 30.5395 290.403 30.8313C290.403 31.1232 290.333 31.3858 290.193 31.6193C290.058 31.8528 289.86 32.0396 289.597 32.1797C289.34 32.3198 289.028 32.3898 288.66 32.3898ZM288.66 31.6631C288.929 31.6631 289.145 31.5931 289.308 31.453C289.478 31.307 289.562 31.1027 289.562 30.8401C289.562 30.5716 289.478 30.3673 289.308 30.2272C289.145 30.0871 288.929 30.017 288.66 30.017C288.386 30.017 288.164 30.0871 287.995 30.2272C287.832 30.3673 287.75 30.5716 287.75 30.8401C287.75 31.1027 287.832 31.307 287.995 31.453C288.164 31.5931 288.386 31.6631 288.66 31.6631ZM287.496 34.2723C287.496 34.5233 287.607 34.7101 287.829 34.8327C288.05 34.9611 288.328 35.0253 288.66 35.0253C288.981 35.0253 289.241 34.9553 289.44 34.8152C289.638 34.6809 289.737 34.5 289.737 34.2723C289.737 34.103 289.67 33.9571 289.536 33.8345C289.402 33.7178 289.148 33.6448 288.774 33.6156C288.494 33.5981 288.246 33.5719 288.03 33.5368C287.826 33.6477 287.686 33.7674 287.61 33.8958C287.534 34.0242 287.496 34.1497 287.496 34.2723ZM293.651 33.8258C293.225 33.8258 292.846 33.7324 292.513 33.5456C292.186 33.353 291.929 33.0874 291.743 32.7488C291.556 32.4103 291.462 32.0163 291.462 31.5668C291.462 31.1115 291.553 30.7117 291.734 30.3673C291.921 30.0229 292.177 29.7544 292.504 29.5617C292.837 29.3691 293.222 29.2728 293.66 29.2728C294.086 29.2728 294.457 29.3691 294.772 29.5617C295.087 29.7485 295.332 29.9995 295.508 30.3147C295.683 30.6299 295.77 30.9773 295.77 31.3567C295.77 31.415 295.767 31.4792 295.761 31.5493C295.761 31.6135 295.759 31.6865 295.753 31.7682H292.373C292.402 32.1885 292.539 32.5095 292.785 32.7313C293.036 32.9473 293.324 33.0553 293.651 33.0553C293.914 33.0553 294.133 32.9969 294.308 32.8802C294.489 32.7576 294.623 32.5941 294.711 32.3898H295.639C295.522 32.7984 295.289 33.1399 294.938 33.4143C294.594 33.6886 294.165 33.8258 293.651 33.8258ZM293.651 30.0346C293.342 30.0346 293.068 30.1279 292.828 30.3147C292.589 30.4957 292.443 30.77 292.391 31.1378H294.842C294.825 30.7992 294.705 30.5307 294.483 30.3322C294.261 30.1338 293.984 30.0346 293.651 30.0346ZM296.733 33.7207V29.3779H297.556L297.626 30.1396C297.761 29.8711 297.956 29.661 298.213 29.5092C298.476 29.3516 298.776 29.2728 299.115 29.2728C299.64 29.2728 300.052 29.4362 300.349 29.7631C300.653 30.09 300.805 30.5774 300.805 31.2253V33.7207H299.885V31.3216C299.885 30.4811 299.541 30.0608 298.852 30.0608C298.508 30.0608 298.222 30.1834 297.994 30.4286C297.772 30.6737 297.661 31.0239 297.661 31.4792V33.7207H296.733ZM304.139 33.7207V27.5917H306.126C306.844 27.5917 307.434 27.7172 307.895 27.9682C308.362 28.2192 308.706 28.5753 308.928 29.0364C309.156 29.4917 309.27 30.0346 309.27 30.665C309.27 31.2895 309.156 31.8324 308.928 32.2935C308.706 32.7488 308.362 33.102 307.895 33.353C307.434 33.5981 306.844 33.7207 306.126 33.7207H304.139ZM305.067 32.9327H306.091C306.646 32.9327 307.084 32.8422 307.405 32.6613C307.732 32.4803 307.965 32.2206 308.105 31.882C308.251 31.5435 308.324 31.1378 308.324 30.665C308.324 30.1922 308.251 29.7836 308.105 29.4392C307.965 29.0948 307.732 28.8321 307.405 28.6512C307.084 28.4644 306.646 28.371 306.091 28.371H305.067V32.9327ZM312.291 33.8258C311.865 33.8258 311.486 33.7324 311.153 33.5456C310.826 33.353 310.569 33.0874 310.383 32.7488C310.196 32.4103 310.102 32.0163 310.102 31.5668C310.102 31.1115 310.193 30.7117 310.374 30.3673C310.561 30.0229 310.818 29.7544 311.144 29.5617C311.477 29.3691 311.862 29.2728 312.3 29.2728C312.726 29.2728 313.097 29.3691 313.412 29.5617C313.727 29.7485 313.973 29.9995 314.148 30.3147C314.323 30.6299 314.41 30.9773 314.41 31.3567C314.41 31.415 314.407 31.4792 314.402 31.5493C314.402 31.6135 314.399 31.6865 314.393 31.7682H311.013C311.042 32.1885 311.179 32.5095 311.425 32.7313C311.676 32.9473 311.965 33.0553 312.291 33.0553C312.554 33.0553 312.773 32.9969 312.948 32.8802C313.129 32.7576 313.263 32.5941 313.351 32.3898H314.279C314.162 32.7984 313.929 33.1399 313.578 33.4143C313.234 33.6886 312.805 33.8258 312.291 33.8258ZM312.291 30.0346C311.982 30.0346 311.708 30.1279 311.468 30.3147C311.229 30.4957 311.083 30.77 311.031 31.1378H313.482C313.465 30.7992 313.345 30.5307 313.123 30.3322C312.901 30.1338 312.624 30.0346 312.291 30.0346ZM283.31 44.7207V38.5917H285.455C285.934 38.5917 286.33 38.6734 286.646 38.8369C286.961 38.9945 287.194 39.2134 287.346 39.4936C287.504 39.7679 287.583 40.0802 287.583 40.4304C287.583 40.7631 287.507 41.0696 287.355 41.3498C287.209 41.6241 286.978 41.843 286.663 42.0064C286.348 42.1699 285.945 42.2516 285.455 42.2516H284.238V44.7207H283.31ZM284.238 41.4898H285.411C285.849 41.4898 286.161 41.3965 286.348 41.2097C286.541 41.017 286.637 40.7573 286.637 40.4304C286.637 40.0919 286.541 39.8292 286.348 39.6424C286.161 39.4498 285.849 39.3535 285.411 39.3535H284.238V41.4898ZM290.257 44.8258C289.831 44.8258 289.451 44.7324 289.119 44.5456C288.792 44.353 288.535 44.0874 288.348 43.7488C288.161 43.4103 288.068 43.0163 288.068 42.5668C288.068 42.1115 288.158 41.7117 288.339 41.3673C288.526 41.0229 288.783 40.7544 289.11 40.5617C289.443 40.3691 289.828 40.2728 290.266 40.2728C290.692 40.2728 291.062 40.3691 291.378 40.5617C291.693 40.7485 291.938 40.9995 292.113 41.3147C292.288 41.6299 292.376 41.9773 292.376 42.3567C292.376 42.415 292.373 42.4792 292.367 42.5493C292.367 42.6135 292.364 42.6865 292.358 42.7682H288.978C289.008 43.1885 289.145 43.5095 289.39 43.7313C289.641 43.9473 289.93 44.0553 290.257 44.0553C290.519 44.0553 290.738 43.9969 290.913 43.8802C291.094 43.7576 291.229 43.5941 291.316 43.3898H292.244C292.128 43.7984 291.894 44.1399 291.544 44.4143C291.199 44.6886 290.77 44.8258 290.257 44.8258ZM290.257 41.0346C289.947 41.0346 289.673 41.1279 289.434 41.3147C289.194 41.4957 289.049 41.77 288.996 42.1378H291.448C291.43 41.7992 291.31 41.5307 291.089 41.3322C290.867 41.1338 290.59 41.0346 290.257 41.0346ZM293.339 44.7207V40.3779H294.17L294.249 41.2009C294.401 40.9149 294.611 40.6902 294.88 40.5267C295.154 40.3574 295.484 40.2728 295.869 40.2728V41.2447H295.615C295.358 41.2447 295.128 41.2885 294.923 41.376C294.725 41.4577 294.564 41.6008 294.442 41.8051C294.325 42.0035 294.267 42.2808 294.267 42.6368V44.7207H293.339ZM296.884 44.7207V41.1571H296.262V40.3779H296.884V39.7475C296.884 39.2747 297 38.9361 297.234 38.7318C297.473 38.5217 297.809 38.4166 298.241 38.4166H298.696V39.2046H298.381C298.177 39.2046 298.031 39.2484 297.943 39.3359C297.856 39.4177 297.812 39.5578 297.812 39.7562V40.3779H300.561V44.7207H299.633V41.1571H297.812V44.7207H296.884ZM300.106 39.6512C299.931 39.6512 299.785 39.5986 299.668 39.4936C299.557 39.3826 299.502 39.2426 299.502 39.0733C299.502 38.9098 299.557 38.7756 299.668 38.6705C299.785 38.5654 299.931 38.5129 300.106 38.5129C300.281 38.5129 300.424 38.5654 300.535 38.6705C300.652 38.7756 300.71 38.9098 300.71 39.0733C300.71 39.2426 300.652 39.3826 300.535 39.4936C300.424 39.5986 300.281 39.6512 300.106 39.6512ZM301.795 44.7207V38.4166H302.723V44.7207H301.795Z" fill="#89868D"/>
<circle cx="293.446" cy="8.75587" r="6.01954" fill="#B1E0E9"/>
</svg>
