<svg width="14" height="14" viewBox="0 0 14 14" fill="none" xmlns="http://www.w3.org/2000/svg">
<path d="M5.19531 11.0288L8.89633 7.32779L5.19531 3.62678" stroke="#17AACA" stroke-width="1.63147" stroke-linecap="round" stroke-linejoin="round"/>
</svg>
