<svg width="201" height="201" viewBox="0 0 201 201" fill="none" xmlns="http://www.w3.org/2000/svg">
<g id="its here 17">
<g id="Clip path group">
<mask id="mask0_217_12957" style="mask-type:luminance" maskUnits="userSpaceOnUse" x="29" y="82" width="10" height="14">
<g id="f7c6812db7">
<path id="Vector" d="M29.2812 82.3418H38.7109V95.5363H29.2812V82.3418Z" fill="white"/>
</g>
</mask>
<g mask="url(#mask0_217_12957)">
<g id="Group">
<path id="Vector_2" d="M29.5195 95.3658V82.3594H38.5886C38.5886 82.3594 38.7107 88.4477 36.3911 90.9001C34.0725 93.3525 29.5195 95.3658 29.5195 95.3658Z" fill="#1ABAD6"/>
</g>
</g>
</g>
<g id="Clip path group_2">
<mask id="mask1_217_12957" style="mask-type:luminance" maskUnits="userSpaceOnUse" x="14" y="82" width="25" height="25">
<g id="203b4970b4">
<path id="Vector_3" d="M14.4219 82.6328H38.7123V106.703H14.4219V82.6328Z" fill="white"/>
</g>
</mask>
<g mask="url(#mask1_217_12957)">
<g id="Group_2">
<g id="Clip path group_3">
<mask id="mask2_217_12957" style="mask-type:luminance" maskUnits="userSpaceOnUse" x="14" y="82" width="25" height="25">
<g id="46ad71e7e2">
<path id="Vector_4" d="M38.5872 82.8496C38.5989 84.4587 38.4108 89.7716 35.8014 94.9594C34.9784 96.5918 33.917 98.2125 32.5444 99.7014C28.9889 103.559 23.3504 106.529 14.4219 106.529V97.4651C21.0065 97.4651 25.8008 96.4561 29.2914 94.9594C30.535 94.4253 31.6139 93.8311 32.5474 93.1982C38.0396 89.4721 38.5659 84.4228 38.5872 82.8496Z" fill="white"/>
</g>
</mask>
<g mask="url(#mask2_217_12957)">
<g id="Group_3">
<path id="Vector_5" d="M14.4219 82.8496V106.529H38.5989V82.8496H14.4219Z" fill="#1ABAD6"/>
</g>
</g>
</g>
</g>
</g>
</g>
<g id="Clip path group_4">
<mask id="mask3_217_12957" style="mask-type:luminance" maskUnits="userSpaceOnUse" x="29" y="105" width="10" height="14">
<g id="0d43f1caec">
<path id="Vector_6" d="M29.2812 105.463H38.7109V118.634H29.2812V105.463Z" fill="white"/>
</g>
</mask>
<g mask="url(#mask3_217_12957)">
<g id="Group_4">
<path id="Vector_7" d="M38.5897 105.609V118.617H29.5206C29.5206 118.617 29.3985 112.528 31.7181 110.076C34.0367 107.625 38.5897 105.609 38.5897 105.609Z" fill="#1ABAD6"/>
</g>
</g>
</g>
<g id="Clip path group_5">
<mask id="mask4_217_12957" style="mask-type:luminance" maskUnits="userSpaceOnUse" x="29" y="94" width="25" height="25">
<g id="5b75175bdd">
<path id="Vector_8" d="M29.2812 94.2969H53.6899V118.367H29.2812V94.2969Z" fill="white"/>
</g>
</mask>
<g mask="url(#mask4_217_12957)">
<g id="Group_5">
<g id="Clip path group_6">
<mask id="mask5_217_12957" style="mask-type:luminance" maskUnits="userSpaceOnUse" x="29" y="94" width="25" height="25">
<g id="7bc7f16925">
<path id="Vector_9" d="M29.52 118.125C29.5084 116.517 29.6964 111.204 32.3058 106.015C33.1288 104.384 34.1902 102.763 35.5628 101.273C39.1183 97.4153 44.7569 94.4453 53.6863 94.4453V103.51C47.1017 103.51 42.3074 104.52 38.8168 106.015C37.5732 106.549 36.4943 107.144 35.5609 107.777C30.0686 111.504 29.5433 116.554 29.52 118.125Z" fill="white"/>
</g>
</mask>
<g mask="url(#mask5_217_12957)">
<g id="Group_6">
<path id="Vector_10" d="M53.6858 118.125V94.4453H29.5078V118.125H53.6858Z" fill="#1ABAD6"/>
</g>
</g>
</g>
</g>
</g>
</g>
<g id="Group_7">
<g id="Group_8">
<g id="Group_9">
<path id="Vector_11" d="M69.1701 89.9727C72.8225 89.9727 75.6103 90.9178 77.5335 92.807C79.4566 94.6943 80.4182 97.4985 80.4182 101.221C80.4182 104.935 79.4566 107.739 77.5335 109.631C75.6103 111.523 72.8225 112.469 69.1701 112.469H61.0781V89.9727H69.1701ZM68.9103 108.731C71.2289 108.731 72.9621 108.14 74.1098 106.955C75.2594 105.769 75.8352 103.857 75.8352 101.221C75.8352 98.5842 75.2594 96.6746 74.1098 95.4901C72.9621 94.3065 71.2289 93.7143 68.9103 93.7143H65.5254V108.731H68.9103Z" fill="#1ABAD6"/>
</g>
</g>
</g>
<g id="Group_10">
<g id="Group_11">
<g id="Group_12">
<path id="Vector_12" d="M89.5549 112.79C87.8925 112.79 86.4337 112.451 85.1775 111.771C83.9212 111.088 82.9461 110.088 82.254 108.77C81.5609 107.451 81.2148 105.858 81.2148 103.989C81.2148 102.123 81.5609 100.528 82.254 99.2043C82.9461 97.8812 83.9212 96.8799 85.1775 96.1994C86.4337 95.517 87.8925 95.1758 89.5549 95.1758C91.2164 95.1758 92.6762 95.517 93.9324 96.1994C95.1887 96.8799 96.1638 97.8812 96.8598 99.2043C97.5577 100.528 97.9067 102.123 97.9067 103.989C97.9067 105.858 97.5577 107.451 96.8598 108.77C96.1638 110.088 95.1887 111.088 93.9324 111.771C92.6762 112.451 91.2164 112.79 89.5549 112.79ZM89.5549 109.177C92.1886 109.177 93.5059 107.447 93.5059 103.989C93.5059 102.196 93.1667 100.881 92.4901 100.046C91.8154 99.2082 90.8364 98.7894 89.5549 98.7894C86.9184 98.7894 85.6001 100.523 85.6001 103.989C85.6001 107.447 86.9184 109.177 89.5549 109.177Z" fill="#1ABAD6"/>
</g>
</g>
</g>
<g id="Group_13">
<g id="Group_14">
<g id="Group_15">
<path id="Vector_13" d="M107.16 112.79C105.518 112.79 104.066 112.451 102.802 111.771C101.54 111.088 100.555 110.086 99.8476 108.762C99.1419 107.439 98.7891 105.848 98.7891 103.989C98.7891 102.123 99.1419 100.528 99.8476 99.2043C100.555 97.8812 101.535 96.8799 102.787 96.1994C104.04 95.517 105.472 95.1758 107.083 95.1758C110.662 95.1758 112.955 96.4737 113.961 99.0686L111.038 101.158H110.712C110.363 100.36 109.909 99.7656 109.351 99.3749C108.793 98.9852 108.036 98.7894 107.083 98.7894C105.852 98.7894 104.893 99.2159 104.206 100.069C103.517 100.92 103.174 102.227 103.174 103.989C103.174 105.734 103.521 107.036 104.217 107.893C104.915 108.749 105.896 109.177 107.16 109.177C108.083 109.177 108.864 108.929 109.506 108.432C110.147 107.934 110.605 107.218 110.882 106.284L111.204 106.253L114.236 107.913C113.804 109.35 113.007 110.522 111.844 111.429C110.681 112.337 109.119 112.79 107.16 112.79Z" fill="#1ABAD6"/>
</g>
</g>
</g>
<g id="Group_16">
<g id="Group_17">
<g id="Group_18">
<path id="Vector_14" d="M125.995 108.42L127.103 111.577C126.64 111.957 126.06 112.254 125.363 112.468C124.665 112.683 123.875 112.79 122.993 112.79C121.158 112.79 119.764 112.292 118.81 111.294C117.856 110.293 117.379 108.838 117.379 106.928V98.8668H114.793V95.4819H117.379V92.1745L121.64 91.4805V95.4819H126.456V98.8668H121.64V106.621C121.64 107.462 121.815 108.074 122.164 108.459C122.513 108.845 123.021 109.037 123.688 109.037C124.445 109.037 125.107 108.831 125.673 108.42H125.995Z" fill="#1ABAD6"/>
</g>
</g>
</g>
<g id="Group_19">
<g id="Group_20">
<g id="Group_21">
<path id="Vector_15" d="M135.348 112.79C133.686 112.79 132.227 112.451 130.97 111.771C129.714 111.088 128.739 110.088 128.047 108.77C127.354 107.451 127.008 105.858 127.008 103.989C127.008 102.123 127.354 100.528 128.047 99.2043C128.739 97.8812 129.714 96.8799 130.97 96.1994C132.227 95.517 133.686 95.1758 135.348 95.1758C137.009 95.1758 138.469 95.517 139.725 96.1994C140.982 96.8799 141.957 97.8812 142.653 99.2043C143.351 100.528 143.7 102.123 143.7 103.989C143.7 105.858 143.351 107.451 142.653 108.77C141.957 110.088 140.982 111.088 139.725 111.771C138.469 112.451 137.009 112.79 135.348 112.79ZM135.348 109.177C137.982 109.177 139.299 107.447 139.299 103.989C139.299 102.196 138.96 100.881 138.283 100.046C137.608 99.2082 136.629 98.7894 135.348 98.7894C132.711 98.7894 131.393 100.523 131.393 103.989C131.393 107.447 132.711 109.177 135.348 109.177Z" fill="#1ABAD6"/>
</g>
</g>
</g>
<g id="Group_22">
<g id="Group_23">
<g id="Group_24">
<path id="Vector_16" d="M144.781 112.468V95.4969H148.918V98.021L149.244 98.0831C149.652 97.1399 150.19 96.4468 150.857 96.0048C151.524 95.5628 152.334 95.3418 153.288 95.3418C154.252 95.3418 154.986 95.5066 155.49 95.8342L154.765 99.5138L154.444 99.5758C154.166 99.4624 153.899 99.38 153.641 99.3277C153.385 99.2763 153.073 99.2501 152.706 99.2501C151.514 99.2501 150.606 99.6689 149.981 100.506C149.355 101.342 149.042 102.682 149.042 104.527V112.468H144.781Z" fill="#1ABAD6"/>
</g>
</g>
</g>
<g id="Group_25">
<g id="Group_26">
<g id="Group_27">
<path id="Vector_17" d="M158.923 112.469V98.8669H156.523V95.482H158.923C158.747 94.7637 158.66 94.092 158.66 93.4658C158.66 92.3908 158.905 91.4709 159.397 90.7052C159.89 89.9404 160.598 89.3588 161.521 88.9604C162.446 88.56 163.545 88.3594 164.817 88.3594C166.694 88.3594 168.093 88.6831 169.016 89.3287L168.016 92.4655L167.694 92.5275C167.058 92.0777 166.242 91.8528 165.247 91.8528C164.477 91.8528 163.899 92.0409 163.514 92.415C163.131 92.7873 162.94 93.2971 162.94 93.9427C162.94 94.2199 162.957 94.4739 162.991 94.7065C163.027 94.9372 163.092 95.1951 163.185 95.482H168.031V98.8669H163.185V112.469H158.923Z" fill="#1ABAD6"/>
</g>
</g>
</g>
<g id="Group_28">
<g id="Group_29">
<g id="Group_30">
<path id="Vector_18" d="M172.252 119.669C171.525 119.669 170.866 119.612 170.274 119.499C169.685 119.387 169.205 119.239 168.836 119.053L169.514 115.61L169.79 115.517C170.048 115.648 170.366 115.755 170.744 115.838C171.124 115.921 171.513 115.963 171.915 115.963C172.602 115.963 173.173 115.871 173.628 115.691C174.086 115.513 174.474 115.215 174.791 114.799C175.109 114.383 175.391 113.807 175.637 113.07L168.867 95.498H173.33L177.544 107.301H177.917L182.023 95.498H186.361L179.545 113.531C179.002 114.986 178.405 116.157 177.754 117.044C177.102 117.933 176.332 118.592 175.443 119.022C174.556 119.453 173.493 119.669 172.252 119.669Z" fill="#1ABAD6"/>
</g>
</g>
</g>
</g>
</svg>
