<svg width="13" height="7" viewBox="0 0 13 7" fill="none" xmlns="http://www.w3.org/2000/svg">
<path id="Vector" d="M1 1L5.96984 5.96984C6.30158 6.30158 6.83943 6.30158 7.17116 5.96984L12.141 1" stroke="#535558" stroke-opacity="0.7" stroke-width="1.30117" stroke-linecap="round" stroke-linejoin="round"/>
</svg>
