<svg width="22" height="22" viewBox="0 0 22 22" fill="none" xmlns="http://www.w3.org/2000/svg">
<g id="Frame" clip-path="url(#clip0_217_10903)">
<path id="Vector" d="M4.58203 10.0835L10.082 15.5835L15.582 10.0835" stroke="white" stroke-width="1.5" stroke-linecap="round" stroke-linejoin="round"/>
</g>
<defs>
<clipPath id="clip0_217_10903">
<rect width="22" height="22" fill="white"/>
</clipPath>
</defs>
</svg>
