[    
    "SIGBundle/model.js"
    , "IntegracionBundle/model.js"    
    , "model.js"
    , "VisitaBundle/listarVisita/listarVisita.js"
    , "VisitaBundle/listarVisitaTodo/listarVisitaTodo.js"
    , "VisitaBundle/asignarVisita/asignarVisita.js"
    , "VisitaBundle/registrarVisita/registrarVisita.js"
    , "VisitaBundle/aprobarVisita/aprobarVisita.js"    
    , "SIGBundle/consultarRespuesta/consultarRespuesta.js"
    , "SIGBundle/busqueda/busqueda.js"
    , "SolicitudBundle/solicitud/solicitud.js"
    , "SolicitudBundle/listarTareas/listarTareas.js"
    , "LineasBundle/crearPeticion/crearPeticion.js"
    , "LineasBundle/crearPeticion/modalUsuario.js"
    , "LineasBundle/gestionar/gestionar.js"
    , "LineasBundle/firmar/firmar.js"    
    , "LineasBundle/gestionar/modalInfoCiudadano.js"
    , "NomenclaturaBundle/consultar/consultar.js"
    , "NomenclaturaBundle/crearPeticion/crearPeticion.js"
    , "NomenclaturaBundle/crearPorCiudadano/crearPorCiudadano.js"
    , "NomenclaturaBundle/gestionar/gestionar.js"
    , "NomenclaturaBundle/firmar/firmar.js"
    , "NomenclaturaBundle/revisar/revisar.js"
    , "ControlPolicivoBundle/crearQuerella/crearQuerella.js"
    , "ControlPolicivoBundle/asignarCita/asignarCita.js"
    , "ControlPolicivoBundle/registrarAudiencia/registrarAudiencia.js"
    , "ControlPosteriorBundle/crearPeticion/crearPeticion.js"
    , "InformesBundle/diarioPorTipoSolicitud/diarioPorTipoSolicitud.js"
    , "VisitaBundle/listarVisita/listarVisita.js"    
    , "VisitaBundle/asignarVisita/asignarVisita.js"
    , "VisitaBundle/registrarVisita/registrarVisita.js"
    , "VisitaBundle/aprobarVisita/aprobarVisita.js"    
]

