[    
    "../bower_components/angular/angular.js"
    ,"../bower_components/bootstrap/dist/js/bootstrap.js"
    , "../bower_components/angular-sanitize/angular-sanitize.js"
    , "../bower_components/angular-bootstrap/ui-bootstrap.js"
    , "../bower_components/angular-bootstrap/ui-bootstrap-tpls.js"
    , "../bower_components/angular-ui-router/release/angular-ui-router.js"
    , "../bower_components/angular-resource/angular-resource.js"
    , "../bower_components/angular-utils-pagination/dirPagination.js"
    , "../bower_components/checklist-model/checklist-model.js"
    , "../bower_components/ng-file-upload/ng-file-upload.js"
    , "../bower_components/lodash/lodash.js"
    , "../bower_components/angular-simple-logger/dist/angular-simple-logger.js"
    , "../bower_components/angular-loading-bar/build/loading-bar.js"
    , "../bower_components/angular-ui-mask/dist/mask.min.js"
    , "../bower_components/ngGAPI/gapi.js"
    , "../js/pixeladmin/pixel-admin.js"
    , "jQueryRun.js"
]

