[    
	"SIGBundle/model.js"		
			, "model.js"			
			, "UsoSueloBundle/listarActividades/listarActividades.js"
			, "UsoSueloBundle/consultarCodigo/consultar.js"
			, "UsoSueloBundle/consultaRespuesta/consultarespuesta.js"
]

