"nbdates";"nbsites";"NbTotalArbre";"NbRameauObs";"Noyau";"rep";"nbchpg";"typeEstimation";"Rmax_vrai";"alpha_vrai";"betaa_vrai";"gama_vrai";"LamDisp_vrai";"TauDisp_vrai";"Sigma2CoeffAgreg_vrai";"Rmax_init";"alpha_init";"betaa_init";"gama_init";"LamDisp_init";"TauDisp_init";"Sigma2CoeffAgreg_init";"Rmax_estim";"alpha_estim";"betaa_estim";"gama_estim";"LamDisp_estim";"TauDisp_estim";"Sigma2CoeffAgreg_estim";"vrais_estim";"convergence";"message";"tpsrun";"AIC";"AICc";"BIC";"LVvrai"
6;"12 12 12 12 45 12";100;20;"Gauss";1;2;"nlminb limit";"0.0207387922738486";"1.48257036763243";NA;"7.74738301569596";"3.85160292429456";NA;"4.19748320183901";"0.0130929301500068";"1.92085764793025";NA;"8.76198690667908";"4.07836032126741";NA;"4.1978169305865";"0.0174351316232116";"1.63870047556119";NA;"9.43937374014023";"3.96056410598172";NA;"4.28741969505836";"3526.82821766199";0;"relative convergence (4)";"3.69162655671438";"7063.65643532398";"7063.69544702749";"7090.3670939769";"3529.8044521887"
6;"12 12 12 12 45 12";100;20;"Gauss";2;2;"nlminb limit";"0.172263771481854";"-1.83899343642406";NA;"15.7124529480934";"0.3552685147499";NA;"2.41140823006278";"0.170876799041885";"-1.84166077302109";NA;"20.8544587566962";"0.397862105784666";NA;"2.63107239946327";"0.171829487167152";"-1.86210723822014";NA;"20.8329216878728";"0.369981879027076";NA;"2.62165444540995";"2847.19700949958";0;"relative convergence (4)";"4.51227894624074";"5704.39401899917";"5704.43303070268";"5731.10467765209";"2851.27002872039"
6;"12 12 12 12 45 12";100;20;"Gauss";3;2;"nlminb limit";"0.0163353899590974";"0.424482932547107";NA;"5.96598005155102";"4.5284406544912";NA;"0.317471775493569";"0.017456884437054";"0.327066680704265";NA;"8.7788748156661";"4.37257827015488";NA;"0.42551180151878";"0.0170468970588939";"0.366475626359351";NA;"6.6410193374551";"4.44265638639287";NA;"0.322640624865588";"3432.98807650007";0;"relative convergence (4)";"4.80147149165471";"6875.97615300014";"6876.01516470365";"6902.68681165306";"3434.50441941956"
6;"12 12 12 12 45 12";100;20;"Gauss";4;2;"nlminb limit";"0.17381067070747";"-0.216369554866105";NA;"4.3149020569399";"0.384816050459443";NA;"13.7410849974918";"0.163374076082337";"-0.317121331889126";NA;"5.18920424586999";"0.936366061620993";NA;"14.3073251061447";"0.165580708781133";"-0.222263894543769";NA;"5.02848985800969";"0.856914216416199";NA;"14.9734315037996";"2440.03785451126";0;"relative convergence (4)";"12.4203012625376";"4890.07570902252";"4890.11472072603";"4916.78636767544";"2443.10220121566"
6;"12 12 12 12 45 12";100;20;"Gauss";5;2;"nlminb limit";"0.0512633468952659";"-1.81953427079134";NA;"9.21856059134007";"3.44124436529101";NA;"0.0137646384002838";"0.0511214442845929";"-1.90701407406169";NA;"14.5741923248053";"3.42442900499842";NA;"0.103615722885406";"0.051560483289972";"-1.87103072220967";NA;"10.1884514903854";"3.41483588323079";NA;"0.0122855216456501";"2827.83610020527";0;"relative convergence (4)";"4.31202122370402";"5665.67220041053";"5665.71121211404";"5692.38285906346";"2830.10803223987"
6;"12 12 12 12 45 12";100;20;"Gauss";6;2;"nlminb limit";"0.161868927308893";"2.77891177404672";NA;"5.8594980048947";"0.237003109539226";NA;"7.80754551811672";"0.16296661675392";"2.0124580035295";NA;"4.23959223580928";"0.235416348936222";NA;"6.75215807457796";"0.161772038242394";"2.89814985379325";NA;"5.33945026785483";"0.250335097420561";NA;"7.65565586918357";"2528.90307518825";0;"relative convergence (4)";"3.77048902511597";"5067.8061503765";"5067.84516208001";"5094.51680902942";"2529.84511840931"
6;"12 12 12 12 45 12";100;20;"Gauss";7;2;"nlminb limit";"0.0335977268957885";"-0.524196187499911";NA;"7.4849244421348";"3.87681732241666";NA;"0.020246887548321";"0.0389922415802896";"-0.744374386665759";NA;"10.6430893889632";"3.59732616004387";NA;"0.0436747574554301";"0.0388884622785612";"-0.713985606914896";NA;"7.76372079404984";"3.60600549144358";NA;"0.0247398753899685";"3067.23123759224";0;"relative convergence (4)";"2.8075114329656";"6144.46247518448";"6144.50148688799";"6171.17313383741";"3052.60261503905"
6;"12 12 12 12 45 12";100;20;"Gauss";8;2;"nlminb limit";"0.0311172911917608";"0.555075293639675";NA;"3.11956982174888";"3.82812035552205";NA;"0.0223545436710162";"0.0361796318101607";"0.335706510561968";NA;"4.14947513630917";"3.69015373889188";NA;"0.0482240199464931";"0.0304452461005499";"0.56989189727217";NA;"2.7271381575912";"3.88493938950093";NA;"0.0247452336219256";"2211.6654761007";0;"relative convergence (4)";"3.593050968647";"4433.3309522014";"4433.36996390491";"4460.04161085432";"2216.71682350779"
6;"12 12 12 12 45 12";100;20;"Gauss";9;2;"nlminb limit";"0.0233539114907233";"2.0814774192404";NA;"12.56971347332";"3.02318256907093";NA;"1.35324734900735";"0.0177406048812851";"2.35780450942317";NA;"28.6987425538414";"3.09407156473539";NA;"1.46012594823934";"0.0228659944606998";"2.10315152899792";NA;"14.8194218043976";"3.02834974763385";NA;"1.31337225391006";"2555.81474156966";0;"relative convergence (4)";"18.9085636178652";"5121.62948313932";"5121.66849484283";"5148.34014179224";"2557.02810715857"
6;"12 12 12 12 45 12";100;20;"Gauss";10;2;"nlminb limit";"0.0251565457167037";"0.396497611189261";NA;"6.11481336131692";"4.77954521593318";NA;"0.0412267322998425";"0.0251396359286154";"0.429411331202615";NA;"5.98593287284071";"4.7526584452596";NA;"0.0790700660980056";"0.0259326789089772";"0.368631030357103";NA;"6.17358571441369";"4.74695380727232";NA;"0.0360969674802961";"3357.82433127631";0;"relative convergence (4)";"12.4344506263733";"6725.64866255262";"6725.68767425613";"6752.35932120554";"3363.14465118184"
6;"12 12 12 12 45 12";100;20;"Gauss";11;2;"nlminb limit";"0.15532422852847";"2.76805544109084";NA;"13.2197171729058";"0.545393430479207";NA;"10.596050412268";"0.154000499566636";"2.19230898290825";NA;"13.4964075687416";"0.591512999045329";NA;"10.4692917402499";"0.154577024747662";"2.34997059539919";NA;"11.99830624814";"0.565253405453475";NA;"10.2367623355969";"2459.45193673508";0;"relative convergence (4)";"2.907441842556";"4928.90387347016";"4928.94288517367";"4955.61453212309";"2461.15870764381"
6;"12 12 12 12 45 12";100;20;"Gauss";12;2;"nlminb limit";"0.0261074591808541";"-1.99932727427222";NA;"5.33987225685269";"4.98603814055632";NA;"1.28152806493708";"0.0239135239462769";"-1.45958685951331";NA;"4.40985163386953";"5.25257782609389";NA;"1.00228568049418";"0.024634586424671";"-1.69918186361998";NA;"4.68661365511873";"5.16943820023151";NA;"1.12204871596502";"2703.96382437847";0;"relative convergence (4)";"2.40449151992798";"5417.92764875693";"5417.96666046044";"5444.63830740986";"2707.56464457294"
6;"12 12 12 12 45 12";100;20;"Gauss";13;2;"nlminb limit";"0.0296545936951228";"1.44613476889208";NA;"13.6202558958903";"2.91223926717314";NA;"0.51138682117334";"0.0372097744844167";"1.24662784400858";NA;"12.0726021014276";"2.77648991011626";NA;"0.520129631381918";"0.0310424935426881";"1.42435884948263";NA;"9.4611062540642";"2.88746902493952";NA;"0.515131269727691";"1793.62914843738";0;"relative convergence (4)";"4.20956341028213";"3597.25829687475";"3597.29730857826";"3623.96895552768";"1797.21739859469"
6;"12 12 12 12 45 12";100;20;"Gauss";14;2;"nlminb limit";"0.0649510783808177";"-1.13746988284402";NA;"2.173416308593";"3.04756693407991";NA;"0.0374276831289123";"0.0671156011484752";"-1.15703884664317";NA;"2.81726533162272";"2.92528714831213";NA;"0.0955513394545029";"0.0645598667747596";"-1.12037608086089";NA;"2.20561527509514";"3.05049441029651";NA;"0.0338110722522861";"3224.27955145322";0;"relative convergence (4)";"5.98280291159948";"6458.55910290643";"6458.59811460994";"6485.26976155936";"3225.81961601521"
6;"12 12 12 12 45 12";100;20;"Gauss";15;2;"nlminb limit";"0.0110845800293179";"2.57197233103216";NA;"18.6149110198021";"2.88061073809839";NA;"0.0123643790108067";"0.0162652487110452";"2.23398626712798";NA;"14.777914578312";"2.79425686050172";NA;"0.214194818806141";"0.0102332476413046";"2.63736274630062";NA;"30";"2.90882265138845";NA;"0.0133307798457326";"1232.02590719474";0;"relative convergence (4)";"7.84782474040985";"2474.05181438947";"2474.09082609298";"2500.76247304239";"1235.28190851444"
6;"12 12 12 12 45 12";100;20;"Gauss";16;2;"nlminb limit";"0.0122199636067414";"1.13559494679794";NA;"2.60499670170248";"4.80380853987817";NA;"0.78734983141204";"0.0194331933857608";"0.613228666130304";NA;"3.25784770734699";"4.42173195660696";NA;"0.774413043018103";"0.013962352475389";"0.985615120570065";NA;"3.05115735043496";"4.67747452730249";NA;"0.780881844857449";"3934.57054962173";0;"relative convergence (4)";"14.7002544720968";"7879.14109924347";"7879.18011094698";"7905.85175789639";"3938.60252187773"
6;"12 12 12 12 45 12";100;20;"Gauss";17;2;"nlminb limit";"0.169726458734087";"1.24510487727821";NA;"12.0523536093533";"0.255914980410123";NA;"0.078393446117565";"0.170243211506912";"1.27812004261614";NA;"11.5123913172375";"0.211537847211944";NA;"0.0929466142309475";"0.169970964023294";"1.27604344552766";NA;"13.6534696466495";"0.241662843401246";NA;"0.0790127668445513";"890.78713501356";0;"relative convergence (4)";"2.04802745580673";"1791.57427002712";"1791.61328173063";"1818.28492868004";"895.752792338903"
6;"12 12 12 12 45 12";100;20;"Gauss";18;2;"nlminb limit";"0.0361952938720515";"1.51372425560839";NA;"15.9312735190615";"2.61807911963608";NA;"0.0275720142896892";"0.035876118047443";"1.54407130037701";NA;"9.05654258975808";"2.60568843466665";NA;"0.0206746514086736";"0.0364235591122799";"1.53005916920372";NA;"15.1018588166755";"2.59855578230092";NA;"0.0206514071032729";"1100.61045784187";0;"relative convergence (4)";"7.46473135948181";"2211.22091568373";"2211.25992738724";"2237.93157433666";"1104.33217172788"
6;"12 12 12 12 45 12";100;20;"Gauss";19;2;"nlminb limit";"0.0202022865783614";"-0.645082199946046";NA;"12.2685906724073";"4.78110230113036";NA;"0.0116865889342511";"0.0191495665678763";"-0.539080908829887";NA;"10.7547211993311";"4.84978857642789";NA;"0.0178870900358925";"0.0208365954799394";"-0.691719745389809";NA;"11.1175711447604";"4.70795134378584";NA;"0.0172236983502094";"2564.96823759558";0;"relative convergence (4)";"1.93710665305456";"5139.93647519117";"5139.97548689468";"5166.64713384409";"2566.39072507629"
6;"12 12 12 12 45 12";100;20;"Gauss";20;2;"nlminb limit";"0.0293536413663462";"0.916549127548933";NA;"14.4389680488966";"3.579300121496";NA;"0.102313761056743";"0.0180719945181396";"1.4202132715286";NA;"15.3970064100592";"3.87054595419077";NA;"0.0724495347421882";"0.0275020290708593";"0.996902516822483";NA;"14.065020460989";"3.59458892204752";NA;"0.0948349916598831";"1902.91330400172";0;"relative convergence (4)";"3.98788195451101";"3815.82660800344";"3815.86561970695";"3842.53726665636";"1905.78270451672"
6;"12 12 12 12 45 12";100;20;"Gauss";21;2;"nlminb limit";"0.0402410547957297";"-1.11381112062372";NA;"16.8571833991446";"4.01224521089976";NA;"0.56449776837702";"0.0403575867848784";"-1.18700171159588";NA;"20.5052101891993";"4.01042542685029";NA;"0.612517052094734";"0.0395866741767648";"-1.1070178879057";NA;"17.0017123578887";"4.03945235781657";NA;"0.591488320174654";"3482.97798717269";0;"relative convergence (4)";"3.70248979330063";"6975.95597434538";"6975.9949860489";"7002.66663299831";"3485.28459282503"
6;"12 12 12 12 45 12";100;20;"Gauss";22;2;"nlminb limit";"0.0472088292129624";"-1.45287432288751";NA;"19.7978817415424";"3.33029253592156";NA;"0.0259077231339432";"0.046417893880092";"-1.42656297150847";NA;"20.7334201848396";"3.36427059596543";NA;"0.0454979696045726";"0.0477457741345539";"-1.49080336356992";NA;"23.1959465181854";"3.29325872834624";NA;"0.0420595970477416";"2804.01136498546";0;"relative convergence (4)";"4.3813661813736";"5618.02272997091";"5618.06174167442";"5644.73338862383";"2808.26640791361"
6;"12 12 12 12 45 12";100;20;"Gauss";23;2;"nlminb limit";"0.0660059797395659";"-0.89094814308919";NA;"6.60979042155668";"2.88438448135981";NA;"0.118639385784212";"0.0574560955705508";"-0.687533590928913";NA;"4.33111817828012";"3.17204201300355";NA;"0.155148589668968";"0.065934936438023";"-0.885515083378045";NA;"5.84983649494604";"2.89566306684604";NA;"0.106997631268115";"3265.49411012415";0;"relative convergence (4)";"6.10506945848465";"6540.98822024829";"6541.02723195181";"6567.69887890122";"3267.96487774927"
6;"12 12 12 12 45 12";100;20;"Gauss";24;2;"nlminb limit";"0.0229430190356908";"0.365377745591104";NA;"18.5905673410744";"4.72912450506701";NA;"11.5348668121383";"0.0126794146984005";"1.0268898419133";NA;"17.6786850510002";"5.24436135531506";NA;"11.1661571487652";"0.0227571162361723";"0.368425955012345";NA;"18.024075129459";"4.71316356943106";NA;"11.2365330842048";"2681.84816421393";0;"relative convergence (4)";"9.04798019727071";"5373.69632842786";"5373.73534013137";"5400.40698708079";"2682.18481262402"
6;"12 12 12 12 45 12";100;20;"Gauss";25;2;"nlminb limit";"0.148584263599708";"2.92796698701568";NA;"2.39891839213669";"1.07649512673059";NA;"0.260900390983598";"0.147493908190445";"2.97871246616847";NA;"21.7735023874214";"1.07080372179204";NA;"0.550728676166319";"0.149668550557445";"2.94165076025984";NA;"2.15223342447386";"1.07015465615597";NA;"0.275752458969662";"576.822157019067";0;"relative convergence (4)";"17.7910873651505";"1163.64431403813";"1163.68332574165";"1190.35497269106";"578.055711169733"
6;"12 12 12 12 45 12";100;20;"Gauss";26;2;"nlminb limit";"0.162535995100929";"-1.53180829063058";NA;"3.74878106219694";"0.284172740322446";NA;"0.0213269812229422";"0.162090958581805";"-1.52227778987936";NA;"4.04183016404034";"0.278401810844258";NA;"0.0974199398788847";"0.16255117145627";"-1.52990193117032";NA;"3.72136704635738";"0.282887847139842";NA;"0.0149815208361793";"1628.91533551626";0;"relative convergence (4)";"10.2927729328473";"3267.83067103252";"3267.86968273604";"3294.54132968545";"1629.55910285453"
6;"12 12 12 12 45 12";100;20;"Gauss";27;2;"nlminb limit";"0.0291327420641467";"-1.4788050535135";NA;"14.8391169086099";"4.40080517380057";NA;"1.16411396656389";"0.0285021262700756";"-1.48784829963302";NA;"16.9389451436804";"4.44709091102602";NA;"1.25033256490511";"0.029623680427752";"-1.59623842037869";NA;"15.2376005356107";"4.41390068843586";NA;"1.21748554921445";"2740.81020552695";0;"relative convergence (4)";"2.57266173760096";"5491.6204110539";"5491.65942275741";"5518.33106970682";"2744.11686304751"
6;"12 12 12 12 45 12";100;20;"Gauss";28;2;"nlminb limit";"0.164232934520111";"1.03779597394168";NA;"17.5340458094142";"0.496774641041512";NA;"0.0217323690356595";"0.163875768064621";"1.04604422769499";NA;"24.7435188142908";"0.530509400649142";NA;"0.0645286873651273";"0.162236026650942";"1.0502475021646";NA;"26.0207005810309";"0.611063677116";NA;"0.0235037375368484";"800.885588585487";0;"relative convergence (4)";"2.95537830591202";"1611.77117717097";"1611.81018887449";"1638.4818358239";"804.172207744685"
6;"12 12 12 12 45 12";100;20;"Gauss";29;2;"nlminb limit";"0.0508960602114037";"-0.151285229250789";NA;"6.93219144642353";"3.41070390416338";NA;"12.8151240794824";"0.0470329951127479";"-0.0993767152890755";NA;"10.1170161415601";"3.4797490162573";NA;"13.7777201000451";"0.0477624417146498";"-0.0882042795115523";NA;"6.8875563368612";"3.48895297384018";NA;"12.1291631934282";"2686.42406446659";0;"relative convergence (4)";"7.60519817272822";"5382.84812893318";"5382.88714063669";"5409.5587875861";"2688.77863348025"
6;"12 12 12 12 45 12";100;20;"Gauss";30;2;"nlminb limit";"0.0275572789930451";"-0.422467479249462";NA;"8.40826259925961";"4.13088125753496";NA;"0.11278018932792";"0.0273134127328517";"-0.399726165136115";NA;"6.95530212555558";"4.15507347395465";NA;"0.102929536846266";"0.0274980813827996";"-0.421271418332599";NA;"7.59875737908544";"4.13262322695702";NA;"0.11189422378139";"3089.42137767587";0;"relative convergence (4)";"2.06423107783";"6188.84275535173";"6188.88176705524";"6215.55341400466";"3091.06713123034"
6;"12 12 12 12 45 12";100;20;"Gauss";1;2;"nlminb limit";"0.0424408298295036";"2.41040148376487";NA;"2.72056612279266";"2.41213358518195";NA;"7.25668903979285";"0.0358723232204456";"2.65271047960685";NA;"2.18078201689528";"2.45149718158993";NA;"6.69228621457714";"0.0354394508036518";"2.57257722318345";NA;"2.64499172147337";"2.4964155425247";NA;"7.06978107254961";"3349.43153624309";0;"relative convergence (4)";"26.0949304064115";"6708.86307248617";"6708.90208418969";"6735.5737311391";"3353.18714710575"
6;"12 12 12 12 45 12";100;20;"Gauss";2;2;"nlminb limit";"0.0226080458709035";"1.11761710210703";NA;"2.53471767483279";"4.10000168902287";NA;"0.105528788530517";"0.0161327289865364";"1.47650073696874";NA;"2.51315437180414";"4.30461743700411";NA;"0.142944612271325";"0.0231314402795217";"1.09185649873545";NA;"2.53898856840304";"4.07831210082537";NA;"0.109526372318489";"2206.23122329185";0;"relative convergence (4)";"2.06931438048681";"4422.46244658369";"4422.5014582872";"4449.17310523662";"2206.66961834109"
6;"12 12 12 12 45 12";100;20;"Gauss";3;2;"nlminb limit";"0.156953838361446";"-1.47255016886629";NA;"12.3758431626484";"0.250659849572455";NA;"0.024427003278744";"0.156317482216612";"-1.4625552805643";NA;"11.9686757289819";"0.25247479325674";NA;"0.0874184485574187";"0.156856251144014";"-1.47816328272983";NA;"11.3328373317088";"0.252595997242338";NA;"0.0255121059069741";"1656.98914846422";0;"relative convergence (4)";"18.9246465762456";"3323.97829692844";"3324.01730863195";"3350.68895558136";"1658.47301743905"
6;"12 12 12 12 45 12";100;20;"Gauss";4;2;"nlminb limit";"0.0407198064002047";"-0.398536313325167";NA;"4.86826852336526";"3.39430069973518";NA;"0.0257500967901654";"0.042834477333936";"-0.463382051358587";NA;"4.49684122286282";"3.34298430681211";NA;"0.060049286544258";"0.0394796625198188";"-0.35928583230792";NA;"5.19538810204995";"3.43481067251476";NA;"0.0286354826597944";"3075.89521916151";0;"relative convergence (4)";"13.5388275146484";"6161.79043832301";"6161.82945002652";"6188.50109697594";"3081.97040010672"
6;"12 12 12 12 45 12";100;20;"Gauss";5;2;"nlminb limit";"0.0445876506081071";"1.1985832285136";NA;"9.98613110696897";"2.47546826942213";NA;"11.7069538410465";"0.0574000539108075";"1.09594672007548";NA;"8.87611629086657";"2.25901216981134";NA;"11.9848314208845";"0.0428184899254092";"1.22737473713966";NA;"13.4040804751568";"2.50474658209112";NA;"12.4162879363826";"2529.90729140862";0;"relative convergence (4)";"14.8753831386566";"5069.81458281723";"5069.85359452074";"5096.52524147016";"2533.41449898751"
6;"12 12 12 12 45 12";100;20;"Gauss";6;2;"nlminb limit";"0.0202599377487825";"2.23321391572244";NA;"4.03866045782343";"3.96047622496017";NA;"12.620525879088";"0.021201712435452";"2.21884822364254";NA;"6.05093064301574";"3.85662979618998";NA;"14.8366339111783";"0.021607376802918";"2.22097555048371";NA;"4.61105931244575";"3.84323657615281";NA;"13.3751688153455";"3173.12886596261";0;"relative convergence (4)";"10.9981220086416";"6356.25773192521";"6356.29674362872";"6382.96839057813";"3175.45560625516"
6;"12 12 12 12 45 12";100;20;"Gauss";7;2;"nlminb limit";"0.156570030713837";"-1.44532946450636";NA;"12.1512385043316";"0.577210028986213";NA;"0.0580043523686543";"0.156177531623265";"-1.42875383645654";NA;"13.8111940166782";"0.577786575667564";NA;"0.0588415991405583";"0.156669563917112";"-1.44149501705549";NA;"10.5021285689966";"0.577503283530948";NA;"0.0831094170317555";"1754.05593204685";0;"relative convergence (4)";"10.3357273141543";"3518.11186409371";"3518.15087579722";"3544.82252274663";"1758.4963428371"
6;"12 12 12 12 45 12";100;20;"Gauss";8;2;"nlminb limit";"0.093129118060394";"0.106888509588316";NA;"15.6137074609287";"2.18247953879734";NA;"0.0645772397986187";"0.102565517942654";"0.0361483274911564";NA;"9.99890627532055";"2.04557824943519";NA;"0.0606527308165936";"0.0910695975269367";"0.111920189252363";NA;"10.8026383732163";"2.22732714264911";NA;"0.0470263193096478";"1126.33175184405";0;"relative convergence (4)";"24.5457960049311";"2262.66350368811";"2262.70251539162";"2289.37416234103";"1130.22600634859"
6;"12 12 12 12 45 12";100;20;"Gauss";9;2;"nlminb limit";"0.130711329246792";"1.23122887057252";NA;"8.4033825295046";"1.35296227625779";NA;"0.0373358034423968";"0.13429214757275";"1.20389443423796";NA;"2.85039330679715";"1.33850808998167";NA;"0.0457126772018347";"0.130491178036562";"1.22094753630932";NA;"7.83844334221769";"1.35620994732217";NA;"0.0366195848081692";"585.171050855839";0;"relative convergence (4)";"12.2346933960915";"1180.34210171168";"1180.38111341519";"1207.0527603646";"586.906058408569"
6;"12 12 12 12 45 12";100;20;"Gauss";10;2;"nlminb limit";"0.151968686647091";"0.966227547731251";NA;"2.99448222992942";"0.899032182523844";NA;"0.0170209573246289";"0.154123717653013";"0.979841185482534";NA;"8.16206107553255";"0.809002114117962";NA;"0.0607245071976562";"0.153190013793937";"0.976465227570115";NA;"3.2366066310346";"0.860979217796147";NA;"0.0150960185909569";"815.836318978956";0;"relative convergence (4)";"10.8155814727147";"1641.67263795791";"1641.71164966142";"1668.38329661084";"826.06399010042"
6;"12 12 12 12 45 12";100;20;"Gauss";11;2;"nlminb limit";"0.0559683612355211";"-1.07830616342835";NA;"10.7467169407755";"3.42782275864957";NA;"0.0155779225437597";"0.053870124070117";"-1.01607691006939";NA;"7.72894756453917";"3.56128002189194";NA;"0.0612904127876683";"0.0557357831009073";"-1.06851540074071";NA;"12.2367005397776";"3.41727084634789";NA;"0.0156919132857759";"3247.88587207179";0;"relative convergence (4)";"3.94460833867391";"6505.77174414358";"6505.81075584709";"6532.4824027965";"3250.65460536539"
6;"12 12 12 12 45 12";100;20;"Gauss";12;2;"nlminb limit";"0.0923609943180278";"1.9569538552314";NA;"10.0274359649047";"1.64044731016088";NA;"0.960670570814684";"0.075065258251576";"2.22030942040259";NA;"4.80762957613342";"1.74914294480001";NA;"1.03011240219888";"0.0911808150744185";"1.97496328371035";NA;"11.818980856249";"1.64664420204133";NA;"0.982961446624156";"1179.3983241363";0;"relative convergence (4)";"9.72169241507848";"2368.7966482726";"2368.83565997611";"2395.50730692552";"1180.46720897407"
6;"12 12 12 12 45 12";100;20;"Gauss";13;2;"nlminb limit";"0.0112126464299808";"2.62468700134195";NA;"7.02710281219333";"3.3383592441571";NA;"0.221280975368299";"0.0117320706793642";"2.54221514926424";NA;"9.90633666278088";"3.35765620051161";NA;"0.232232160209472";"0.0103801431673743";"2.6771140162913";NA;"8.98516859869362";"3.37374488010666";NA;"0.190627165484153";"1692.83423131702";0;"relative convergence (4)";"7.32498532136281";"3395.66846263404";"3395.70747433756";"3422.37912128697";"1696.64424522337"
6;"12 12 12 12 45 12";100;20;"Gauss";14;2;"nlminb limit";"0.164225567989254";"-0.330460439901799";NA;"9.98232282698155";"0.24493850004894";NA;"0.522542684621215";"0.163467243585724";"-0.326300837392074";NA;"11.8216075233864";"0.307506492269168";NA;"0.509835204835973";"0.164618267774587";"-0.316410414474747";NA;"10.2605605446483";"0.170165345637963";NA;"0.496886186828561";"1347.89025815552";0;"relative convergence (4)";"2.20969322522481";"2705.78051631105";"2705.81952801456";"2732.49117496397";"1349.18688846292"
6;"12 12 12 12 45 12";100;20;"Gauss";15;2;"nlminb limit";"0.0426851584519618";"0.575749793322757";NA;"3.0790862813592";"3.36529795097318";NA;"3.03802560778969";"0.045864774989483";"0.494698038652485";NA;"3.48525186410003";"3.32326653786424";NA;"3.4519668785905";"0.0446934428915597";"0.591055768310785";NA;"2.84983921340654";"3.28122542059847";NA;"3.27636191026682";"3520.30778040644";0;"relative convergence (4)";"8.90035415887833";"7050.61556081288";"7050.65457251639";"7077.3262194658";"3525.33481129496"
6;"12 12 12 12 45 12";100;20;"Gauss";16;2;"nlminb limit";"0.0427951271602466";"-1.07246297691017";NA;"15.8942915690132";"3.71586466256331";NA;"0.0158133368483188";"0.0409063520089926";"-0.994093149588931";NA;"12.9574859976905";"3.84987279960436";NA;"0.0591067724284362";"0.0430452216732585";"-1.09891674778186";NA;"17.2823866381333";"3.71780622558869";NA;"0.0176473971518068";"3010.45328201978";0;"relative convergence (4)";"9.5020589073499";"6030.90656403955";"6030.94557574306";"6057.61722269247";"3022.41044229328"
6;"12 12 12 12 45 12";100;20;"Gauss";17;2;"nlminb limit";"0.169238770500056";"-0.538615636061877";NA;"18.3958448045887";"0.224191723331019";NA;"0.0650835680832035";"0.169217240876783";"-0.559216540198534";NA;"12.9706971377347";"0.26306633357637";NA;"0.0378221029877184";"0.169396710620771";"-0.541581193883921";NA;"14.9285572428316";"0.219444273536288";NA;"0.054898182862357";"1138.82440991899";0;"relative convergence (4)";"4.93249429066976";"2287.64881983798";"2287.68783154149";"2314.3594784909";"1140.05104238036"
6;"12 12 12 12 45 12";100;20;"Gauss";18;2;"nlminb limit";"0.0332886609200588";"-1.26216379855759";NA;"5.71299539227039";"4.33395508733514";NA;"6.30680659968143";"0.035942492148907";"-1.4487091566788";NA;"5.76951809582938";"4.22091885880727";NA;"7.31786904041486";"0.0347320645918853";"-1.37904866802489";NA;"6.39597606122691";"4.23848172219498";NA;"7.66230759728947";"2343.44721793289";0;"relative convergence (4)";"1.4471516251564";"4696.89443586577";"4696.93344756928";"4723.60509451869";"2350.77519395112"
6;"12 12 12 12 45 12";100;20;"Gauss";19;2;"nlminb limit";"0.0245678591894555";"0.681920119794086";NA;"12.2734519373626";"4.23881067380298";NA;"0.100277623688128";"0.0173494120592536";"1.06888794240657";NA;"7.41142517185168";"4.55571550290381";NA;"0.109305899351624";"0.0230049012418183";"0.756245231314839";NA;"10.6073124076575";"4.30441855305388";NA;"0.113821639188939";"2774.49900292434";0;"relative convergence (4)";"3.91613677740097";"5558.99800584867";"5559.03701755218";"5585.70866450159";"2776.70185895985"
6;"12 12 12 12 45 12";100;20;"Gauss";20;2;"nlminb limit";"0.152079258424169";"1.84137056884356";NA;"15.9193167299964";"0.683278281167615";NA;"0.184337369288538";"0.153291952075714";"1.87387589813297";NA;"12.5726636969732";"0.68539980196729";NA;"0.471527634275039";"0.152355937308905";"1.84614040106091";NA;"14.8351165109666";"0.683113160244418";NA;"0.250497975659781";"885.414599450556";0;"relative convergence (4)";"5.62466408411662";"1780.82919890111";"1780.86821060462";"1807.53985755404";"888.629973597826"
6;"12 12 12 12 45 12";100;20;"Gauss";21;2;"nlminb limit";"0.158044341937058";"0.794163412181661";NA;"19.6108971224166";"0.267894004521624";NA;"0.104303392704134";"0.158907031520006";"0.791945333932817";NA;"18.7198727938102";"0.129663434843033";NA;"0.0808351305214816";"0.159016849352136";"0.794804510298686";NA;"30";"0.141532433600862";NA;"0.0928217381432872";"889.015865226517";0;"relative convergence (4)";"1.96916836102804";"1788.03173045303";"1788.07074215655";"1814.74238910596";"891.081345782748"
6;"12 12 12 12 45 12";100;20;"Gauss";22;2;"nlminb limit";"0.149704081537532";"0.369600137462839";NA;"8.22672369843349";"0.814164985926673";NA;"0.0109340751970226";"0.149503632153237";"0.371909978443879";NA;"5.94745036166202";"0.835914615422864";NA;"0.105290095131403";"0.149136692235921";"0.377424156185398";NA;"8.05967681937999";"0.834708635183894";NA;"0.00714536627499508";"859.957404357295";0;"relative convergence (4)";"7.54519803126653";"1729.91480871459";"1729.9538204181";"1756.62546736751";"862.364581498452"
6;"12 12 12 12 45 12";100;20;"Gauss";23;2;"nlminb limit";"0.145660111316113";"-0.38789340108633";NA;"3.9060247191228";"0.972074148241262";NA;"0.560628821521183";"0.143254854415524";"-0.440872485481088";NA;"5.88945970884148";"1.02484631014409";NA;"0.569896448322891";"0.144041290393968";"-0.388513489690482";NA;"3.74620379558762";"1.02003303334413";NA;"0.573866839182744";"1464.57633026175";0;"relative convergence (4)";"5.88381778796514";"2939.1526605235";"2939.19167222701";"2965.86331917642";"1465.8398818378"
6;"12 12 12 12 45 12";100;20;"Gauss";24;2;"nlminb limit";"0.0740389529161162";"-0.0973343865480274";NA;"18.2864600629546";"2.66161306082655";NA;"2.88799226355736";"0.0795855381904425";"-0.152249264116246";NA;"28.3137355306214";"2.55622987788395";NA;"2.86891388753575";"0.0744039304823515";"-0.110604078581065";NA;"16.420760783999";"2.66714259125898";NA;"2.77041956389104";"3239.45498437274";0;"relative convergence (4)";"4.49552461306254";"6488.90996874548";"6488.94898044899";"6515.62062739841";"3240.27578378355"
6;"12 12 12 12 45 12";100;20;"Gauss";25;2;"nlminb limit";"0.131331727107561";"-0.783734906464815";NA;"7.64984285039827";"1.63869199401231";NA;"0.47125287786174";"0.134465646196557";"-0.691835030898496";NA;"5.88189413712292";"1.6188366504659";NA;"0.542906447575894";"0.131347311372972";"-0.761557690148965";NA;"7.8216876058181";"1.64058377534486";NA;"0.493462673208779";"1764.04895173233";0;"relative convergence (4)";"17.0956575075785";"3538.09790346466";"3538.13691516817";"3564.80856211758";"1762.80591864182"
6;"12 12 12 12 45 12";100;20;"Gauss";26;2;"nlminb limit";"0.0448717536388653";"-1.25067886710167";NA;"5.11299567110837";"3.36828417089807";NA;"0.0184768934061162";"0.0464033713135644";"-1.36324803114343";NA;"5.44244677642393";"3.29336832007119";NA;"0.0314972342183933";"0.0447568684463787";"-1.24891024831011";NA;"4.9561255365274";"3.36348316258864";NA;"0.0308284198066935";"2775.51582024922";0;"relative convergence (4)";"9.16053322950999";"5561.03164049845";"5561.07065220196";"5587.74229915137";"2775.29709228208"
6;"12 12 12 12 45 12";100;20;"Gauss";27;2;"nlminb limit";"0.0396934216369888";"-1.29914884967729";NA;"15.3637767480686";"4.30782894171114";NA;"9.16151547181613";"0.038705392996707";"-1.15159282330843";NA;"14.793531182658";"4.30567326542968";NA;"9.31234248678969";"0.0396912627901689";"-1.184919764674";NA;"13.4201083055397";"4.32228620157238";NA;"9.29054372777373";"2514.42292764922";0;"relative convergence (4)";"3.41529049475988";"5038.84585529845";"5038.88486700196";"5065.55651395137";"2517.10704935824"
6;"12 12 12 12 45 12";100;20;"Gauss";28;2;"nlminb limit";"0.022754988530207";"2.25116366124712";NA;"6.87199346441776";"2.84153774965022";NA;"0.0531791874189633";"0.0263770851944094";"2.12899254670465";NA;"9.45741995769807";"2.74693289583387";NA;"0.0672728464480055";"0.0232540542693969";"2.23542137285433";NA;"7.96775854987185";"2.82615794528286";NA;"0.063141632552087";"1284.65868984184";0;"relative convergence (4)";"3.21371704339981";"2579.31737968369";"2579.3563913872";"2606.02803833661";"1285.38018257761"
6;"12 12 12 12 45 12";100;20;"Gauss";1;2;"nlminb limit";"0.14350920423435";"0.592679099179804";NA;"6.39908833568916";"1.29546301186514";NA;"7.04901210020338";"0.14793776889892";"0.524648765302232";NA;"9.6486836381759";"1.18515795182665";NA;"7.92364554781344";"0.143528290568278";"0.522872976063513";NA;"7.22688512819781";"1.28877765632504";NA;"6.87319242444005";"2917.18405220949";0;"relative convergence (4)";"9.96212924321492";"5844.36810441897";"5844.40711612248";"5871.0787630719";"2919.90350104283"
6;"12 12 12 12 45 12";100;20;"Gauss";2;2;"nlminb limit";"0.172728435143295";"2.22851078561507";NA;"6.18482419243082";"0.346106871057069";NA;"0.0822506731813391";"0.171993871496861";"1.92446703765294";NA;"4.86952334507817";"0.373472489909738";NA;"0.0583532236578465";"0.172324128730571";"1.88802588503964";NA;"5.38966094691468";"0.363020851142146";NA;"0.0895185363309485";"743.42096946483";0;"relative convergence (4)";"1.87679756482442";"1496.84193892966";"1496.88095063317";"1523.55259758258";"745.972866400711"
6;"12 12 12 12 45 12";100;20;"Gauss";3;2;"nlminb limit";"0.0146796068289626";"0.616835400694981";NA;"12.3436581422575";"4.66554680520191";NA;"3.19976813632188";"0.0127395619102166";"0.803767260193152";NA;"10.5235629480263";"4.63530291627722";NA;"3.00253863799736";"0.0129348758726593";"0.745116618520062";NA;"13.9946666363266";"4.69199678605581";NA;"3.06437515368256";"3361.8985464322";0;"relative convergence (4)";"3.89984860420227";"6733.79709286441";"6733.83610456792";"6760.50775151733";"3365.28973537227"
6;"12 12 12 12 45 12";100;20;"Gauss";4;2;"nlminb limit";"0.0459527618052448";"-1.06288668629713";NA;"16.7126706251875";"3.66941135267259";NA;"0.112472889841947";"0.0476451191622437";"-1.12573696877029";NA;"21.526970402308";"3.55785464975727";NA;"0.0900156551887878";"0.0468557193622501";"-1.11512682641264";NA;"22.0558913421464";"3.61538653194493";NA;"0.113449909069252";"3268.96658640687";0;"relative convergence (4)";"11.2047770182292";"6547.93317281374";"6547.97218451725";"6574.64383146666";"3272.52891892863"
6;"12 12 12 12 45 12";100;20;"Gauss";5;2;"nlminb limit";"0.0127413379800518";"1.23191178962588";NA;"4.53131773835048";"4.34353236321371";NA;"0.694142770493084";"0.020243034678131";"0.715190964408537";NA;"4.06397859637919";"4.03651440021216";NA;"0.551498350065266";"0.0190503105812831";"0.804159198919991";NA;"4.20538337758196";"4.08473753701147";NA;"0.648267492368845";"3547.49976016726";0;"relative convergence (4)";"4.14177006085714";"7104.99952033453";"7105.03853203804";"7131.71017898745";"3554.30245433426"
6;"12 12 12 12 45 12";100;20;"Gauss";6;2;"nlminb limit";"0.137876718206168";"2.03398899943568";NA;"14.9899871549569";"1.14990389782681";NA;"0.0640745294887973";"0.137638588307181";"2.0370222421212";NA;"6.40683854935598";"1.15639371474805";NA;"0.114554832774181";"0.136996131201281";"2.02053831779972";NA;"23.9648955767042";"1.15665634952778";NA;"0.0520464969358257";"478.775129020283";0;"relative convergence (4)";"8.11335128943125";"967.550258040567";"967.589269744078";"994.260916693491";"480.431751120202"
6;"12 12 12 12 45 12";100;20;"Gauss";7;2;"nlminb limit";"0.0120823315033463";"1.08715170249343";NA;"8.83038887195289";"4.63290876580638";NA;"0.133644717930917";"0.0152016040949082";"0.830201616648434";NA;"10.314068540202";"4.41947403349181";NA;"0.117990971711673";"0.00917030709557415";"1.36839370299823";NA;"8.99240692726065";"4.80536996504459";NA;"0.131585197619739";"3327.27640056555";0;"relative convergence (4)";"3.34215346972148";"6664.5528011311";"6664.59181283461";"6691.26345978402";"3331.50930506006"
6;"12 12 12 12 45 12";100;20;"Gauss";8;2;"nlminb limit";"0.0443774854854724";"-1.4947558012791";NA;"11.4520142283291";"3.36868158326015";NA;"0.144359883467122";"0.043991884848844";"-1.50552230796327";NA;"17.057278864444";"3.33877414883527";NA;"0.0875125496678988";"0.0448529145234312";"-1.51461230850546";NA;"14.1457640067985";"3.31717631051463";NA;"0.106141650746706";"2736.46015620067";0;"relative convergence (4)";"8.02184351285299";"5482.92031240134";"5482.95932410486";"5509.63097105427";"2741.35475341366"
6;"12 12 12 12 45 12";100;20;"Gauss";9;2;"nlminb limit";"0.0930245604317233";"1.01657146541402";NA;"4.02300844388083";"1.81937306314435";NA;"3.19852759027435";"0.0682742381204089";"1.28716934312166";NA;"5.85244569135637";"1.98857430931569";NA;"2.85838240397661";"0.0858775658293202";"1.08293848179147";NA;"4.11271926762076";"1.86628770212686";NA;"3.09387124774761";"2515.02525901149";0;"relative convergence (4)";"11.9202927430471";"5040.05051802297";"5040.08952972648";"5066.76117667589";"2516.61918771254"
6;"12 12 12 12 45 12";100;20;"Gauss";10;2;"nlminb limit";"0.159932665954629";"2.53870119410567";NA;"9.10826898226515";"0.270550956372349";NA;"11.5520880096015";"0.161044697047738";"2.06939503425535";NA;"12.0321188971641";"0.124050682696109";NA;"12.1792349659975";"0.159875233456556";"2.47721190828682";NA;"11.1054002403995";"0.277429607966155";NA;"12.0854369961379";"2451.51666530678";0;"relative convergence (4)";"19.7621584971746";"4913.03333061357";"4913.07234231708";"4939.74398926649";"2452.87112272773"
6;"12 12 12 12 45 12";100;20;"Gauss";11;2;"nlminb limit";"0.0152899360066583";"0.634064378216863";NA;"17.2722194534726";"4.32757808170902";NA;"0.245652625801389";"0.0197656339025589";"0.374832237797762";NA;"11.2893799314073";"4.09675765567746";NA;"0.287951267414163";"0.0165198631077819";"0.554337973472263";NA;"17.1995125311982";"4.22422566796157";NA;"0.290264665977787";"3408.89399892462";0;"relative convergence (4)";"4.17456944783529";"6827.78799784923";"6827.82700955274";"6854.49865650215";"3413.00503743707"
6;"12 12 12 12 45 12";100;20;"Gauss";12;2;"nlminb limit";"0.0243825940727135";"-0.644437455805019";NA;"17.0009723999538";"4.40284650832043";NA;"1.03428350906777";"0.0260031285847577";"-0.723027581914585";NA;"13.8341552110196";"4.30309133271208";NA;"1.06325764902824";"0.0247774491431015";"-0.641054657951854";NA;"13.8052200776946";"4.41404900116112";NA;"1.08923898201413";"3068.46886093717";0;"relative convergence (4)";"2.49562931060791";"6146.93772187434";"6146.97673357785";"6173.64838052727";"3069.99925006393"
6;"12 12 12 12 45 12";100;20;"Gauss";13;2;"nlminb limit";"0.0375341152026943";"0.506235799519345";NA;"19.665496324189";"3.91597885841905";NA;"12.8556053073722";"0.0244478005063788";"1.02132934659755";NA;"19.774601420117";"4.22748455500134";NA;"14.0585037884704";"0.042744660924826";"0.37444345299308";NA;"20.2708559924963";"3.79588742453303";NA;"13.8262084082002";"2782.34316951155";0;"relative convergence (4)";"2.35218127171199";"5574.6863390231";"5574.72535072661";"5601.39699767602";"2786.45492085676"
6;"12 12 12 12 45 12";100;20;"Gauss";14;2;"nlminb limit";"0.156057147499531";"0.311132465256378";NA;"15.0158445802517";"0.514142724919399";NA;"12.4812258772794";"0.157335593400356";"0.343711555398296";NA;"12.2627541268602";"0.305434039395848";NA;"11.8341773164754";"0.156767261820891";"0.337876278575298";NA;"14.1083862283478";"0.436578033923912";NA;"12.4701390427042";"2402.27114450002";0;"relative convergence (4)";"2.77533575693766";"4814.54228900005";"4814.58130070356";"4841.25294765297";"2403.04927982548"
6;"12 12 12 12 45 12";100;20;"Gauss";15;2;"nlminb limit";"0.0503216960792528";"0.0427949726581573";NA;"6.0940810716711";"3.42420476464765";NA;"0.492776226812751";"0.0288025281800601";"0.745898391933123";NA;"3.97548352845775";"3.98014296741647";NA;"0.60322192144779";"0.0478806329147277";"0.119374268414153";NA;"7.01972273116109";"3.44620487237798";NA;"0.530681334031586";"2944.79876833129";0;"relative convergence (4)";"12.6787022789319";"5899.59753666258";"5899.63654836609";"5926.3081953155";"2949.37651345242"
6;"12 12 12 12 45 12";100;20;"Gauss";16;2;"nlminb limit";"0.050134913764709";"2.45190707454458";NA;"17.524251928553";"1.94492687852774";NA;"2.01983563792579";"0.0482492198354321";"2.42319445650998";NA;"14.4035352614796";"1.98457840819445";NA;"2.0526774162384";"0.0514051104979125";"2.37459321187093";NA;"18.1339881583476";"1.95153636385902";NA;"2.07799084495988";"2282.98241599798";0;"relative convergence (4)";"5.93514323631922";"4575.96483199596";"4576.00384369947";"4602.67549064888";"2288.11393013857"
6;"12 12 12 12 45 12";100;20;"Gauss";17;2;"nlminb limit";"0.0530922935149741";"-1.9361453007441";NA;"5.07873998116702";"3.90476406834463";NA;"2.45327700222229";"0.0516548045294227";"-2.09635157698061";NA;"8.33005840539927";"3.92988974339763";NA;"2.74998233253424";"0.0535454265946513";"-2.09122936177211";NA;"6.83376456114219";"3.85701172206814";NA;"2.48381119788731";"3491.41519491703";0;"relative convergence (4)";"10.4814962188403";"6992.83038983406";"6992.86940153757";"7019.54104848698";"3496.73295749255"
6;"12 12 12 12 45 12";100;20;"Gauss";18;2;"nlminb limit";"0.0136169469639097";"1.56648469809443";NA;"12.7134396852925";"3.85535570271278";NA;"0.148881120949288";"0.0112708723559758";"1.77468352697073";NA;"10.6192788969212";"3.87814748919762";NA;"0.174653836170813";"0.0112917042492084";"1.77176500800465";NA;"10.6208990531945";"3.8992088382811";NA;"0.158774302871811";"2186.64709128979";0;"relative convergence (4)";"4.16482084194819";"4383.29418257957";"4383.33319428308";"4410.0048412325";"2189.61315697724"
6;"12 12 12 12 45 12";100;20;"Gauss";19;2;"nlminb limit";"0.14629278605227";"-0.0215632496401668";NA;"11.772887471132";"1.17865567504697";NA;"0.419821169787579";"0.151603922781995";"-0.0206243272996476";NA;"8.43256593862438";"1.0146826456031";NA;"0.431690724981536";"0.137889907220552";"-0.0234928407898968";NA;"11.1231774541832";"1.40405714990495";NA;"0.392871809817562";"1209.70009774519";0;"relative convergence (4)";"4.28001392682393";"2429.40019549037";"2429.43920719389";"2456.1108541433";"1211.27521551441"
6;"12 12 12 12 45 12";100;20;"Gauss";20;2;"nlminb limit";"0.148936291287997";"-1.31383628048934";NA;"18.2246877835132";"0.825364506540621";NA;"0.0526031618752185";"0.148381680564724";"-1.33254718819647";NA;"20.0821721122782";"0.850430636653112";NA;"0.0429649660628277";"0.149343405219409";"-1.31603947155134";NA;"22.4669848811323";"0.815406839149197";NA;"0.0540232655657312";"1604.2047842648";0;"relative convergence (4)";"17.5131340781848";"3218.40956852959";"3218.4485802331";"3245.12022718252";"1605.54011364625"
6;"12 12 12 12 45 12";100;20;"Gauss";21;2;"nlminb limit";"0.172251005103811";"-1.42891172599047";NA;"2.61686801211908";"0.29898875452212";NA;"6.55786424257047";"0.171522024651719";"-1.43859760504286";NA;"3.76238697758684";"0.293434020405959";NA;"7.60592059982484";"0.171287222108877";"-1.45773104100239";NA;"3.03691186848512";"0.307829278063337";NA;"6.81431511171308";"2960.59539927808";0;"relative convergence (4)";"2.39884005784988";"5931.19079855616";"5931.22981025967";"5957.90145720908";"2961.22754384451"
6;"12 12 12 12 45 12";100;20;"Gauss";22;2;"nlminb limit";"0.0368653464152884";"-0.342789445305243";NA;"8.7714533219114";"3.95517000752541";NA;"0.0177270626969142";"0.0373589997414046";"-0.366426984845777";NA;"9.63356621380534";"3.9294627482738";NA;"0.0536926787162246";"0.0367626115730989";"-0.340197503525811";NA;"8.8889326774045";"3.9604678831135";NA;"0.0202917046417511";"3301.58108059267";0;"relative convergence (4)";"6.55099897782008";"6613.16216118533";"6613.20117288885";"6639.87281983826";"3302.49960296701"
6;"12 12 12 12 45 12";100;20;"Gauss";23;2;"nlminb limit";"0.154423450373159";"0.566892477916554";NA;"19.8963575283997";"0.285904429706787";NA;"0.395165586569003";"0.154369670225198";"0.56981919970597";NA;"12.605694191752";"0.297408739616798";NA;"0.506874780976106";"0.153361266351549";"0.5752477142279";NA;"30";"0.354642274391683";NA;"0.367498228046522";"1069.1641032772";0;"relative convergence (4)";"3.06090029478073";"2148.32820655439";"2148.3672182579";"2175.03886520732";"1070.98935661748"
6;"12 12 12 12 45 12";100;20;"Gauss";24;2;"nlminb limit";"0.0133576325855823";"1.48038063733838";NA;"7.49044775590301";"4.47586326438653";NA;"0.0736103450823922";"0.0184400066251006";"1.15225496685246";NA;"5.32006931476473";"4.26125530967989";NA;"0.0928589535920465";"0.0126378796102731";"1.54375645513793";NA;"6.71415574458178";"4.47569621390318";NA;"0.0806046206802905";"2411.51705439213";0;"relative convergence (4)";"8.89481642246246";"4833.03410878426";"4833.07312048777";"4859.74476743719";"2413.79353428779"
6;"12 12 12 12 45 12";100;20;"Gauss";25;2;"nlminb limit";"0.0432183351894618";"1.89478602563031";NA;"9.52801376767457";"2.42757195558052";NA;"4.14897371310254";"0.0334360559107174";"2.12636870893562";NA;"11.4780214919849";"2.55199094444313";NA;"4.4972708135357";"0.0426083686869984";"1.94008648571952";NA;"9.72396399147089";"2.41990494312422";NA;"4.45205730940555";"3296.94406017279";0;"relative convergence (4)";"4.0635977824529";"6603.88812034559";"6603.9271320491";"6630.59877899851";"3300.05206762588"
6;"12 12 12 12 45 12";100;20;"Gauss";26;2;"nlminb limit";"0.0211429411256068";"-0.0217864271253347";NA;"19.436360895168";"4.7615017183474";NA;"0.180731423028482";"0.0199546817078731";"0.0584964580506302";NA;"23.5022107125142";"4.86276006380562";NA;"0.187620734704216";"0.0202194430691959";"0.0479410545396651";NA;"19.5954535771104";"4.83586082157402";NA;"0.178511067824575";"3357.28171858832";0;"relative convergence (4)";"4.76863970359166";"6724.56343717663";"6724.60244888015";"6751.27409582956";"3356.69948940557"
6;"12 12 12 12 45 12";100;20;"Gauss";27;2;"nlminb limit";"0.149022654103302";"-0.918937308480963";NA;"4.45669872546569";"0.733506971904822";NA;"0.255844616440398";"0.149852483926825";"-0.870755701466672";NA;"8.3472758012558";"0.616273053123826";NA;"0.377518473964802";"0.151415579067068";"-0.90118531362854";NA;"5.11957169549325";"0.615992452529612";NA;"0.235361561195633";"1501.55890485968";0;"relative convergence (4)";"4.42560841242472";"3013.11780971935";"3013.15682142286";"3039.82846837227";"1507.77943618742"
6;"12 12 12 12 45 12";100;20;"Gauss";28;2;"nlminb limit";"0.109441638297817";"-1.12934095948003";NA;"11.6054057050496";"2.00906687108823";NA;"0.136289933143203";"0.110124246080705";"-1.1473833915847";NA;"10.8221651417268";"2.01199428703331";NA;"0.196777997624088";"0.110566142906327";"-1.15199872281511";NA;"15.0089648131935";"1.97374126855782";NA;"0.131847531751808";"2222.29102041899";0;"relative convergence (4)";"11.4626617630323";"4454.58204083798";"4454.62105254149";"4481.2926994909";"2225.79808394759"
6;"12 12 12 12 45 12";100;20;"Gauss";1;2;"nlminb limit";"0.0272196895587414";"0.846895528491586";NA;"12.9815534492955";"3.97153364811745";NA;"1.94877253287381";"0.0195036770046714";"1.20592050948796";NA;"14.1946146705365";"4.1803056008203";NA;"2.04001763527067";"0.0242567493310567";"0.973782297379886";NA;"15.19950569783";"4.06681849765989";NA;"2.07246439344549";"3679.12010742194";0;"relative convergence (4)";"5.52981314261754";"7368.24021484388";"7368.27922654739";"7394.9508734968";"3682.78847519428"
6;"12 12 12 12 45 12";100;20;"Gauss";2;2;"nlminb limit";"0.159598489302286";"-0.375664743361995";NA;"7.27766307303682";"0.446076307731456";NA;"0.415930984495165";"0.155498838558049";"-0.401947611011351";NA;"10.4455458198082";"0.667729745008268";NA;"0.35865657354676";"0.158425632686883";"-0.387913981938671";NA;"9.09347112216185";"0.512699045965613";NA;"0.354921208066073";"1269.72816992451";0;"relative convergence (4)";"10.2488338510195";"2549.45633984902";"2549.49535155254";"2576.16699850195";"1272.41726055984"
6;"12 12 12 12 45 12";100;20;"Gauss";3;2;"nlminb limit";"0.0719550077378574";"0.130166961578652";NA;"18.4879734329879";"2.49426376930042";NA;"0.258718415811593";"0.0818767629065374";"0.0635995351620936";NA;"10.9414629751201";"2.35603917596284";NA;"0.513979368826117";"0.0696261262658869";"0.158509983284311";NA;"15.8338703429246";"2.53919662589079";NA;"0.257679154835332";"1610.03469804277";0;"relative convergence (4)";"9.9675628900528";"3230.06939608554";"3230.10840778905";"3256.78005473846";"1610.88389913935"
6;"12 12 12 12 45 12";100;20;"Gauss";4;2;"nlminb limit";"0.0797289612295295";"-0.0143021687399596";NA;"12.8118871077895";"2.28462357191899";NA;"0.158243173726979";"0.0798087802212609";"0.0204086122054818";NA;"6.05025622319011";"2.2829197517709";NA;"0.223271752151055";"0.0804133996458061";"-0.00176037892067404";NA;"14.005860806961";"2.25739428042317";NA;"0.17598383245951";"1437.70838912261";0;"relative convergence (4)";"13.1886633872986";"2885.41677824521";"2885.45578994872";"2912.12743689813";"1439.71953136469"
6;"12 12 12 12 45 12";100;20;"Gauss";5;2;"nlminb limit";"0.165355793624525";"-0.149866502499208";NA;"17.7089818115346";"0.262775772016547";NA;"9.72869062069777";"0.146300229166725";"-0.145490383147189";NA;"23.8699616342155";"1.10978331723286";NA;"9.67516119107425";"0.160079833405919";"-0.152318545626751";NA;"13.7935736906039";"0.636630061082383";NA;"9.10239314570756";"2670.89599468701";0;"relative convergence (4)";"3.39142540693283";"5351.79198937402";"5351.83100107753";"5378.50264802694";"2671.30840309542"
6;"12 12 12 12 45 12";100;20;"Gauss";6;2;"nlminb limit";"0.170431994710039";"1.77132982714102";NA;"2.6952804941684";"0.202543739441925";NA;"0.0139194844155375";"0.169864966050188";"1.76131251012279";NA;"1.9966592853095";"0.273007371074551";NA;"0.0604353092960148";"0.170136220797648";"1.7605196442538";NA;"2.83472622654239";"0.215124087713124";NA;"0.00776049497908365";"731.381217516315";0;"relative convergence (4)";"2.20553311506907";"1472.76243503263";"1472.80144673614";"1499.47309368555";"733.047667854097"
6;"12 12 12 12 45 12";100;20;"Gauss";7;2;"nlminb limit";"0.156619103109791";"1.34351623780094";NA;"12.7184963575564";"0.714009706127093";NA;"4.6054079116489";"0.156986951716579";"1.33019822532497";NA;"12.6590554057228";"0.723331996367625";NA;"4.79876574234784";"0.155586584927917";"1.34090477418098";NA;"18.8974295430874";"0.703657890431692";NA;"4.74504600055618";"2504.38894247728";0;"relative convergence (4)";"3.61674356857936";"5018.77788495457";"5018.81689665808";"5045.48854360749";"2507.27308163175"
6;"12 12 12 12 45 12";100;20;"Gauss";8;2;"nlminb limit";"0.0884460631099108";"1.6791023646947";NA;"7.50223202444613";"1.7881152305188";NA;"0.0177757487798819";"0.122773195811374";"1.42423774874038";NA;"15.6679041024362";"1.54486488808088";NA;"0.232904589201159";"0.090338501287515";"1.65143294301861";NA;"7.55175578685961";"1.77390339792454";NA;"0.0139142809009226";"643.311943608173";0;"relative convergence (4)";"4.1241216580073";"1296.62388721635";"1296.66289891986";"1323.33454586927";"645.539848391554"
6;"12 12 12 12 45 12";100;20;"Gauss";9;2;"nlminb limit";"0.160361994346612";"2.4948182173539";NA;"7.01499695936218";"0.208105220039871";NA;"0.0329412237589356";"0.160348952343194";"2.47427527712599";NA;"12.8130619796259";"0.2133425955337";NA;"0.0604064874374217";"0.160481794817939";"2.41454732152914";NA;"6.90007739486292";"0.189266560055689";NA;"0.0229296576521873";"728.454008923289";0;"relative convergence (4)";"1.13838868935903";"1466.90801784658";"1466.94702955009";"1493.6186764995";"728.903721442799"
6;"12 12 12 12 45 12";100;20;"Gauss";10;2;"nlminb limit";"0.0180172780582299";"2.67390898382291";NA;"8.43964620074257";"2.77816898928433";NA;"13.1175499159852";"0.0186277209144026";"2.70113022574334";NA;"11.9074548592352";"2.72799035992773";NA;"14.9655946933462";"0.0176881778139763";"2.70405719066467";NA;"10.1016890862598";"2.7817712749503";NA;"14.0893241140306";"2839.22418548323";0;"relative convergence (4)";"7.93241174221039";"5688.44837096645";"5688.48738266996";"5715.15902961937";"2840.84815342537"
6;"12 12 12 12 45 12";100;20;"Gauss";11;2;"nlminb limit";"0.157841508947249";"1.4672709973529";NA;"6.43091711681336";"0.302822031439106";NA;"0.334943939952807";"0.158330686600244";"1.47843198782791";NA;"7.8712584306873";"0.203856016991283";NA;"0.331622286819976";"0.158449939389191";"1.457668702277";NA;"7.18966237771186";"0.188740473402241";NA;"0.357278467240538";"1071.78929209394";0;"relative convergence (4)";"1.96188941399256";"2153.57858418788";"2153.61759589139";"2180.2892428408";"1072.62476815692"
6;"12 12 12 12 45 12";100;20;"Gauss";12;2;"nlminb limit";"0.0575402050910595";"1.21871867752634";NA;"13.0903184539638";"2.43563363646735";NA;"0.418574198279492";"0.0572667211845272";"1.18530184334723";NA;"18.4921434502557";"2.44994389441308";NA;"0.371013232298994";"0.0572076063998737";"1.21714149683648";NA;"15.1494944018622";"2.43627168553118";NA;"0.384885961277662";"1318.61064390892";0;"relative convergence (4)";"7.76344884236654";"2647.22128781784";"2647.26029952135";"2673.93194647076";"1319.8269875153"
6;"12 12 12 12 45 12";100;20;"Gauss";13;2;"nlminb limit";"0.0398677123411798";"-1.18808982823975";NA;"2.94065186241642";"4.52777682136239";NA;"0.46420778233522";"0.0402455867305145";"-1.20723972321763";NA;"2.89973785081056";"4.51256039493219";NA;"0.438411729022896";"0.0399547639959627";"-1.14860297106086";NA;"2.73144954151903";"4.53715567914727";NA;"0.433893286756473";"3743.14956679879";0;"relative convergence (4)";"6.4769279718399";"7496.29913359758";"7496.33814530109";"7523.0097922505";"3746.55883920987"
6;"12 12 12 12 45 12";100;20;"Gauss";14;2;"nlminb limit";"0.0442747351394093";"0.204720946028829";NA;"5.71533123170957";"3.22050087066447";NA;"1.33541214796148";"0.0446703581898063";"0.163533689889092";NA;"11.2611734946491";"3.13885944135304";NA;"1.21704549261629";"0.0419619599476903";"0.2498531050545";NA;"6.6400029122516";"3.26082688663553";NA;"1.35564466363748";"3379.14770448552";0;"relative convergence (4)";"16.2509592533112";"6768.29540897105";"6768.33442067456";"6795.00606762397";"3381.99514789345"
6;"12 12 12 12 45 12";100;20;"Gauss";15;2;"nlminb limit";"0.0435001511921699";"0.670156526146457";NA;"4.96391312545165";"3.20032684254146";NA;"2.81858546052589";"0.0373502460716234";"0.881845374449709";NA;"4.19881290668894";"3.26717585762876";NA;"2.79878759539913";"0.041217925670958";"0.72811776018409";NA;"4.79878035307177";"3.24268924523327";NA;"2.87413171589312";"3278.25866280368";0;"relative convergence (4)";"9.43011687199275";"6566.51732560736";"6566.55633731087";"6593.22798426028";"3278.77484401406"
6;"12 12 12 12 45 12";100;20;"Gauss";16;2;"nlminb limit";"0.134872940419323";"0.159903729334474";NA;"13.717114625033";"1.46177099813184";NA;"4.26525744514315";"0.148715144646359";"0.191025431176169";NA;"12.0212334764934";"1.10859784918038";NA;"4.31946220421392";"0.134440674248226";"0.16522863878415";NA;"11.6859668717498";"1.47328542444922";NA;"4.23161739315201";"2801.87990337412";0;"relative convergence (4)";"3.299671626091";"5613.75980674824";"5613.79881845176";"5640.47046540117";"2802.37504272779"
6;"12 12 12 12 45 12";100;20;"Gauss";17;2;"nlminb limit";"0.167510756316761";"-0.0212502484209836";NA;"11.2768260021694";"0.858421143320574";NA;"11.7439110740725";"0.160288463908199";"-0.0346267560281443";NA;"13.7605542683378";"1.05736100511169";NA;"11.688206093439";"0.145601081236723";"-0.000524417719147264";NA;"10.3297928364419";"1.47146911756362";NA;"10.979705125117";"2754.82785663626";0;"relative convergence (4)";"9.78584697643916";"5519.65571327252";"5519.69472497603";"5546.36637192544";"2757.39407609526"
6;"12 12 12 12 45 12";100;20;"Gauss";18;2;"nlminb limit";"0.0518725861009973";"0.102324937004596";NA;"5.72312268009409";"3.02363119257207";NA;"0.158134325652759";"0.0505048895363417";"0.126763215430468";NA;"7.84288947198258";"3.04332996918153";NA;"0.212502181523451";"0.051745301889465";"0.108122356871908";NA;"6.22016101524035";"3.01894039603346";NA;"0.176515572629663";"2102.81433449641";0;"relative convergence (4)";"4.7371127764384";"4215.62866899282";"4215.66768069633";"4242.33932764574";"2103.76215672407"
6;"12 12 12 12 45 12";100;20;"Gauss";19;2;"nlminb limit";"0.0660311349301492";"-0.378203661413863";NA;"3.11608796659857";"3.62112660823603";NA;"13.7782673112771";"0.0486502524639777";"-0.237132091926324";NA;"5.13814181013423";"4.27330898075044";NA;"13.31336799377";"0.0645186714185512";"-0.344625670363407";NA;"3.14976483167408";"3.63318307500513";NA;"14.1526622936822";"2746.12409792332";0;"relative convergence (4)";"7.00256822109222";"5502.24819584664";"5502.28720755015";"5528.95885449956";"2748.14928617928"
6;"12 12 12 12 45 12";100;20;"Gauss";20;2;"nlminb limit";"0.112552663665366";"1.74391146237031";NA;"14.7461283640005";"1.56261206381098";NA;"11.802606839422";"0.129450618113387";"1.55979395323237";NA;"9.22274674539623";"1.48244820052708";NA;"10.4913233207844";"0.114582334588562";"1.73158514470119";NA;"15.2382605927958";"1.54616133937137";NA;"12.420665679972";"2745.92390796025";0;"relative convergence (4)";"10.1680864771207";"5501.8478159205";"5501.88682762401";"5528.55847457342";"2748.46902223376"
6;"12 12 12 12 45 12";100;20;"Gauss";21;2;"nlminb limit";"0.146080929809807";"2.83975294511765";NA;"9.83585011679679";"0.830235054778989";NA;"0.0148963546983316";"0.145838565471494";"2.41892784239009";NA;"10.2543871138536";"0.848453555064175";NA;"0.0216796039843484";"0.144602312317186";"2.19834303429445";NA;"16.9651703880093";"0.875757163252655";NA;"0.0104301351354295";"522.446438845367";0;"relative convergence (4)";"9.14550534089406";"1054.89287769073";"1054.93188939424";"1081.60353634366";"508.501265878708"
6;"12 12 12 12 45 12";100;20;"Gauss";22;2;"nlminb limit";"0.0170644718419979";"1.23801328777336";NA;"13.6433547278866";"4.6838491269031";NA;"0.443709056157696";"0.0216607308600709";"0.998080363958015";NA;"18.5842880728022";"4.4277708772033";NA;"0.568786483249751";"0.0179329539766676";"1.19285669668486";NA;"13.5577289634352";"4.62948015905633";NA;"0.477400058949334";"3127.93090768749";0;"relative convergence (4)";"3.04823026657105";"6265.86181537497";"6265.90082707849";"6292.5724740279";"3128.84434424618"
6;"12 12 12 12 45 12";100;20;"Gauss";23;2;"nlminb limit";"0.14477803066759";"-0.494145652512088";NA;"9.1857580258511";"1.31694120147866";NA;"0.0666994043742061";"0.140473368822658";"-0.442950542808354";NA;"8.34799022174753";"1.42577346985509";NA;"0.144060751495267";"0.144927753914197";"-0.486262293933051";NA;"10.4573552160028";"1.31027728680027";NA;"0.0737381278257956";"1111.41030970413";0;"relative convergence (4)";"14.9201005180677";"2232.82061940826";"2232.85963111177";"2259.53127806118";"1112.30679408841"
6;"12 12 12 12 45 12";100;20;"Gauss";24;2;"nlminb limit";"0.0523716239165261";"0.204564572311938";NA;"12.873277457431";"2.9057731999711";NA;"0.0624927215824987";"0.0490998573007335";"0.316268154051654";NA;"17.6397043555588";"2.92770261484965";NA;"0.102829271138886";"0.0514716935932081";"0.238595039719921";NA;"10.5985206260451";"2.91469458633138";NA;"0.0606288178523685";"1721.12600815034";0;"relative convergence (4)";"5.56025277376175";"3452.25201630068";"3452.29102800419";"3478.9626749536";"1724.36795809407"
6;"12 12 12 12 45 12";100;20;"Gauss";25;2;"nlminb limit";"0.0733066720815398";"-1.27409304655157";NA;"9.92302113026381";"2.58114933988114";NA;"0.126658346583799";"0.0747067988293948";"-1.35490726527413";NA;"9.16559894901158";"2.51479380330654";NA;"0.142115855613346";"0.0734758917727125";"-1.27783571518737";NA;"9.46933860931304";"2.57832355539187";NA;"0.127263501844329";"3170.61319216388";0;"relative convergence (4)";"9.3535788098971";"6351.22638432776";"6351.26539603127";"6377.93704298068";"3170.77536277295"
6;"12 12 12 12 45 12";100;20;"Gauss";26;2;"nlminb limit";"0.0312365877728562";"0.0371566247195005";NA;"3.25450358493254";"3.86486674148339";NA;"0.0449823178371559";"0.0372221542862206";"-0.16958183846563";NA;"3.29177323631088";"3.60531043825716";NA;"0.0161109171184342";"0.032236540634276";"0.00513093825201273";NA;"3.32402859804336";"3.79696598899526";NA;"0.0428370471780922";"3129.26692912707";0;"relative convergence (4)";"7.28325165510178";"6268.53385825415";"6268.57286995766";"6295.24451690707";"3131.05358256147"
6;"12 12 12 12 45 12";100;20;"Gauss";27;2;"nlminb limit";"0.104290063955782";"-1.63058487395756";NA;"14.2636084714904";"2.19269287730364";NA;"12.9716712198371";"0.100702580573487";"-1.68583260107923";NA;"11.5093211246891";"2.30771583722477";NA;"11.2901945102141";"0.100443534483423";"-1.65612044797692";NA;"13.9353253200029";"2.27928085341571";NA;"11.9372354458272";"2475.87040128175";0;"relative convergence (4)";"5.65272570848465";"4961.7408025635";"4961.77981426701";"4988.45146121642";"2478.13856763655"
6;"12 12 12 12 45 12";100;20;"Gauss";28;2;"nlminb limit";"0.16818157132024";"1.68622704874724";NA;"9.08114794734866";"0.621672876623512";NA;"6.77778207660325";"0.167304320051259";"1.70534050804378";NA;"11.1364731157643";"0.619724968531798";NA;"6.92972066008391";"0.167233367534118";"1.68133598457973";NA;"11.1190446632718";"0.645335672970496";NA;"6.85773083489814";"2832.41529141668";0;"relative convergence (4)";"20.725829064846";"5674.83058283337";"5674.86959453688";"5701.54124148629";"2834.81119459429"
6;"12 12 12 12 45 12";100;20;"Gauss";1;2;"nlminb limit";"0.0711338917079893";"-1.77432569838129";NA;"9.78516085492447";"3.12366752058289";NA;"0.0404966841691883";"0.0701750788098461";"-1.75285041331876";NA;"9.06278398459705";"3.15999289053043";NA;"0.0199789476289568";"0.0706962287378212";"-1.76029467575564";NA;"8.97719455837435";"3.1439986236577";NA;"0.0423742399218004";"3203.90588400131";0;"relative convergence (4)";"5.74064921935399";"6417.81176800261";"6417.85077970612";"6444.52242665554";"3204.81236214211"
6;"12 12 12 12 45 12";100;20;"Gauss";2;2;"nlminb limit";"0.163841383566699";"-0.631266952725127";NA;"2.6326334415935";"0.200315440368194";NA;"0.0362946592030225";"0.163500158539135";"-0.624690787546398";NA;"3.14676064155794";"0.187939654243698";NA;"0.0502368942474364";"0.163873055262279";"-0.638261595652998";NA;"2.54634459932342";"0.202739199961178";NA;"0.0306990222022649";"1058.92794020409";0;"relative convergence (4)";"2.13961089849472";"2127.85588040818";"2127.89489211169";"2154.5665390611";"1059.66904845256"
6;"12 12 12 12 45 12";100;20;"Gauss";3;2;"nlminb limit";"0.0662176927938549";"-0.164198549930006";NA;"3.51962012285367";"2.90621099793555";NA;"0.0250917286536487";"0.0644559960292634";"-0.147175384180371";NA;"3.69389678890312";"2.95459478209711";NA;"0.0283212306866022";"0.0648598286402467";"-0.151367641898581";NA;"3.61428228981714";"2.94552636198609";NA;"0.0276049256109976";"1784.42266917859";0;"relative convergence (4)";"3.78704639673233";"3578.84533835717";"3578.88435006069";"3605.5559970101";"1787.30925680037"
6;"12 12 12 12 45 12";100;20;"Gauss";4;2;"nlminb limit";"0.0302725417450619";"-1.00452873320319";NA;"13.6816704566591";"4.00008829828395";NA;"0.219010453250422";"0.0318866815028815";"-1.06035127407712";NA;"14.2203733285401";"3.84282220349067";NA;"0.259523747359202";"0.0315970823356712";"-1.05335604693034";NA;"12.2504653076703";"3.88960317537721";NA;"0.244984966226217";"2804.67610531369";0;"relative convergence (4)";"3.88013776143392";"5619.35221062738";"5619.3912223309";"5646.06286928031";"2807.88583057434"
6;"12 12 12 12 45 12";100;20;"Gauss";5;2;"nlminb limit";"0.14999789685787";"0.982043285155669";NA;"11.4258568231016";"0.965407154809755";NA;"0.0626159628044245";"0.149964439985647";"0.983762581907763";NA;"19.0914678114198";"0.962665988091528";NA;"0.170011828839595";"0.149748466019031";"0.979738868069199";NA;"11.5412231288084";"0.962730303205473";NA;"0.0567562922291729";"852.022521547432";0;"relative convergence (4)";"5.96923091014226";"1714.04504309486";"1714.08405479837";"1740.75570174779";"853.86463958533"
6;"12 12 12 12 45 12";100;20;"Gauss";6;2;"nlminb limit";"0.0980231478074188";"-1.15604882175103";NA;"17.6142148030922";"1.98463705597923";NA;"13.333332721744";"0.0906676106315331";"-1.11493947310015";NA;"8.33067524609774";"2.12591929959133";NA;"8.46529861821832";"0.0984641078132353";"-1.21151913379098";NA;"21.8484023133977";"1.95118854011591";NA;"12.9799979506749";"2252.91034458033";0;"relative convergence (4)";"10.0335486928622";"4515.82068916066";"4515.85970086417";"4542.53134781358";"2255.26295963324"
6;"12 12 12 12 45 12";100;20;"Gauss";7;2;"nlminb limit";"0.0890926459627526";"0.0166438072919846";NA;"3.99809711333364";"2.31784852041787";NA;"0.0463026282533062";"0.097837424312177";"-0.0504895566825095";NA;"7.18030613442154";"2.17316150404606";NA;"0.158936204420357";"0.090420104931406";"0.007134047072687";NA;"4.14405223457732";"2.29259342290799";NA;"0.0503240461063156";"1211.43111772734";0;"relative convergence (4)";"9.88104487657547";"2432.86223545469";"2432.9012471582";"2459.57289410761";"1211.8074095879"
6;"12 12 12 12 45 12";100;20;"Gauss";8;2;"nlminb limit";"0.0324556958111823";"-0.33918126183562";NA;"9.25655752280727";"3.87692286585391";NA;"9.55781621616256";"0.0373328208932274";"-0.634311452436695";NA;"21.5136441524974";"3.59054476506285";NA;"10.8607021516771";"0.0351255942255128";"-0.465334032505584";NA;"11.4693804947875";"3.72386355481924";NA;"10.0083087559143";"2440.5406685741";0;"relative convergence (4)";"2.71137603918711";"4891.0813371482";"4891.12034885171";"4917.79199580112";"2442.84889325577"
6;"12 12 12 12 45 12";100;20;"Gauss";9;2;"nlminb limit";"0.0173209344089679";"2.38016836065799";NA;"9.15050256764516";"3.03687245471625";NA;"6.38282920102309";"0.0160151986156851";"2.42746754430966";NA;"13.7842599491052";"3.04768608901744";NA;"6.80807395544214";"0.0191039106736633";"2.30973313352643";NA;"9.51093888918606";"2.96913856805282";NA;"6.34544749489738";"3117.7614350352";0;"relative convergence (4)";"6.89954373439153";"6245.5228700704";"6245.56188177391";"6272.23352872332";"3119.22280177141"
6;"12 12 12 12 45 12";100;20;"Gauss";10;2;"nlminb limit";"0.077903531420321";"-1.2633995343931";NA;"17.4337157527916";"2.86699011979734";NA;"1.95933043168717";"0.078981420908419";"-1.32082398526042";NA;"15.8499377760942";"2.81756049581862";NA;"1.73423933985192";"0.07632862888481";"-1.23774148856955";NA;"16.9254315474875";"2.91554794578894";NA;"1.78628561900802";"4071.17869209987";0;"relative convergence (4)";"8.64605497121811";"8152.35738419974";"8152.39639590325";"8179.06804285266";"4074.41125787478"
6;"12 12 12 12 45 12";100;20;"Gauss";11;2;"nlminb limit";"0.0497115361293018";"0.345542530529201";NA;"14.3978134617209";"3.07029465293415";NA;"0.133025992087458";"0.0500696933200002";"0.320213463573368";NA;"16.5905932524996";"3.08539022835063";NA;"0.10771642762997";"0.0484995489231836";"0.378031815745658";NA;"13.7438356491914";"3.0953836128769";NA;"0.145302219957615";"1846.9402135147";0;"relative convergence (4)";"6.94419430494308";"3703.88042702941";"3703.91943873292";"3730.59108568233";"1848.12401363848"
6;"12 12 12 12 45 12";100;20;"Gauss";12;2;"nlminb limit";"0.0865357026567602";"1.86636227951385";NA;"3.43945872318";"1.85274385870908";NA;"13.945844518221";"0.0666980449200209";"1.92363433046712";NA;"5.12112161011104";"2.11916994335019";NA;"15.7133567912567";"0.0894988220418179";"1.82529230904399";NA;"3.41128213510015";"1.84509237509397";NA;"13.6265793039613";"2916.40541625376";0;"relative convergence (4)";"15.28740127484";"5842.81083250753";"5842.84984421104";"5869.52149116045";"2918.70099180569"
6;"12 12 12 12 45 12";100;20;"Gauss";13;2;"nlminb limit";"0.0170461242366517";"-0.176629181252792";NA;"11.355339222122";"4.87060838707419";NA;"0.0600021895391679";"0.0198898523666875";"-0.331474796583969";NA;"8.5298245541566";"4.63710502971855";NA;"0.0395773430510762";"0.0186645753357911";"-0.263920206946644";NA;"10.4741742485545";"4.74771714102308";NA;"0.0809133129446245";"2779.26326319037";0;"relative convergence (4)";"6.42580987612406";"5568.52652638074";"5568.56553808425";"5595.23718503366";"2784.76489679071"
6;"12 12 12 12 45 12";100;20;"Gauss";14;2;"nlminb limit";"0.0143326505862422";"1.01673077046871";NA;"14.1178724090569";"4.27877799534606";NA;"0.0727644106524973";"0.0165851997608106";"0.861961048069055";NA;"18.1031271697546";"4.17142894814266";NA;"0.0661245727644144";"0.0146783587155581";"0.995653749752186";NA;"15.2799997071706";"4.27369417835477";NA;"0.0645405129033865";"2918.93683364124";0;"relative convergence (4)";"1.864615046978";"5847.87366728249";"5847.912678986";"5874.58432593541";"2921.65178991419"
6;"12 12 12 12 45 12";100;20;"Gauss";15;2;"nlminb limit";"0.0321547522767159";"1.37415705900639";NA;"11.3532574423589";"2.76898402333306";NA;"0.0373853376979043";"0.0245808413574643";"1.62395678127748";NA;"8.22791892466111";"2.90423912366724";NA;"0.0207288774829129";"0.029243095357025";"1.45096103050507";NA;"11.7371422502817";"2.82477465084007";NA;"0.0296830125409136";"1261.54654024015";0;"relative convergence (4)";"3.64111181894938";"2533.09308048029";"2533.1320921838";"2559.80373913322";"1267.7232641136"
6;"12 12 12 12 45 12";100;20;"Gauss";16;2;"nlminb limit";"0.165081105912486";"2.8118276707828";NA;"18.3408007710241";"0.238558015618898";NA;"0.111839015938893";"0.165215712825408";"2.86901905053164";NA;"19.6866910970801";"0.234203589480287";NA;"0.140463800789817";"0.164869246797556";"2.87959246245868";NA;"23.7811281333121";"0.242864221900578";NA;"0.128132698143348";"803.704849080241";0;"relative convergence (4)";"1.14033444325129";"1617.40969816048";"1617.44870986399";"1644.1203568134";"804.42741514266"
6;"12 12 12 12 45 12";100;20;"Gauss";17;2;"nlminb limit";"0.0192883596197963";"2.76167706074193";NA;"18.5954293645918";"2.94363488937392";NA;"6.63245294615161";"0.0229079204229418";"2.60003506395906";NA;"18.9839372198083";"2.8732292388915";NA;"7.1353693057953";"0.0178380396329926";"2.81793101955738";NA;"27.1426781086599";"2.96231705786896";NA;"6.78115381660349";"3448.6654181145";0;"relative convergence (4)";"5.42849168380102";"6907.33083622901";"6907.36984793252";"6934.04149488193";"3449.87043221388"
6;"12 12 12 12 45 12";100;20;"Gauss";18;2;"nlminb limit";"0.0295655692583527";"0.962028395850211";NA;"8.70249191345647";"3.68283403140554";NA;"0.633379416617496";"0.0384695060393659";"0.666533427387559";NA;"6.34739806371247";"3.50613607523804";NA;"0.673231894300177";"0.0301576755689229";"0.937693926213386";NA;"7.56025135820358";"3.67683024856004";NA;"0.567008622649393";"2570.32269171022";0;"relative convergence (4)";"7.62357019583384";"5150.64538342043";"5150.68439512394";"5177.35604207336";"2574.05595876689"
6;"12 12 12 12 45 12";100;20;"Gauss";19;2;"nlminb limit";"0.154552674816681";"2.63623073417693";NA;"18.4231994808652";"0.876525960689103";NA;"0.521793434419132";"0.154810605696168";"2.69366527702184";NA;"21.3833730234114";"0.870925665553778";NA;"0.606703259030064";"0.153888497961978";"2.58937203064369";NA;"17.4932633644352";"0.889638711552295";NA;"0.58270788733449";"774.67072995691";0;"relative convergence (4)";"4.07483924627304";"1559.34145991382";"1559.38047161733";"1586.05211856674";"776.897278011814"
6;"12 12 12 12 45 12";100;20;"Gauss";20;2;"nlminb limit";"0.0419148084284801";"-0.505611456930637";NA;"13.1490521593951";"3.3819028237038";NA;"0.494142332581354";"0.042229388840964";"-0.501588856852303";NA;"13.7810496959348";"3.36865128217398";NA;"0.497323014527231";"0.0437764779243976";"-0.558860518053291";NA;"13.9012854948801";"3.29326721053386";NA;"0.498554671730597";"3587.09285478463";0;"relative convergence (4)";"9.89987785418828";"7184.18570956925";"7184.22472127276";"7210.89636822217";"3589.99299116148"
6;"12 12 12 12 45 12";100;20;"Gauss";21;2;"nlminb limit";"0.1461986320001";"-0.796407498884946";NA;"14.8186282096431";"1.22760000594683";NA;"0.552341706454915";"0.144739483443191";"-0.79134882037209";NA;"6.84103027327264";"1.30761488889877";NA;"0.524838374990399";"0.146970846167097";"-0.811461030424738";NA;"14.4507132968048";"1.2105512970111";NA;"0.558377109371501";"1621.60520276531";0;"relative convergence (4)";"3.66496088107427";"3253.21040553062";"3253.24941723413";"3279.92106418354";"1622.21664833769"
6;"12 12 12 12 45 12";100;20;"Gauss";22;2;"nlminb limit";"0.016386621431785";"1.43645468936302";NA;"19.3822872680612";"3.7312264407002";NA;"0.0255005857827426";"0.0156920240241506";"1.50107727098778";NA;"16.8303205454593";"3.69200542584927";NA;"0.0426156639769303";"0.0147640476817152";"1.55598402355277";NA;"17.3023619649669";"3.72315029084015";NA;"0.0199066568034461";"1788.18706993635";0;"relative convergence (4)";"8.6638526558876";"3586.3741398727";"3586.41315157621";"3613.08479852563";"1794.48856738284"
6;"12 12 12 12 45 12";100;20;"Gauss";23;2;"nlminb limit";"0.0540269287082935";"1.44199772225693";NA;"9.19275201577693";"2.20090609774423";NA;"7.99097438434636";"0.0577714856480894";"1.32254242174919";NA;"8.62969579484554";"2.21328173320491";NA;"8.01733886263005";"0.0603280361122262";"1.39378592714163";NA;"8.17824374639344";"2.12203123405144";NA;"8.04760485051792";"2932.63478467794";0;"relative convergence (4)";"10.86439914306";"5875.26956935587";"5875.30858105938";"5901.9802280088";"2934.96563585817"
6;"12 12 12 12 45 12";100;20;"Gauss";24;2;"nlminb limit";"0.0549632310539254";"-0.120539204683155";NA;"18.3470646007918";"2.94911531043403";NA;"0.0102796875385754";"0.0490315774101595";"0.0616558281821361";NA;"15.527520120919";"3.07634192146105";NA;"0.0855316962912551";"0.0552164534770124";"-0.10930956506407";NA;"16.9232101714176";"2.93717153829341";NA;"0.0122487753849125";"1876.83476583008";0;"relative convergence (4)";"7.03085620005926";"3763.66953166016";"3763.70854336367";"3790.38019031308";"1882.94072604936"
6;"12 12 12 12 45 12";100;20;"Gauss";25;2;"nlminb limit";"0.0264104962872229";"0.203115712618455";NA;"13.9005274386145";"4.98051800502693";NA;"0.181336036515325";"0.0240995846752029";"0.310897616576094";NA;"20.1616931129637";"5.12724903913148";NA;"0.173607192649279";"0.0270298840689916";"0.178189690599136";NA;"15.3904996770038";"4.9154270568603";NA;"0.181158931823605";"3947.10853415281";0;"relative convergence (4)";"3.68380707502365";"7904.21706830562";"7904.25608000913";"7930.92772695854";"3948.18557450924"
6;"12 12 12 12 45 12";100;20;"Gauss";26;2;"nlminb limit";"0.166802576241256";"-0.830939792096615";NA;"2.63505634386092";"0.224734957321369";NA;"14.4725181280501";"0.163314851993148";"-0.874533188077314";NA;"3.68752910790306";"0.188768557895004";NA;"15.5749220868387";"0.167111822665523";"-0.8846768603599";NA;"2.51117888903124";"0.234474839638271";NA;"13.9230570364627";"2392.45385622338";0;"relative convergence (4)";"6.50942947069804";"4794.90771244675";"4794.94672415027";"4821.61837109968";"2395.13192355126"
6;"12 12 12 12 45 12";100;20;"Gauss";27;2;"nlminb limit";"0.0225140204496635";"1.1583728059195";NA;"6.3167014317587";"4.18283156765637";NA;"0.0122426565083134";"0.0217817612813541";"1.20364214227483";NA;"9.57840778114694";"4.14269810581584";NA;"0.0226153363500901";"0.0224658513089216";"1.16164750798196";NA;"6.888158005034";"4.16988310972156";NA;"0.00958849577819509";"1921.31605374449";0;"relative convergence (4)";"2.53393269379934";"3852.63210748899";"3852.6711191925";"3879.34276614191";"1922.05271793249"
6;"12 12 12 12 45 12";100;20;"Gauss";28;2;"nlminb limit";"0.0485778365714837";"0.688349361997098";NA;"3.57052816078067";"3.19586567568579";NA;"3.80435711674839";"0.0400304879158448";"0.969291240632932";NA;"3.790730136606";"3.25962459021235";NA;"3.96324318794491";"0.0518529975207714";"0.624680882205182";NA;"3.59921304806358";"3.14382531691128";NA;"3.89301186948546";"3484.73997883029";0;"relative convergence (4)";"4.69728959004084";"6979.47995766059";"6979.5189693641";"7006.19061631351";"3485.95313314128"
6;"12 12 12 12 45 12";100;20;"Gauss";1;2;"nlminb limit";"0.160825284739331";"2.03291672002524";NA;"11.627165033482";"0.268415311672782";NA;"0.234488823908508";"0.161622234661017";"2.34037437244032";NA;"9.68229327216967";"0.231124253204774";NA;"0.238192234342045";"0.161398414733038";"2.33762399315486";NA;"9.74085369394844";"0.235646115298525";NA;"0.231436208298327";"870.641191565835";0;"relative convergence (4)";"0.825246719519297";"1751.28238313167";"1751.32139483518";"1777.99304178459";"871.67859275184"
6;"12 12 12 12 45 12";100;20;"Gauss";2;2;"nlminb limit";"0.0698817146971259";"0.731217301916331";NA;"17.4824203979224";"2.44593065437341";NA;"1.62034597223842";"0.0670132844659731";"0.813562061253588";NA;"26.6030346412038";"2.43117192337037";NA;"1.47205306619124";"0.0756224830300592";"0.714857238574182";NA;"11.3160245037894";"2.35374171566807";NA;"1.69395075142961";"2288.04497917774";0;"relative convergence (4)";"13.0541368961334";"4586.08995835547";"4586.12897005898";"4612.80061700839";"2292.03197914339"
6;"12 12 12 12 45 12";100;20;"Gauss";3;2;"nlminb limit";"0.0555362546903967";"-0.702625072328374";NA;"4.07450539432466";"3.25270580319642";NA;"2.49404412475906";"0.0510862335258587";"-0.662357762416129";NA;"4.11880321246648";"3.43189876040827";NA;"2.50383157299982";"0.054903270272713";"-0.752808192849959";NA;"4.31171776750135";"3.29281237273882";NA;"2.36777252657164";"3878.75037345954";0;"relative convergence (4)";"20.73688078324";"7767.50074691908";"7767.5397586226";"7794.21140557201";"3884.51664829435"
6;"12 12 12 12 45 12";100;20;"Gauss";4;2;"nlminb limit";"0.0741118921877862";"-1.84738457249478";NA;"16.0043390090577";"3.4260162240012";NA;"10.4981078554301";"0.0738066967511889";"-1.95023783826838";NA;"13.5575791400724";"3.44967880252329";NA;"9.98422894902892";"0.0718444634660309";"-1.79283332858085";NA;"13.7764791363013";"3.49914525064085";NA;"9.81000085952186";"2841.98974749166";0;"relative convergence (4)";"2.31685833533605";"5693.97949498333";"5694.01850668684";"5720.69015363625";"2843.50818715829"
6;"12 12 12 12 45 12";100;20;"Gauss";5;2;"nlminb limit";"0.0522197650361976";"0.437956752255559";NA;"16.1384322559461";"3.07073715205437";NA;"0.0245860482048098";"0.0510278395912068";"0.464003512548627";NA;"16.9947376958115";"3.10689291357792";NA;"0.080155316518634";"0.0510736906007687";"0.452021582038177";NA;"13.1358486069877";"3.11274417836043";NA;"0.0367074108184334";"1543.39049113021";0;"relative convergence (4)";"10.3904607693354";"3096.78098226041";"3096.81999396393";"3123.49164091334";"1547.23213474073"
6;"12 12 12 12 45 12";100;20;"Gauss";6;2;"nlminb limit";"0.0355302452132205";"-1.69607745064422";NA;"15.1798355267383";"4.05881292941018";NA;"13.1687159208297";"0.0388981191114408";"-2.11069783134988";NA;"15.6751274895813";"3.96247644550621";NA;"15.0759708112267";"0.0353180264914013";"-1.9739924313858";NA;"22.9780063267395";"4.07750858637799";NA;"14.2263102537173";"1824.15165768839";0;"relative convergence (4)";"2.12541385889053";"3658.30331537678";"3658.34232708029";"3685.0139740297";"1828.10896412839"
6;"12 12 12 12 45 12";100;20;"Gauss";7;2;"nlminb limit";"0.156145614737313";"-0.769634056370705";NA;"16.7618907783181";"0.696970429264593";NA;"2.93630151776634";"0.152216941891571";"-0.814370931231698";NA;"10.9249074205364";"0.892930205899297";NA;"2.7251677722131";"0.152475614695675";"-0.83347269460779";NA;"16.3017752139717";"0.856875594946789";NA;"2.92147140479891";"2860.67716071391";0;"relative convergence (4)";"5.91140112082164";"5731.35432142782";"5731.39333313133";"5758.06498008075";"2863.54447787201"
6;"12 12 12 12 45 12";100;20;"Gauss";8;2;"nlminb limit";"0.0398476887574465";"0.156946030445397";NA;"9.33430358907208";"3.2005786751659";NA;"0.0643673137553317";"0.0343002624752667";"0.335643662900967";NA;"3.99691005649695";"3.43076655140434";NA;"0.104754798331518";"0.038112470042149";"0.207199376247568";NA;"9.54605229949757";"3.24615286158";NA;"0.0553192997928378";"2212.86039589775";0;"relative convergence (4)";"5.32688140471776";"4435.7207917955";"4435.75980349901";"4462.43145044842";"2214.99423169938"
6;"12 12 12 12 45 12";100;20;"Gauss";9;2;"nlminb limit";"0.160588937584109";"2.96748996432871";NA;"8.83197652176023";"0.320691583538362";NA;"0.502814030965653";"0.160123818066726";"2.13554174935716";NA;"11.7286863395478";"0.365004456371499";NA;"0.552235694367074";"0.160600623684036";"2.1940040884068";NA;"8.60837609342654";"0.369258996302923";NA;"0.530976122074516";"926.489975292471";0;"relative convergence (4)";"2.77006069421768";"1862.97995058494";"1863.01896228845";"1889.69060923787";"928.043817994013"
6;"12 12 12 12 45 12";100;20;"Gauss";10;2;"nlminb limit";"0.081746580119075";"0.972326705930755";NA;"9.88933466793969";"2.07459728333575";NA;"0.053450634677047";"0.0810591381790864";"0.979692879813308";NA;"14.3163150125592";"2.08802603464994";NA;"0.0531210422123822";"0.0843560720948564";"0.950565182856988";NA;"7.7633078602901";"2.04937632731891";NA;"0.0604579259841398";"846.582106873888";0;"relative convergence (4)";"3.87236432631811";"1703.16421374778";"1703.20322545129";"1729.8748724007";"848.92072229893"
6;"12 12 12 12 45 12";100;20;"Gauss";11;2;"nlminb limit";"0.04193612410635";"-1.45010466384701";NA;"17.3547607311048";"3.48669221890207";NA;"2.73497751914976";"0.0399079336599528";"-1.35748942038172";NA;"17.5908839809579";"3.57911005602904";NA;"2.66806014230336";"0.0401037282275051";"-1.37435981753034";NA;"15.9272140560915";"3.57035738799655";NA;"2.66361240137377";"2832.96893277761";0;"relative convergence (4)";"4.93647073507309";"5675.93786555522";"5675.97687725873";"5702.64852420814";"2834.98614206686"
6;"12 12 12 12 45 12";100;20;"Gauss";12;2;"nlminb limit";"0.160572360856665";"2.99491001712158";NA;"5.40741222025827";"0.27834569265633";NA;"0.0873242037322526";"0.1608829165479";"2.6780491061764";NA;"8.50707464274077";"0.282557014138593";NA;"0.107678345756513";"0.16058698410736";"2.69214794522759";NA;"4.9304283815527";"0.285894704050918";NA;"0.094609171402024";"771.363612984071";0;"relative convergence (4)";"3.15871565341949";"1552.72722596814";"1552.76623767165";"1579.43788462107";"771.57418812074"
6;"12 12 12 12 45 12";100;20;"Gauss";13;2;"nlminb limit";"0.149979107738606";"1.24568000738509";NA;"3.63773876987398";"0.694397026221399";NA;"0.900083395407645";"0.146450804173585";"1.19800220063519";NA;"22.6199302373719";"0.702220877450696";NA;"0.96174270923513";"0.14972969533178";"1.25372868949751";NA;"4.89049471836469";"0.677093384582208";NA;"0.897985570758146";"1232.0963288286";0;"relative convergence (4)";"7.90780953168869";"2474.19265765719";"2474.2316693607";"2500.90331631012";"1235.17337418188"
6;"12 12 12 12 45 12";100;20;"Gauss";14;2;"nlminb limit";"0.032201817823852";"2.17112896568142";NA;"16.565260654781";"2.44451335080133";NA;"13.9929239890007";"0.0363159410099814";"2.06882133323348";NA;"10.1636336529913";"2.44861469388799";NA;"12.3056247093234";"0.0332429625616734";"2.12630948519771";NA;"17.1920959651063";"2.46284288586381";NA;"13.783480329714";"2803.19026306959";0;"relative convergence (4)";"4.71250685850779";"5616.38052613917";"5616.41953784268";"5643.0911847921";"2807.0712046569"
6;"12 12 12 12 45 12";100;20;"Gauss";15;2;"nlminb limit";"0.0969589159098637";"-1.34584473143332";NA;"10.6844741599634";"2.68342940775559";NA;"13.2700938147656";"0.0954720098850597";"-1.4436995693114";NA;"21.9517045707797";"2.67659514942121";NA;"14.5832103126861";"0.0942006945792359";"-1.4043954213476";NA;"11.0465239556249";"2.73715563544664";NA;"12.4396404058968";"2743.13918841599";0;"relative convergence (4)";"9.56592988570531";"5496.27837683197";"5496.31738853548";"5522.9890354849";"2745.561128751"
6;"12 12 12 12 45 12";100;20;"Gauss";16;2;"nlminb limit";"0.151203831673996";"1.32059985725209";NA;"14.3397092917003";"0.828674060952045";NA;"11.2760495037601";"0.148886425414341";"1.34584094255763";NA;"12.5346301135641";"0.859298218783254";NA;"11.8245416432972";"0.148947890624758";"1.34743359875833";NA;"17.6725141328095";"0.832809605012624";NA;"11.2783345368183";"2558.4467473632";0;"relative convergence (4)";"6.60923456350962";"5126.89349472641";"5126.93250642992";"5153.60415337933";"2565.30513992939"
6;"12 12 12 12 45 12";100;20;"Gauss";17;2;"nlminb limit";"0.112953168279984";"2.31449885363691";NA;"9.3528852541931";"1.49509208599028";NA;"3.72931148916081";"0.0976506420014763";"2.4605935022262";NA;"6.86314943004487";"1.58585452192918";NA;"3.40863966119336";"0.108740848059743";"2.33916402011036";NA;"7.18898419856037";"1.52195947769545";NA;"3.56236113693862";"2563.74308304317";0;"relative convergence (4)";"4.30201102495193";"5137.48616608633";"5137.52517778985";"5164.19682473926";"2565.6807391346"
6;"12 12 12 12 45 12";100;20;"Gauss";18;2;"nlminb limit";"0.0299902674539656";"2.39870902337134";NA;"19.1158460960723";"2.19915459843085";NA;"0.010255598817429";"0.0291099499063074";"2.41343919015735";NA;"14.510149067424";"2.2389374392052";NA;"0.0510567576200515";"0.0308324701239574";"2.36215547866972";NA;"17.9091402277315";"2.19586728767467";NA;"0.0167285578219601";"950.795626174567";0;"relative convergence (4)";"9.86516986687978";"1911.59125234913";"1911.63026405265";"1938.30191100206";"952.911036672007"
6;"12 12 12 12 45 12";100;20;"Gauss";19;2;"nlminb limit";"0.168229049997526";"0.669880074681714";NA;"14.0535626383498";"0.206476774690301";NA;"0.169343254066054";"0.166850965491507";"0.6760507142854";NA;"15.830842554329";"0.347915280869103";NA;"0.192855865123433";"0.168404409618264";"0.668944793311971";NA;"16.256602720159";"0.174123629387652";NA;"0.158685902499318";"918.977229785256";0;"relative convergence (4)";"8.19646714925766";"1847.95445957051";"1847.99347127402";"1874.66511822344";"919.319574514427"
6;"12 12 12 12 45 12";100;20;"Gauss";20;2;"nlminb limit";"0.0487084488627848";"2.82002367731184";NA;"12.5171866258606";"1.88403779583271";NA;"0.208423001099085";"0.0470086465069213";"2.84725587172979";NA;"14.2186413737074";"1.90201396716247";NA;"0.213777155513179";"0.04672618315118";"2.85705594737775";NA;"15.4859658912688";"1.90073425614501";NA;"0.216111973395177";"987.722044499516";0;"relative convergence (4)";"5.31581723292669";"1985.44408899903";"1985.48310070254";"2012.15474765196";"990.177964295967"
6;"12 12 12 12 45 12";100;20;"Gauss";21;2;"nlminb limit";"0.120542494113149";"-1.0521344577428";NA;"7.54229341447353";"1.72588437369317";NA;"7.31833006709248";"0.120559003710259";"-1.07993345208533";NA;"5.95843913310586";"1.7406612096809";NA;"7.00312206619569";"0.118230599858793";"-1.08422452064749";NA;"8.41581931165081";"1.76989181306153";NA;"7.40706708177113";"2897.25210802869";0;"relative convergence (4)";"17.9455814599991";"5804.50421605738";"5804.54322776089";"5831.2148747103";"2899.56255321059"
6;"12 12 12 12 45 12";100;20;"Gauss";22;2;"nlminb limit";"0.0506426690971158";"0.471726628718898";NA;"3.42645955644548";"3.54049196172341";NA;"11.9049114464831";"0.0747691589486586";"0.0152859231222894";NA;"5.89924404413716";"3.09855972296071";NA;"15.9634579220787";"0.0549525462209475";"0.383467423198742";NA;"3.67801403234469";"3.46284755033158";NA;"12.6285686103033";"2952.03308549465";0;"relative convergence (4)";"3.49201856056849";"5914.0661709893";"5914.10518269281";"5940.77682964222";"2953.91944119315"
6;"12 12 12 12 45 12";100;20;"Gauss";23;2;"nlminb limit";"0.14340394599605";"0.159276100574061";NA;"8.57310329889879";"1.02537515836332";NA;"0.0671733971664698";"0.136463440973631";"0.166761421698787";NA;"15.6004194331856";"1.22759292873823";NA;"0.128130911015201";"0.143854301990895";"0.152746286874254";NA;"9.44107967690699";"1.01562220193233";NA;"0.0818364632534024";"1001.62163055215";0;"relative convergence (4)";"3.8644882996877";"2013.2432611043";"2013.28227280781";"2039.95391975723";"1002.87466699042"
6;"12 12 12 12 45 12";100;20;"Gauss";24;2;"nlminb limit";"0.0319005345560762";"0.0955742860678583";NA;"9.70287756808102";"4.64420593622084";NA;"0.196147016580633";"0.0259712853430373";"0.354634432445562";NA;"12.8326235644252";"4.9993766902237";NA;"0.222306035313586";"0.0319765687750594";"0.0872167531426433";NA;"10.9422557997925";"4.65227912743146";NA;"0.194446456018329";"3933.533997296";0;"relative convergence (4)";"4.88161575396856";"7877.06799459199";"7877.10700629551";"7903.77865324492";"3935.11693936337"
6;"12 12 12 12 45 12";100;20;"Gauss";25;2;"nlminb limit";"0.156815759796047";"0.822953633731231";NA;"18.8062587757595";"0.979158992275254";NA;"0.224496771372749";"0.156572340487515";"0.822338538182546";NA;"9.84933464794921";"0.982233100498805";NA;"0.179196601957819";"0.156558588312456";"0.827527557471569";NA;"14.9224335842697";"0.979016037476476";NA;"0.224571804133918";"957.0375784566";0;"relative convergence (4)";"4.18601872126261";"1924.0751569132";"1924.11416861671";"1950.78581556612";"958.645145137159"
6;"12 12 12 12 45 12";100;20;"Gauss";26;2;"nlminb limit";"0.164860267965812";"-1.88465559319593";NA;"7.83611214952543";"0.602285095904562";NA;"0.0258101404598757";"0.164765939432824";"-1.90509870805554";NA;"17.4775076672727";"0.595716202108696";NA;"0.059892327057589";"0.164916636272539";"-1.89415233060757";NA;"7.45127459109591";"0.601778069509734";NA;"0.0218728960583142";"1792.92643259242";0;"relative convergence (4)";"10.5447195212046";"3595.85286518484";"3595.89187688835";"3622.56352383776";"1794.31215821846"
6;"12 12 12 12 45 12";100;20;"Gauss";27;2;"nlminb limit";"0.0633663774239149";"-1.55208185710944";NA;"16.5196708505973";"2.83660966848076";NA;"0.0117725711691311";"0.0596772030509766";"-1.40707017518199";NA;"10.5534667929937";"2.97244709630364";NA;"0.0115106309761943";"0.0633374889488047";"-1.54239606908478";NA;"17.4706272183646";"2.82831372536075";NA;"0.00892688654964316";"2829.47031647416";0;"relative convergence (4)";"7.8057413260142";"5668.94063294833";"5668.97964465184";"5695.65129160125";"2830.47475554234"
6;"12 12 12 12 45 12";100;20;"Gauss";28;2;"nlminb limit";"0.0592134493439808";"1.42154360492714";NA;"2.61693351669237";"2.25690313680073";NA;"0.283780953577151";"0.0700367716736181";"1.30113984445712";NA;"9.55241056910852";"2.1002944893755";NA;"0.504877583501208";"0.0602396678108931";"1.40208911488015";NA;"2.36406999833311";"2.25324095856673";NA;"0.331088654285839";"1190.97297017553";0;"relative convergence (4)";"10.4804742336273";"2391.94594035106";"2391.98495205457";"2418.65659900398";"1193.38755144149"
6;"12 12 12 12 45 12";100;20;"Gauss";2;2;"nlminb limit";"0.149222279416826";"2.96285690623336";NA;"5.11203871341422";"1.13990438573475";NA;"0.021065127959674";"0.141711631129811";"2.96479639291013";NA;"9.79572417257855";"1.17527123776459";NA;"0.0193232779622541";"0.148249291947189";"2.98232711895489";NA;"4.62837871824571";"1.14235624945069";NA;"0.0288884019597018";"436.84728509206";0;"relative convergence (4)";"17.3723689874013";"883.69457018412";"883.733581887631";"910.405228837044";"439.633054356897"
6;"12 12 12 12 45 12";100;20;"Gauss";3;2;"nlminb limit";"0.0101625827047152";"3.64951622847002";NA;"6.09668239951134";"3.30359143441614";NA;"9.34136446966695";"0.0215984133277753";"3.08849882056996";NA;"5.39343072490322";"2.95582158837228";NA;"8.93420411991438";"0.0139201850604177";"3.40552345170432";NA;"6.22951920893869";"3.17353932924723";NA;"9.22165751964718";"3432.07123802502";0;"relative convergence (4)";"6.47710236310959";"6874.14247605003";"6874.18148775355";"6900.85313470296";"3435.19059227169"
6;"12 12 12 12 45 12";100;20;"Gauss";4;2;"nlminb limit";"0.100823513661232";"3.74312323285267";NA;"18.2558164284565";"1.43890508034968";NA;"5.66517249394453";"0.087133417898247";"3.40473950749119";NA;"16.3301968622108";"1.5681738123865";NA;"5.98481312746397";"0.102557938592744";"3.70941430326581";NA;"17.0510538843001";"1.43078362789237";NA;"5.66286568824158";"2742.82219122154";0;"relative convergence (4)";"3.93060683012009";"5495.64438244308";"5495.68339414659";"5522.355041096";"2742.99035158483"
6;"12 12 12 12 45 12";100;20;"Gauss";5;2;"nlminb limit";"0.0762140945069866";"2.63699573522899";NA;"8.44749547587708";"1.72209705009844";NA;"0.465002526208073";"0.0755862353130133";"2.64544406730752";NA;"12.2649188678186";"1.72788527920954";NA;"0.478580404157247";"0.0781473494897419";"2.65615367660787";NA;"9.13945572609721";"1.6954587499837";NA;"0.500690290119565";"882.438095056907";0;"relative convergence (4)";"5.56682126522064";"1774.87619011381";"1774.91520181733";"1801.58684876674";"884.295973000477"
6;"12 12 12 12 45 12";100;20;"Gauss";6;2;"nlminb limit";"0.176121683793645";"3.82456124993041";NA;"2.67700154148042";"0.282844163882723";NA;"0.47516578138216";"0.173732797766536";"1.89746889195371";NA;"3.57360421335366";"0.408366165207828";NA;"0.457417421170124";"0.174231062702764";"1.94727360933428";NA;"3.25107414740172";"0.391327398290459";NA;"0.457397589219457";"882.467492588324";0;"relative convergence (4)";"13.1114772081375";"1774.93498517665";"1774.97399688016";"1801.64564382957";"882.418134929858"
6;"12 12 12 12 45 12";100;20;"Gauss";7;2;"nlminb limit";"0.0138848004656896";"3.60645612701774";NA;"15.4462259630673";"2.56524602574107";NA;"0.228547431631976";"0.0129800863187026";"3.68941857799011";NA;"9.56944625993177";"2.58239334354804";NA;"0.165721809996906";"0.0137988868022532";"3.64525898096579";NA;"11.997253522432";"2.5605827572006";NA;"0.23622084540294";"1497.70227583474";0;"relative convergence (4)";"12.673529903094";"3005.40455166948";"3005.44356337299";"3032.1152103224";"1501.02627040379"
6;"12 12 12 12 45 12";100;20;"Gauss";8;2;"nlminb limit";"0.115475261171095";"3.14726633485407";NA;"10.4764751330949";"1.38224677737137";NA;"7.82714478662577";"0.0793222687563909";"3.29737375709665";NA;"14.2626138650006";"1.5691878256493";NA;"6.62675421507457";"0.108165178260513";"3.168632358079";NA;"10.4723650020533";"1.41783340473267";NA;"7.47914218754316";"2929.40635021652";0;"relative convergence (4)";"5.97024846076965";"5868.81270043305";"5868.85171213656";"5895.52335908597";"2930.41616743838"
6;"12 12 12 12 45 12";100;20;"Gauss";9;2;"nlminb limit";"0.121636021468923";"3.90151801810134";NA;"6.14427999220789";"1.27106694124537";NA;"11.2752525123858";"0.0694568305745382";"3.3588956985018";NA;"8.50165634886349";"1.63965162418176";NA;"10.503314237368";"0.123557799094697";"3.78787900288509";NA;"6.13331302561369";"1.27924353452199";NA;"11.467337012134";"2814.27321161953";0;"relative convergence (4)";"9.35911961396535";"5638.54642323906";"5638.58543494257";"5665.25708189198";"2819.57231966049"
6;"12 12 12 12 45 12";100;20;"Gauss";10;2;"nlminb limit";"0.0119062929615165";"3.31835426215548";NA;"5.65545025747269";"2.81239899386051";NA;"4.53615849838217";"0.0217003305325403";"2.80094936949432";NA;"5.09807320453524";"2.64476682204236";NA;"4.88139777517609";"0.0104972911970678";"3.42951641632084";NA;"5.22723273812688";"2.85550165280268";NA;"4.42638885699477";"3356.36459668428";0;"relative convergence (4)";"7.9783874074618";"6722.72919336856";"6722.76820507207";"6749.43985202148";"3357.52951877072"
6;"12 12 12 12 45 12";100;20;"Gauss";12;2;"nlminb limit";"0.144085940152272";"3.07242673123255";NA;"9.79223156860098";"0.913206702688835";NA;"0.0159489239298047";"0.141367159637992";"3.01608093942017";NA;"21.8106776651818";"0.928578493085901";NA;"0.259335408664234";"0.144277823761308";"3.0998714512598";NA;"10.5812225767554";"0.909817085836968";NA;"0.00636633912149719";"548.838805490594";0;"relative convergence (4)";"5.31384965578715";"1107.67761098119";"1107.7166226847";"1134.38826963411";"549.657193956772"
6;"12 12 12 12 45 12";100;20;"Gauss";13;2;"nlminb limit";"0.0367196667351253";"2.6418851071503";NA;"7.51361796818674";"2.03475372228881";NA;"7.63377592717664";"0.0372446992068091";"2.71844845054548";NA;"7.2021161781972";"2.00983340200024";NA;"8.337504667685";"0.0312222384865774";"2.80723061415109";NA;"7.91978631900951";"2.08820581584984";NA;"7.90613501787626";"3080.83184193678";0;"relative convergence (4)";"4.93796445131302";"6171.66368387355";"6171.70269557707";"6198.37434252648";"3085.47166631466"
6;"12 12 12 12 45 12";100;20;"Gauss";14;2;"nlminb limit";"0.164843687406556";"3.50436236709356";NA;"19.6332830651663";"0.374860941594111";NA;"0.0128344448336788";"0.164302251420483";"2.8469748223387";NA;"20.2476924905603";"0.405933156515782";NA;"0.0693337281888711";"0.164204979752236";"2.74184874859774";NA;"25.6859498216121";"0.408724044319199";NA;"0.00444642165186218";"693.13085362123";0;"relative convergence (4)";"4.35733847220739";"1396.26170724246";"1396.30071894597";"1422.97236589538";"694.512195313067"
6;"12 12 12 12 45 12";100;20;"Gauss";15;2;"nlminb limit";"0.160133149116564";"3.22671732050367";NA;"12.1318454584107";"0.568601308999488";NA;"0.715638644629153";"0.158999886344295";"2.31314333810076";NA;"12.0952854306428";"0.620610437324347";NA;"0.558018386979621";"0.159700382861534";"2.27592941989286";NA;"7.56317963461182";"0.635975137538881";NA;"0.689955959446094";"967.334966766637";0;"relative convergence (4)";"6.40445113182068";"1944.66993353327";"1944.70894523678";"1971.3805921862";"967.665780321143"
6;"12 12 12 12 45 12";100;20;"Gauss";16;2;"nlminb limit";"0.160222425594031";"3.55138929968234";NA;"19.7587490915321";"0.367656297041019";NA;"0.0162978781550736";"0.160076141532554";"2.97190111137108";NA;"17.9679798857769";"0.3925826407401";NA;"0.0373964830676321";"0.159999678722755";"3.12308416677631";NA;"18.9094884557258";"0.384065624109607";NA;"0.0090170797734633";"692.041600528796";0;"relative convergence (4)";"3.35517906347911";"1394.08320105759";"1394.1222127611";"1420.79385971052";"692.357764515194"
6;"12 12 12 12 45 12";100;20;"Gauss";17;2;"nlminb limit";"0.157271761222151";"3.38331329752691";NA;"6.63563294801861";"0.291286247321946";NA;"1.33704188402568";"0.156571430032111";"2.21731975898037";NA;"9.39504669982934";"0.318955738906969";NA;"1.20852692233519";"0.157869352650329";"2.56235194523313";NA;"5.46689781661785";"0.310046324568363";NA;"1.23838585451843";"1240.21344044888";0;"relative convergence (4)";"17.6494766712189";"2490.42688089776";"2490.46589260127";"2517.13753955068";"1242.35560533403"
6;"12 12 12 12 45 12";100;20;"Gauss";18;2;"nlminb limit";"0.170463623735777";"3.90392331872135";NA;"5.51293297158554";"0.28220465216382";NA;"0.260424061522774";"0.169434534270222";"2.54319725125015";NA;"5.84607234764689";"0.329494440227543";NA;"0.319665138891898";"0.169740926716661";"2.49842905087056";NA;"5.58420235512728";"0.319043768051544";NA;"0.32062909656015";"848.672088692232";0;"relative convergence (4)";"5.86982788244883";"1707.34417738446";"1707.38318908798";"1734.05483603739";"851.623517051382"
6;"12 12 12 12 45 12";100;20;"Gauss";19;2;"nlminb limit";"0.0102390415723218";"3.37445443554316";NA;"7.46992701711133";"2.89683726164645";NA;"0.388969162397995";"0.012360697217076";"3.1610689127867";NA;"8.96758281778323";"2.85141387135";NA;"0.443410961112541";"0.0107148816696484";"3.36156910895497";NA;"7.38891493950608";"2.84941690647656";NA;"0.369334054176676";"1768.1948931337";0;"relative convergence (4)";"11.2527057647705";"3546.3897862674";"3546.42879797091";"3573.10044492033";"1772.69373166606"
