<?xml version="1.0" encoding="UTF-8" standalone="no"?>
<!DOCTYPE svg PUBLIC "-//W3C//DTD SVG 1.1//EN" "http://www.w3.org/Graphics/SVG/1.1/DTD/svg11.dtd">
<svg width="100%" height="100%" viewBox="0 0 440 800" version="1.1" xmlns="http://www.w3.org/2000/svg" xmlns:xlink="http://www.w3.org/1999/xlink" xml:space="preserve" xmlns:serif="http://www.serif.com/" style="fill-rule:evenodd;clip-rule:evenodd;stroke-miterlimit:10;">
    <g transform="matrix(1,0,0,1,-495,0)">
        <g id="Page-2" serif:id="Page 2" transform="matrix(1,0,0,1,495,0)">
            <rect x="0" y="0" width="440" height="800" style="fill:none;"/>
            <g id="Layer-1" serif:id="Layer 1">
                <g transform="matrix(1,0,0,1,174.006,32.0919)">
                    <path d="M0,755.706L36.427,755.706C36.427,755.706 41.492,747.476 39.112,740.918C38.039,737.961 38.091,734.733 39.151,731.772C39.998,729.408 40.582,726.453 40.033,723.35C39.472,720.184 39.122,716.984 39.17,713.769L40.247,641.911C40.247,641.911 40.687,608.123 39.377,590.854C38.874,584.209 39.101,577.536 39.943,570.924C40.458,566.88 40.76,562.328 40.317,558.471C39.229,548.975 37.828,524.846 37.828,524.846L39.696,457.128L40.531,390.19L40.531,388.477L51.838,389.1L53.395,466.624L53.395,524.846C53.395,524.846 51.216,557.225 51.838,558.937C51.838,558.937 52.044,569.562 52.793,577.041C53.165,580.75 53.293,584.473 53.183,588.199C52.753,602.73 51.939,636.327 53.395,641.911L53.395,714.608C53.395,716.848 52.927,719.053 52.123,721.143C51.328,723.209 50.685,726.627 52.025,731.32C52.784,733.98 52.943,736.773 52.423,739.49C51.322,745.251 50.078,754.636 53.395,755.706C58.221,757.263 92.625,755.706 92.625,755.706C92.625,755.706 98.54,750.258 92.625,741.852C91.495,740.246 90.512,738.918 89.663,737.821C86.828,734.163 85.029,729.803 84.515,725.204C84.042,720.978 82.926,716.423 80.327,715.854L80.066,702.549C79.93,695.657 80.531,688.772 81.855,682.007C84.766,667.137 89.891,639.938 90.445,630.08C91.223,616.225 92.001,584.623 92.001,584.623L92.001,557.007C92.001,546.349 92.961,535.715 94.87,525.229C99.319,500.775 107.371,455.792 107.257,451.057C107.257,451.057 113.017,380.227 109.904,372.443C109.904,372.443 108.659,350.96 106.946,343.332C105.808,338.263 101.299,324.251 98.404,315.425C97.195,311.739 95.748,308.14 94.143,304.608C91.932,299.74 88.46,289.091 88.888,270.79C89.511,244.17 88.577,232.962 88.577,232.962C88.577,232.962 94.959,218.173 99.163,219.107C99.163,219.107 103.521,270.634 104.299,273.592C105.079,276.55 116.13,315.312 128.118,342.554C140.104,369.797 133.099,379.449 133.099,379.449C133.099,379.449 130.786,381.939 135.133,397.039C135.133,397.039 135.901,414.007 136.524,415.409C137.146,416.81 143.84,423.971 146.642,415.409L146.642,397.195C146.642,397.195 149.912,429.263 157.618,431.832C165.323,434.4 165.089,431.832 165.089,431.832C165.089,431.832 169.292,434.167 168.592,414.319C168.592,414.319 169.526,376.958 158.785,365.282C158.785,365.282 154.348,360.379 152.247,341.231C150.496,325.275 144.204,289.536 137.56,271.714C134.668,263.956 132.882,255.833 132.112,247.59C130.273,227.892 127.135,195.691 125.393,185.715C122.825,171.004 118.155,141.582 101.809,137.847C85.463,134.11 84.335,133.877 84.335,133.877C84.335,133.877 68.651,130.841 64.681,122.902L63.981,100.719C63.981,100.719 83.362,86.008 85.93,66.394C88.5,46.779 87.098,41.875 87.098,41.875L74.956,4.281L30.356,-1.557L9.574,16.89L0,37.438L4.203,38.139C4.203,38.139 7.56,71.773 8.406,75.033C9.211,78.134 11.675,90.211 23.351,98.851L27.32,100.953L27.32,122.902C27.32,122.902 29.188,128.973 4.437,134.578C-20.315,140.182 -25.686,153.958 -25.686,153.958C-25.686,153.958 -33.313,172.561 -37.672,232.65C-37.672,232.65 -34.559,256.624 -48.569,284.644C-48.569,284.644 -59.155,322.006 -60.712,345.356C-60.712,345.356 -63.825,364.037 -69.741,374.311C-75.656,384.585 -76.59,404.2 -76.59,404.2C-76.59,404.2 -77.524,427.24 -73.477,430.664C-69.43,434.089 -65.071,431.287 -65.071,431.287C-65.071,431.287 -62.269,433.778 -59.778,410.116C-57.287,386.454 -55.419,398.596 -55.419,398.596C-55.419,398.596 -56.353,416.031 -53.862,417.588C-51.372,419.144 -47.013,420.39 -46.39,416.965C-45.768,413.54 -44.522,411.361 -44.211,395.171C-44.211,395.171 -40.786,379.604 -45.145,370.887C-45.145,370.887 -45.456,364.037 -41.72,355.631L-15.567,283.088C-15.567,283.088 -11.541,271.221 -11.53,263.396C-11.523,257.929 -11.311,252.465 -10.633,247.04L-7.161,219.263C-7.161,219.263 0.934,222.687 2.802,231.716C4.044,237.722 3.391,253.09 3.45,262.716C3.483,268.134 3.748,270.996 3.387,275.115C2.856,281.177 2.152,284.671 -0.695,295.521C-1.699,299.349 -5.886,312.448 -7.503,316.12C-14.435,331.857 -15.759,337.622 -15.903,342.034C-15.964,343.913 -16.12,345.784 -16.359,347.648C-17.009,352.707 -18.046,361.922 -17.677,366.701C-17.528,368.631 -17.511,370.568 -17.569,372.504C-18.045,388.391 -19.361,445.926 -14.01,461.176C-14.01,461.176 -9.364,498.791 -3.988,522.539C-1.915,531.697 -0.844,541.053 -0.724,550.442L-0.312,582.6C-0.312,582.6 -0.623,632.414 3.113,642.377C3.113,642.377 5.835,664.332 8.924,678.322C10.875,687.16 11.831,696.186 11.831,705.236L11.831,712.741C11.831,712.741 7.161,725.195 8.406,731.11L0.934,741.073C0.934,741.073 -9.963,749.368 0,755.706Z" style="fill:rgb(236,193,156);fill-rule:nonzero;stroke:black;stroke-width:1.5px;"/>
                </g>
                <g transform="matrix(1,0,0,1,182.413,124.875)">
                    <path d="M0,-65.795L41.6,-65.795L46.503,-81.206L49.305,-65.795L73.122,-65.795L77.368,-54.307L78.408,-46.569C78.494,-45.934 78.545,-45.294 78.565,-44.652L78.777,-37.608C78.777,-37.608 77.907,-27.448 77.206,-23.712C76.505,-19.976 70.568,-7.515 68.466,-4.829C66.365,-2.144 58.879,5.115 57.591,6.267C55.639,8.01 55.575,8.637 55.575,8.637L56.275,30.82C56.275,30.82 57.428,36.57 72.723,41.006C88.018,45.443 97.788,47.511 97.788,47.511L97.365,-5.024L96.431,-49.506C96.431,-49.506 91.761,-80.796 78.374,-95.586C64.986,-110.374 44.437,-113.332 44.437,-113.332C44.437,-113.332 12.213,-114.733 -0.396,-99.166C-13.006,-83.599 -18.143,-64.762 -18.143,-64.762C-18.143,-64.762 -18.964,-63.751 -21.348,-50.224C-21.909,-47.045 -22.19,-43.818 -22.19,-40.59L-22.19,48.938C-22.19,48.938 -17.053,45.803 -11.529,43.938C-5.131,41.779 1.534,40.541 2.913,40.04C4.021,39.637 8.027,38.442 11.146,37.138C15.255,35.421 18.369,32.537 18.634,31.607C19.101,29.973 18.914,10.116 18.914,10.116L18.914,8.17C18.914,8.17 8.189,3.257 5.223,-4.273C4.696,-5.609 4.127,-6.931 3.448,-8.197C2.157,-10.605 0.657,-14.493 -0.693,-22.295C-2.795,-34.438 -2.918,-42.125 -2.918,-42.125L-2.838,-54.06L0,-65.795Z" style="fill-rule:nonzero;stroke:black;stroke-width:1.5px;"/>
                </g>
                <g transform="matrix(0.99998,-0.00638267,-0.00638267,-0.99998,201.301,133.161)">
                    <path d="M0.026,0.117C0.026,0.117 18.731,-8.331 36.688,0.117" style="fill:none;fill-rule:nonzero;stroke:black;stroke-width:1.5px;"/>
                </g>
                <g transform="matrix(1,0,0,1,157.926,418.346)">
                    <path d="M0,-41.227C0,-41.227 -2.244,-28.27 -1.543,-17.696C-1.543,-17.696 15.791,-18.063 19.317,-16.773C22.508,-15.605 37.297,-14.049 56.289,2.686L67.964,2.686C67.964,2.686 94.039,-16.462 103.379,-16.462C103.379,-16.462 124.707,-17.163 125.562,-16.306C126.418,-15.45 126.292,-39.632 122.79,-43.913C122.79,-43.913 81.505,-36.94 66.641,-35.376C62.163,-34.905 54.824,-35.072 54.824,-35.072C54.824,-35.072 31.757,-34.577 0,-41.227Z" style="fill:rgb(41,171,226);fill-rule:nonzero;stroke:black;stroke-width:1.5px;"/>
                </g>
                <g transform="matrix(1,0,0,1,221.773,185.837)">
                    <path d="M0,64.683C0,64.683 16.034,40.982 40.863,25.648L40.884,-17.838L46.999,-16.21L46.156,26.427C46.156,26.427 54.82,42.4 51.396,65.361C51.396,65.361 47.062,74.996 40.81,79.216C39.688,79.973 37.115,80.435 35.887,80.791C27.984,83.076 13.699,79.511 13.699,79.511C13.699,79.511 4.515,77.565 1.401,71.183L-3.892,71.183C-3.892,71.183 -10.75,76.41 -15.272,78.865C-16.575,79.572 -18.011,79.92 -19.476,80.188C-21.74,80.601 -26.192,81.135 -30.517,81.556C-33.639,81.859 -36.853,81.842 -39.589,81.609C-42.982,81.322 -46.12,79.712 -48.318,77.111C-48.728,76.627 -49.167,76.085 -49.635,75.48C-51.795,72.687 -52.758,70.294 -54.928,65.517C-54.928,65.517 -57.131,41.371 -50.282,28.762L-49.971,-16.928L-44.227,-18.393L-43.744,25.182C-43.744,25.182 -11.208,49.466 -5.137,64.722L0,64.683Z" style="fill:rgb(41,171,226);fill-rule:nonzero;stroke:black;stroke-width:1.5px;"/>
                </g>
                <g transform="matrix(0.236569,-0.971615,-0.971615,-0.236569,116.786,445.802)">
                    <path d="M-13.212,16.815C-13.212,16.815 15.157,20.101 21.4,16.815" style="fill:none;fill-rule:nonzero;stroke:black;stroke-width:1.5px;"/>
                </g>
                <g transform="matrix(0.205606,-0.978635,-0.978635,-0.205606,121.75,451.849)">
                    <path d="M-15.037,18.525C-15.037,18.525 14.789,21.928 22.821,18.525" style="fill:none;fill-rule:nonzero;stroke:black;stroke-width:1.5px;"/>
                </g>
                <g transform="matrix(-0.234694,-0.972069,-0.972069,0.234694,355.158,424.328)">
                    <path d="M-23.532,18.527C-23.532,18.527 4.64,15.804 14.586,18.527" style="fill:none;fill-rule:nonzero;stroke:black;stroke-width:1.5px;"/>
                </g>
                <g transform="matrix(-0.214466,-0.976732,-0.976732,0.214466,354.324,433.279)">
                    <path d="M-26.666,21.446C-26.666,21.446 11.822,18.493 17.248,21.446" style="fill:none;fill-rule:nonzero;stroke:black;stroke-width:1.5px;"/>
                </g>
                <g transform="matrix(1,0,0,1,182.413,600.775)">
                    <path d="M0,-6.944C0,-6.944 8.314,0 19.926,-6.944" style="fill:none;fill-rule:nonzero;stroke:black;stroke-width:1.5px;"/>
                </g>
                <g transform="matrix(1,0,0,1,237.977,600.775)">
                    <path d="M0,-6.944C0,-6.944 8.313,0 19.926,-6.944" style="fill:none;fill-rule:nonzero;stroke:black;stroke-width:1.5px;"/>
                </g>
                <g transform="matrix(0,-1,-1,0,221.097,760.789)">
                    <path d="M-4.748,11.598C-4.748,11.598 1.012,4.748 11.598,11.598" style="fill:none;fill-rule:nonzero;stroke:black;stroke-width:1.5px;"/>
                </g>
                <g transform="matrix(0,-1,-1,0,234.545,753.939)">
                    <path d="M-11.598,4.748C-11.598,4.748 -5.838,11.598 4.748,4.748" style="fill:none;fill-rule:nonzero;stroke:black;stroke-width:1.5px;"/>
                </g>
                <g transform="matrix(0.845807,0.533489,0.533489,-0.845807,183.022,356.167)">
                    <path d="M-1.961,-6.787C-1.961,-6.787 16.88,-0.852 23.48,-6.787" style="fill:none;fill-rule:nonzero;stroke:black;stroke-width:1.5px;"/>
                </g>
                <g transform="matrix(-0.845807,0.533489,0.533489,0.845807,247.585,379.127)">
                    <path d="M-23.48,-6.787C-23.48,-6.787 -4.639,-12.722 1.961,-6.787" style="fill:none;fill-rule:nonzero;stroke:black;stroke-width:1.5px;"/>
                </g>
                <g transform="matrix(0.00362238,0.999993,0.999993,-0.00362238,240.089,309.429)">
                    <path d="M-21.409,-19.923C-21.409,-19.923 11.899,-21.607 20,-19.923" style="fill:none;fill-rule:nonzero;stroke:black;stroke-width:1.5px;"/>
                </g>
                <g transform="matrix(1,0,0,1,220.395,340.152)">
                    <path d="M0,2.361L-1.918,2.361C-2.041,2.361 -2.14,2.261 -2.14,2.14L-2.14,0.221C-2.14,0.099 -2.041,0 -1.918,0L0,0C0.122,0 0.221,0.099 0.221,0.221L0.221,2.14C0.221,2.261 0.122,2.361 0,2.361Z" style="fill:none;fill-rule:nonzero;stroke:black;stroke-width:1.5px;"/>
                </g>
                <g transform="matrix(0.974005,0.226525,0.226525,-0.974005,186.039,170.852)">
                    <path d="M-0.358,-3.123L27.21,-3.123" style="fill:none;fill-rule:nonzero;stroke:black;stroke-width:1.5px;"/>
                </g>
                <g transform="matrix(0.974005,0.226525,0.226525,-0.974005,186.039,170.852)">
                    <path d="M-0.358,-3.123L27.21,-3.123" style="fill:none;fill-rule:nonzero;stroke:black;stroke-width:1.5px;"/>
                </g>
                <g transform="matrix(-0.974003,0.226534,0.226534,0.974003,228.071,183.018)">
                    <path d="M-27.209,-3.123L0.358,-3.123" style="fill:none;fill-rule:nonzero;stroke:black;stroke-width:1.5px;"/>
                </g>
                <g transform="matrix(1,0,0,1,217.439,182.703)">
                    <path d="M0,-1.868C0,-1.868 2.18,0 3.736,-1.868" style="fill:none;fill-rule:nonzero;stroke:black;stroke-width:1.5px;"/>
                </g>
                <g transform="matrix(0,-1,-1,0,206.426,781.246)">
                    <path d="M-6.831,5.2C-6.831,5.2 2.639,6.83 5.2,5.2" style="fill:none;fill-rule:nonzero;stroke:black;stroke-width:1.5px;"/>
                </g>
                <g transform="matrix(0,-1,-1,0,197.992,782.566)">
                    <path d="M-5.511,4.424C-5.511,4.424 3.027,5.511 4.424,4.424" style="fill:none;fill-rule:nonzero;stroke:black;stroke-width:1.5px;"/>
                </g>
                <g transform="matrix(0,-1,-1,0,190.377,782.954)">
                    <path d="M-5.122,4.113C-5.122,4.113 0.699,5.122 4.113,4.113" style="fill:none;fill-rule:nonzero;stroke:black;stroke-width:1.5px;"/>
                </g>
                <g transform="matrix(0,-1,-1,0,182.613,782.411)">
                    <path d="M-5.666,3.57C-5.666,3.57 0.466,5.666 3.57,3.57" style="fill:none;fill-rule:nonzero;stroke:black;stroke-width:1.5px;"/>
                </g>
                <g transform="matrix(0,-1,-1,0,245.791,783.1)">
                    <path d="M-5.2,6.831C-5.2,6.831 4.269,5.201 6.831,6.831" style="fill:none;fill-rule:nonzero;stroke:black;stroke-width:1.5px;"/>
                </g>
                <g transform="matrix(0,-1,-1,0,252.129,783.876)">
                    <path d="M-4.425,5.511C-4.425,5.511 4.113,4.425 5.511,5.511" style="fill:none;fill-rule:nonzero;stroke:black;stroke-width:1.5px;"/>
                </g>
                <g transform="matrix(0,-1,-1,0,259.045,784.187)">
                    <path d="M-4.113,5.122C-4.113,5.122 1.708,4.114 5.122,5.122" style="fill:none;fill-rule:nonzero;stroke:black;stroke-width:1.5px;"/>
                </g>
                <g transform="matrix(0,-1,-1,0,266.81,784.264)">
                    <path d="M-3.571,5.666C-3.571,5.666 2.561,3.571 5.666,5.666" style="fill:none;fill-rule:nonzero;stroke:black;stroke-width:1.5px;"/>
                </g>
            </g>
        </g>
    </g>
</svg>
