Component Name,Usage,Import Path,Repo,Paths
Button,19,antd/lib/button,antd,vip-portal-web-mirror,[object Object]
,,,,[object Object]
,,,,[object Object]
,,,,[object Object]
,,,,[object Object]
,,,,[object Object]
,,,,[object Object]
,,,,[object Object]
,,,,[object Object]
,,,,[object Object]
,,,,[object Object]
,,,,[object Object]
,,,,[object Object]
,,,,[object Object]
,,,,[object Object]
,,,,[object Object]
,,,,[object Object]
,,,,[object Object]
,,,,[object Object]
Card,15,antd/lib/card,antd,vip-portal-web-mirror,[object Object]
,,,,[object Object]
,,,,[object Object]
,,,,[object Object]
,,,,[object Object]
,,,,[object Object]
,,,,[object Object]
,,,,[object Object]
,,,,[object Object]
,,,,[object Object]
,,,,[object Object]
,,,,[object Object]
,,,,[object Object]
,,,,[object Object]
,,,,[object Object]
Col,2,antd,vip-portal-web-mirror,[object Object]
,,,,[object Object]
Collapse,1,antd/lib/collapse,vip-portal-web-mirror,[object Object]
CollapsePanel,1,antd/lib/collapse/CollapsePanel,vip-portal-web-mirror,[object Object]
DatePicker,2,antd/lib/date-picker,vip-portal-web-mirror,[object Object]
,,,,[object Object]
Divider,2,antd,antd/lib/divider,vip-portal-web-mirror,[object Object]
,,,,[object Object]
Dropdown,2,antd/lib/dropdown,vip-portal-web-mirror,[object Object]
,,,,[object Object]
Form,28,antd/lib/form,antd,vip-portal-web-mirror,[object Object]
,,,,[object Object]
,,,,[object Object]
,,,,[object Object]
,,,,[object Object]
,,,,[object Object]
,,,,[object Object]
,,,,[object Object]
,,,,[object Object]
,,,,[object Object]
,,,,[object Object]
,,,,[object Object]
,,,,[object Object]
,,,,[object Object]
,,,,[object Object]
,,,,[object Object]
,,,,[object Object]
,,,,[object Object]
,,,,[object Object]
,,,,[object Object]
,,,,[object Object]
,,,,[object Object]
,,,,[object Object]
,,,,[object Object]
,,,,[object Object]
,,,,[object Object]
,,,,[object Object]
,,,,[object Object]
FormItem,1,antd/lib/form/FormItem,vip-portal-web-mirror,[object Object]
Input,2,antd/lib/input,vip-portal-web-mirror,[object Object]
,,,,[object Object]
Layout,1,antd/lib/layout,vip-portal-web-mirror,[object Object]
Menu,2,antd/lib/menu,vip-portal-web-mirror,[object Object]
,,,,[object Object]
Modal,4,antd,antd/lib/modal/Modal,vip-portal-web-mirror,[object Object]
,,,,[object Object]
,,,,[object Object]
,,,,[object Object]
Progress,1,antd/lib/progress,vip-portal-web-mirror,[object Object]
Row,2,antd,vip-portal-web-mirror,[object Object]
,,,,[object Object]
Search,2,antd/lib/input/Search,vip-portal-web-mirror,[object Object]
,,,,[object Object]
Select,1,antd/lib/select,vip-portal-web-mirror,[object Object]
Space,1,antd,vip-portal-web-mirror,[object Object]
Spin,2,antd/lib/spin,vip-portal-web-mirror,[object Object]
,,,,[object Object]
Tabs,2,antd/lib/tabs,vip-portal-web-mirror,[object Object]
,,,,[object Object]
Tag,1,antd/lib/tag,vip-portal-web-mirror,[object Object]
Timeline,1,antd/lib/timeline,vip-portal-web-mirror,[object Object]
Title,3,antd/lib/typography/Title,vip-portal-web-mirror,[object Object]
,,,,[object Object]
,,,,[object Object]
Tooltip,3,antd/lib/tooltip,vip-portal-web-mirror,[object Object]
,,,,[object Object]
,,,,[object Object]
Tree,1,antd/lib/tree,vip-portal-web-mirror,[object Object]
Typography,1,antd,vip-portal-web-mirror,[object Object]
Upload,1,antd/lib/upload,vip-portal-web-mirror,[object Object]