{
  "development": {
    "basic": {
      "enabled": false,
      "name": "mongri",
      "pass": "password"
    },
    "google": {
      "enabled": false,
      "allow_domain": "domain.com",
      "client_id": "--insert-google-client-id-here--",
      "client_secret": "--insert-google-client-secret-here--",
      "callback_url": "http://localhost:3000/auth/google/callback"
    }
  },
  "docker": {
    "basic": {
      "enabled": false,
      "name": "mongri",
      "pass": "password"
    },
    "google": {
      "enabled": false,
      "allow_domain": "domain.com",
      "client_id": "--insert-google-client-id-here--",
      "client_secret": "--insert-google-client-secret-here--",
      "callback_url": "http://localhost:3000/auth/google/callback"
    }
  },
  "production":{
    "basic": {
      "enabled": false,
      "name": "mongri",
      "pass": "password"
    },
    "google": {
      "enabled": false,
      "allow_domain": "domain.com",
      "client_id": "--insert-google-client-id-here--",
      "client_secret": "--insert-google-client-secret-here--",
      "callback_url": "http://localhost:3000/auth/google/callback"
    }
  }
}
