module github.com/micro/go-micro

go 1.12


require (
	cloud.google.com/go v0.41.0 // indirect
	github.com/BurntSushi/toml v0.3.1
	github.com/armon/circbuf v0.0.0-20190214190532-5111143e8da2 // indirect
	github.com/armon/go-metrics v0.0.0-20190430140413-ec5e00d3c878 // indirect
	github.com/armon/go-radix v1.0.0 // indirect
	github.com/beevik/ntp v0.2.0
	github.com/bitly/go-simplejson v0.5.0
	github.com/bwmarrin/discordgo v0.19.0
	github.com/containerd/continuity v0.0.0-20190426062206-aaeac12a7ffc // indirect
	github.com/forestgiant/sliceutil v0.0.0-20160425183142-94783f95db6c
	github.com/fsnotify/fsnotify v1.4.7
	github.com/fsouza/go-dockerclient v1.4.1
	github.com/ghodss/yaml v1.0.0
	github.com/gliderlabs/ssh v0.2.2 // indirect
	github.com/go-kit/kit v0.9.0 // indirect
	github.com/go-log/log v0.1.0
	github.com/go-playground/locales v0.12.1 // indirect
	github.com/go-playground/universal-translator v0.16.0 // indirect
	github.com/golang/protobuf v1.3.2
	github.com/google/uuid v1.1.1
	github.com/gorilla/handlers v1.4.1
	github.com/gorilla/mux v1.7.3 // indirect
	github.com/gorilla/websocket v1.4.0
	github.com/hashicorp/consul/api v1.1.0
	github.com/hashicorp/go-immutable-radix v1.1.0 // indirect
	github.com/hashicorp/go-msgpack v0.5.5 // indirect
	github.com/hashicorp/go-retryablehttp v0.5.4 // indirect
	github.com/hashicorp/go-rootcerts v1.0.1 // indirect
	github.com/hashicorp/go-sockaddr v1.0.2 // indirect
	github.com/hashicorp/go-version v1.2.0 // indirect
	github.com/hashicorp/hcl v1.0.0
	github.com/hashicorp/mdns v1.0.1 // indirect
	github.com/hashicorp/memberlist v0.1.4
	github.com/hashicorp/serf v0.8.3 // indirect
	github.com/imdario/mergo v0.3.7
	github.com/joncalhoun/qson v0.0.0-20170526102502-8a9cab3a62b1
	github.com/json-iterator/go v1.1.6
	github.com/kevinburke/ssh_config v0.0.0-20190630040420-2e50c441276c // indirect
	github.com/kisielk/errcheck v1.2.0 // indirect
	github.com/konsorten/go-windows-terminal-sequences v1.0.2 // indirect
	github.com/kr/pty v1.1.8 // indirect
	github.com/leodido/go-urn v1.1.0 // indirect
	github.com/lucas-clemente/quic-go v0.7.1-0.20190710050138-1441923ab031
	github.com/mattn/go-colorable v0.1.2 // indirect
	github.com/mattn/go-runewidth v0.0.4 // indirect
	github.com/micro/cli v0.2.0
	github.com/micro/mdns v0.2.0
	github.com/miekg/dns v1.1.15 // indirect
	github.com/mitchellh/gox v1.0.1 // indirect
	github.com/mitchellh/hashstructure v1.0.0
	github.com/nats-io/nats.go v1.8.1
	github.com/nats-io/nkeys v0.1.0 // indirect
	github.com/nlopes/slack v0.5.0
	github.com/olekukonko/tablewriter v0.0.1
	github.com/onsi/ginkgo v1.8.0 // indirect
	github.com/onsi/gomega v1.5.0 // indirect
	github.com/pkg/errors v0.8.1
	github.com/posener/complete v1.2.1 // indirect
	github.com/prometheus/common v0.6.0 // indirect
	github.com/prometheus/procfs v0.0.3 // indirect
	github.com/sirupsen/logrus v1.4.2 // indirect
	github.com/stretchr/objx v0.2.0 // indirect
	github.com/technoweenie/multipartstreamer v1.0.1 // indirect
	golang.org/x/crypto v0.0.0-20190701094942-4def268fd1a4
	golang.org/x/exp v0.0.0-20190627132806-fd42eb6b336f // indirect
	golang.org/x/image v0.0.0-20190703141733-d6a02ce849c9 // indirect
	golang.org/x/mobile v0.0.0-20190711165009-e47acb2ca7f9 // indirect
	golang.org/x/mod v0.1.0 // indirect
	golang.org/x/net v0.0.0-20190628185345-da137c7871d7
	golang.org/x/sys v0.0.0-20190710143415-6ec70d6a5542 // indirect
	golang.org/x/tools v0.0.0-20190711191110-9a621aea19f8 // indirect
	google.golang.org/genproto v0.0.0-20190708153700-3bdd9d9f5532 // indirect
	google.golang.org/grpc v1.22.0
	gopkg.in/go-playground/validator.v9 v9.29.0
	gopkg.in/src-d/go-billy.v4 v4.3.1 // indirect
	gopkg.in/src-d/go-git.v4 v4.12.0
	gopkg.in/telegram-bot-api.v4 v4.6.4
	honnef.co/go/tools v0.0.0-20190614002413-cb51c254f01b // indirect
)
