{
  "_class": "group",
  "do_objectID": "F0D8B3FF-E643-4C74-9E93-2118DB149BBC",
  "exportOptions": {
    "_class": "exportOptions",
    "exportFormats": [
    ],
    "includedLayerIds": [
    ],
    "layerOptions": 0,
    "shouldTrim": false
  },
  "frame": {
    "_class": "rect",
    "constrainProportions": false,
    "height": 28,
    "width": 96,
    "x": 0.5,
    "y": 0
  },
  "hasClickThrough": false,
  "isFlippedHorizontal": false,
  "isFlippedVertical": false,
  "isLocked": false,
  "isVisible": false,
  "layerListExpandedType": 0,
  "layers": [
    {
      "class": "shapeGroup",
      "id": "A6A06C00-FB29-4A01-998C-420C4AFCE4EB"
    },
    {
      "class": "shapeGroup",
      "id": "FB54667F-7DA5-4A9C-88CF-CD7725547068"
    },
    {
      "class": "text",
      "id": "C4E4B151-87E2-4A76-AB92-DEE77C8CD06A"
    }
  ],
  "name": "global-components/tooltips/top",
  "nameIsFixed": false,
  "resizingConstraint": 63,
  "resizingType": 0,
  "rotation": 0,
  "shouldBreakMaskChain": false,
  "style": {
    "_class": "style",
    "endDecorationType": 0,
    "miterLimit": 10,
    "startDecorationType": 0
  }
}