{
  "_class": "group",
  "do_objectID": "93986A84-4D58-4053-ABB0-6C550446C663",
  "exportOptions": {
    "_class": "exportOptions",
    "exportFormats": [
    ],
    "includedLayerIds": [
    ],
    "layerOptions": 0,
    "shouldTrim": false
  },
  "frame": {
    "_class": "rect",
    "constrainProportions": false,
    "height": 32,
    "width": 1248,
    "x": 236,
    "y": 112
  },
  "hasClickThrough": false,
  "isFlippedHorizontal": false,
  "isFlippedVertical": false,
  "isLocked": false,
  "isVisible": true,
  "layerListExpandedType": 2,
  "layers": [
    {
      "class": "shapeGroup",
      "id": "C439CCE3-CA91-42DE-87C9-DBCA1082B201"
    },
    {
      "class": "text",
      "id": "8A1539CA-EC39-4099-9D1E-B2CE2C468519"
    },
    {
      "class": "text",
      "id": "015DB458-28A5-4212-8FE7-9B65753D550D"
    }
  ],
  "name": "search/filter",
  "nameIsFixed": true,
  "resizingConstraint": 63,
  "resizingType": 0,
  "rotation": 0,
  "shouldBreakMaskChain": false,
  "style": {
    "_class": "style",
    "endDecorationType": 0,
    "miterLimit": 10,
    "startDecorationType": 0
  }
}