{
  "_class": "group",
  "do_objectID": "0623974B-34F4-4C78-BBD8-D04774E86074",
  "exportOptions": {
    "_class": "exportOptions",
    "exportFormats": [
    ],
    "includedLayerIds": [
    ],
    "layerOptions": 0,
    "shouldTrim": false
  },
  "frame": {
    "_class": "rect",
    "constrainProportions": false,
    "height": 28,
    "width": 647,
    "x": 607,
    "y": 1602
  },
  "hasClickThrough": false,
  "isFlippedHorizontal": false,
  "isFlippedVertical": false,
  "isLocked": false,
  "isVisible": true,
  "layerListExpandedType": 2,
  "layers": [
    {
      "class": "shapeGroup",
      "id": "6BA4E7C4-57A7-4B29-A290-0EB8307135E5"
    },
    {
      "class": "shapeGroup",
      "id": "19A7C3F1-85DA-44C7-8860-AC82325E28E4"
    },
    {
      "class": "shapeGroup",
      "id": "87195207-852B-460B-8AD2-B0F65510D45F"
    },
    {
      "class": "shapeGroup",
      "id": "FD1F4F13-A658-40A3-A9EF-33F93E3B608E"
    },
    {
      "class": "text",
      "id": "19DD4C9E-FA43-4EFC-9DB7-FA07FAD0EDF5"
    }
  ],
  "name": "new_epic copy 23",
  "nameIsFixed": true,
  "resizingConstraint": 63,
  "resizingType": 0,
  "rotation": 0,
  "shouldBreakMaskChain": false,
  "style": {
    "_class": "style",
    "endDecorationType": 0,
    "miterLimit": 10,
    "startDecorationType": 0
  }
}