{
  "_class": "group",
  "do_objectID": "C8DCDBF6-5945-406E-BE0D-EE1E8A13B27A",
  "exportOptions": {
    "_class": "exportOptions",
    "exportFormats": [
    ],
    "includedLayerIds": [
    ],
    "layerOptions": 0,
    "shouldTrim": false
  },
  "frame": {
    "_class": "rect",
    "constrainProportions": false,
    "height": 32,
    "width": 521,
    "x": 971,
    "y": 4
  },
  "hasClickThrough": false,
  "isFlippedHorizontal": false,
  "isFlippedVertical": false,
  "isLocked": false,
  "isVisible": true,
  "layerListExpandedType": 2,
  "layers": [
    {
      "class": "symbolInstance",
      "id": "387F4A50-4F06-4C06-A9A7-AADDF9C294DF"
    },
    {
      "class": "symbolInstance",
      "id": "2759948C-A6A3-4374-88F9-7CAD265CAAEE"
    },
    {
      "class": "symbolInstance",
      "id": "BEADA810-C3C9-449F-AF76-A44672089C07"
    },
    {
      "class": "symbolInstance",
      "id": "BF63245A-B613-44AF-892C-0642C7C0FC89"
    },
    {
      "class": "symbolInstance",
      "id": "1C1EDDEB-98AB-4526-8373-40AB85831A0F"
    },
    {
      "class": "symbolInstance",
      "id": "F6FA1E20-4B44-4EBB-B6F8-20AA592DAF29"
    }
  ],
  "name": "right-aligned",
  "nameIsFixed": true,
  "resizingConstraint": 28,
  "resizingType": 0,
  "rotation": 0,
  "shouldBreakMaskChain": false,
  "style": {
    "_class": "style",
    "endDecorationType": 0,
    "miterLimit": 10,
    "startDecorationType": 0
  }
}