{
  "_class": "shapePath",
  "booleanOperation": -1,
  "do_objectID": "0AB5033B-D78C-4A2D-9C92-46AD546AB9D8",
  "edited": true,
  "exportOptions": {
    "_class": "exportOptions",
    "exportFormats": [
    ],
    "includedLayerIds": [
    ],
    "layerOptions": 0,
    "shouldTrim": false
  },
  "frame": {
    "_class": "rect",
    "constrainProportions": false,
    "height": 4.039700099408284,
    "width": 4.72621778834952,
    "x": 2.095382904090617,
    "y": 1.902327370035504
  },
  "isFlippedHorizontal": false,
  "isFlippedVertical": false,
  "isLocked": false,
  "isVisible": true,
  "layerListExpandedType": 0,
  "name": "path26-path",
  "nameIsFixed": false,
  "path": {
    "_class": "path",
    "isClosed": true,
    "pointRadiusBehaviour": 1,
    "points": [
      {
        "_class": "curvePoint",
        "cornerRadius": 0,
        "curveFrom": "{0.89163070234978881, 0.13374164048027534}",
        "curveMode": 4,
        "curveTo": "{1, 0.26745203369399806}",
        "hasCurveFrom": true,
        "hasCurveTo": false,
        "point": "{1, 0.26745203369399806}"
      },
      {
        "_class": "curvePoint",
        "cornerRadius": 0,
        "curveFrom": "{0.13299266664044671, 0}",
        "curveMode": 3,
        "curveTo": "{0.70936482363569542, 0}",
        "hasCurveFrom": true,
        "hasCurveTo": true,
        "point": "{0.46305170946805901, 0}"
      },
      {
        "_class": "curvePoint",
        "cornerRadius": 0,
        "curveFrom": "{0, 0.8197612644620641}",
        "curveMode": 3,
        "curveTo": "{0, 0.19186300695874725}",
        "hasCurveFrom": true,
        "hasCurveTo": true,
        "point": "{0, 0.44187863234972619}"
      },
      {
        "_class": "curvePoint",
        "cornerRadius": 0,
        "curveFrom": "{0.78326140469957695, 1}",
        "curveMode": 3,
        "curveTo": "{0.22166326909846967, 1}",
        "hasCurveFrom": true,
        "hasCurveTo": true,
        "point": "{0.69459080224155423, 1}"
      },
      {
        "_class": "curvePoint",
        "cornerRadius": 0,
        "curveFrom": "{1, 0.97093931558896207}",
        "curveMode": 4,
        "curveTo": "{0.92610341893611814, 0.98837572623558467}",
        "hasCurveFrom": false,
        "hasCurveTo": true,
        "point": "{1, 0.97093931558896207}"
      },
      {
        "_class": "curvePoint",
        "cornerRadius": 0,
        "curveFrom": "{1, 0.26745203369399806}",
        "curveMode": 1,
        "curveTo": "{1, 0.26745203369399806}",
        "hasCurveFrom": false,
        "hasCurveTo": false,
        "point": "{1, 0.26745203369399806}"
      }
    ]
  },
  "resizingConstraint": 63,
  "resizingType": 0,
  "rotation": 0,
  "shouldBreakMaskChain": false
}