{
  "_class": "shapePath",
  "booleanOperation": -1,
  "do_objectID": "D6B0F4E3-6645-42A1-BECD-35CAA6A5F1EB",
  "edited": true,
  "exportOptions": {
    "_class": "exportOptions",
    "exportFormats": [
    ],
    "includedLayerIds": [
    ],
    "layerOptions": 0,
    "shouldTrim": false
  },
  "frame": {
    "_class": "rect",
    "constrainProportions": false,
    "height": 9.999836286585492,
    "width": 12,
    "x": 2,
    "y": 2
  },
  "isFlippedHorizontal": false,
  "isFlippedVertical": false,
  "isLocked": false,
  "isVisible": true,
  "layerListExpandedType": 0,
  "name": "Path",
  "nameIsFixed": false,
  "path": {
    "_class": "path",
    "isClosed": true,
    "pointRadiusBehaviour": 1,
    "points": [
      {
        "_class": "curvePoint",
        "cornerRadius": 0,
        "curveFrom": "{0.4356291623260673, 0.20000054553418786}",
        "curveMode": 1,
        "curveTo": "{0.4356291623260673, 0.20000054553418786}",
        "hasCurveFrom": false,
        "hasCurveTo": false,
        "point": "{0.4356291623260673, 0.20000054553418786}"
      },
      {
        "_class": "curvePoint",
        "cornerRadius": 0,
        "curveFrom": "{0.38426139944810939, 0.026631507537361397}",
        "curveMode": 4,
        "curveTo": "{0.39607412883793486, 0.066500121930722009}",
        "hasCurveFrom": true,
        "hasCurveTo": false,
        "point": "{0.39607412883793486, 0.066500121930722009}"
      },
      {
        "_class": "curvePoint",
        "cornerRadius": 0,
        "curveFrom": "{0.31755623798133986, 0}",
        "curveMode": 4,
        "curveTo": "{0.35281709917534404, 0}",
        "hasCurveFrom": false,
        "hasCurveTo": true,
        "point": "{0.31755623798133986, 0}"
      },
      {
        "_class": "curvePoint",
        "cornerRadius": 0,
        "curveFrom": "{0, 0}",
        "curveMode": 1,
        "curveTo": "{0, 0}",
        "hasCurveFrom": false,
        "hasCurveTo": false,
        "point": "{0, 0}"
      },
      {
        "_class": "curvePoint",
        "cornerRadius": 0,
        "curveFrom": "{1.8503717077085941e-17, 0.95522774200115612}",
        "curveMode": 4,
        "curveTo": "{1.8503717077085941e-17, 0.89999836283905243}",
        "hasCurveFrom": true,
        "hasCurveTo": false,
        "point": "{1.8503717077085941e-17, 0.89999836283905243}"
      },
      {
        "_class": "curvePoint",
        "cornerRadius": 0,
        "curveFrom": "{0.083333333333333356, 1}",
        "curveMode": 4,
        "curveTo": "{0.037309604180767252, 1}",
        "hasCurveFrom": false,
        "hasCurveTo": true,
        "point": "{0.083333333333333356, 1}"
      },
      {
        "_class": "curvePoint",
        "cornerRadius": 0,
        "curveFrom": "{0.96269039581923266, 1}",
        "curveMode": 4,
        "curveTo": "{0.91666666666666652, 1}",
        "hasCurveFrom": true,
        "hasCurveTo": false,
        "point": "{0.91666666666666652, 1}"
      },
      {
        "_class": "curvePoint",
        "cornerRadius": 0,
        "curveFrom": "{1, 0.89999836283905243}",
        "curveMode": 4,
        "curveTo": "{1, 0.9552277420011559}",
        "hasCurveFrom": false,
        "hasCurveTo": true,
        "point": "{1, 0.89999836283905243}"
      },
      {
        "_class": "curvePoint",
        "cornerRadius": 0,
        "curveFrom": "{1, 0.24477280353303171}",
        "curveMode": 4,
        "curveTo": "{1, 0.3000021826951354}",
        "hasCurveFrom": true,
        "hasCurveTo": false,
        "point": "{1, 0.3000021826951354}"
      },
      {
        "_class": "curvePoint",
        "cornerRadius": 0,
        "curveFrom": "{0.91666666666666663, 0.20000054553418786}",
        "curveMode": 4,
        "curveTo": "{0.96269039581923277, 0.20000054553418786}",
        "hasCurveFrom": false,
        "hasCurveTo": true,
        "point": "{0.91666666666666663, 0.20000054553418786}"
      }
    ]
  },
  "resizingConstraint": 63,
  "resizingType": 0,
  "rotation": 0,
  "shouldBreakMaskChain": false
}