{
  "_class": "group",
  "do_objectID": "710C0318-428D-4202-ADEB-4EE76A02411F",
  "exportOptions": {
    "_class": "exportOptions",
    "exportFormats": [
    ],
    "includedLayerIds": [
    ],
    "layerOptions": 0,
    "shouldTrim": false
  },
  "frame": {
    "_class": "rect",
    "constrainProportions": false,
    "height": 28,
    "width": 456,
    "x": 607,
    "y": 462
  },
  "hasClickThrough": false,
  "isFlippedHorizontal": false,
  "isFlippedVertical": false,
  "isLocked": false,
  "isVisible": true,
  "layerListExpandedType": 2,
  "layers": [
    {
      "class": "shapeGroup",
      "id": "2E8F011C-45F3-4C24-9B2F-620FEC17DE78"
    },
    {
      "class": "shapeGroup",
      "id": "2E3663BE-779E-4859-A29D-AF725C490715"
    },
    {
      "class": "shapeGroup",
      "id": "F304D2FC-DBAB-4846-B46E-043F4175B26D"
    },
    {
      "class": "text",
      "id": "D522BCE9-23B3-4437-BC43-16C72E1EA330"
    }
  ],
  "name": "new_epic copy 5",
  "nameIsFixed": true,
  "resizingConstraint": 63,
  "resizingType": 0,
  "rotation": 0,
  "shouldBreakMaskChain": false,
  "style": {
    "_class": "style",
    "endDecorationType": 0,
    "miterLimit": 10,
    "startDecorationType": 0
  }
}