{
  "_class": "oval",
  "booleanOperation": 0,
  "do_objectID": "EB6D07EC-241A-4DF1-8929-5CD97905670F",
  "edited": true,
  "exportOptions": {
    "_class": "exportOptions",
    "exportFormats": [
    ],
    "includedLayerIds": [
    ],
    "layerOptions": 0,
    "shouldTrim": false
  },
  "frame": {
    "_class": "rect",
    "constrainProportions": false,
    "height": 8,
    "width": 15.99999999999999,
    "x": -3.552713678800503e-15,
    "y": 8
  },
  "isFlippedHorizontal": false,
  "isFlippedVertical": false,
  "isLocked": false,
  "isVisible": true,
  "layerListExpandedType": 0,
  "name": "Oval 3 Copy",
  "nameIsFixed": false,
  "path": {
    "_class": "path",
    "isClosed": true,
    "pointRadiusBehaviour": 1,
    "points": [
      {
        "_class": "curvePoint",
        "cornerRadius": 0,
        "curveFrom": "{0.99367475876914124, 1}",
        "curveMode": 2,
        "curveTo": "{0.0063252412308587606, 1}",
        "hasCurveFrom": true,
        "hasCurveTo": true,
        "point": "{0.5, 1}"
      },
      {
        "_class": "curvePoint",
        "cornerRadius": 0,
        "curveFrom": "{1, 0.38456194196427462}",
        "curveMode": 2,
        "curveTo": "{1, 0.8954380580357143}",
        "hasCurveFrom": true,
        "hasCurveTo": true,
        "point": "{1, 0.63999999999999446}"
      },
      {
        "_class": "curvePoint",
        "cornerRadius": 0,
        "curveFrom": "{0.080313464008742882, 5.1223782437480814e-17}",
        "curveMode": 2,
        "curveTo": "{0.91968653599125494, 0}",
        "hasCurveFrom": true,
        "hasCurveTo": true,
        "point": "{0.49999999999999878, 0}"
      },
      {
        "_class": "curvePoint",
        "cornerRadius": 0,
        "curveFrom": "{0, 0.8884974888392857}",
        "curveMode": 2,
        "curveTo": "{1.5216082715159461e-17, 0.39150251116070967}",
        "hasCurveFrom": true,
        "hasCurveTo": true,
        "point": "{0, 0.63999999999999768}"
      }
    ]
  },
  "resizingConstraint": 63,
  "resizingType": 0,
  "rotation": 0,
  "shouldBreakMaskChain": false
}