{
  "_class": "group",
  "do_objectID": "400A78D1-7236-4073-8BA4-5DD9FAAA3635",
  "exportOptions": {
    "_class": "exportOptions",
    "exportFormats": [
    ],
    "includedLayerIds": [
    ],
    "layerOptions": 0,
    "shouldTrim": false
  },
  "frame": {
    "_class": "rect",
    "constrainProportions": false,
    "height": 28,
    "width": 527,
    "x": 607,
    "y": 302
  },
  "hasClickThrough": false,
  "isFlippedHorizontal": false,
  "isFlippedVertical": false,
  "isLocked": false,
  "isVisible": true,
  "layerListExpandedType": 2,
  "layers": [
    {
      "class": "shapeGroup",
      "id": "A2FDCD01-DFFB-4C09-978D-9504E605B4CC"
    },
    {
      "class": "shapeGroup",
      "id": "BB6B6DC0-97D9-46FA-AB45-B3F3533CC69B"
    },
    {
      "class": "text",
      "id": "08605B56-F512-4689-984B-687BB7F00971"
    }
  ],
  "name": "new_epic",
  "nameIsFixed": true,
  "resizingConstraint": 63,
  "resizingType": 0,
  "rotation": 0,
  "shouldBreakMaskChain": false,
  "style": {
    "_class": "style",
    "endDecorationType": 0,
    "miterLimit": 10,
    "startDecorationType": 0
  }
}