{
  "_class": "shapePath",
  "booleanOperation": -1,
  "do_objectID": "E3E7DCC4-08F1-4F52-B7F8-B2FAB15F6909",
  "edited": true,
  "exportOptions": {
    "_class": "exportOptions",
    "exportFormats": [
    ],
    "includedLayerIds": [
    ],
    "layerOptions": 0,
    "shouldTrim": false
  },
  "frame": {
    "_class": "rect",
    "constrainProportions": false,
    "height": 6.964645562682292,
    "width": 6.96464556268229,
    "x": 1.989898732246007,
    "y": 1.989898732246007
  },
  "isFlippedHorizontal": false,
  "isFlippedVertical": false,
  "isLocked": false,
  "isVisible": true,
  "layerListExpandedType": 0,
  "name": "Path",
  "nameIsFixed": false,
  "path": {
    "_class": "path",
    "isClosed": true,
    "pointRadiusBehaviour": 1,
    "points": [
      {
        "_class": "curvePoint",
        "cornerRadius": 0,
        "curveFrom": "{1.0488155364658844, 0.65829124473880984}",
        "curveMode": 2,
        "curveTo": "{0.65829124473880962, 1.0488155364658847}",
        "hasCurveFrom": true,
        "hasCurveTo": true,
        "point": "{0.85355339060234725, 0.85355339060234703}"
      },
      {
        "_class": "curvePoint",
        "cornerRadius": 0,
        "curveFrom": "{0.65829124473880962, -0.048815536465884372}",
        "curveMode": 2,
        "curveTo": "{1.0488155364658844, 0.34170875526119032}",
        "hasCurveFrom": true,
        "hasCurveTo": true,
        "point": "{0.85355339060234725, 0.14644660939765308}"
      },
      {
        "_class": "curvePoint",
        "cornerRadius": 0,
        "curveFrom": "{-0.048815536465884372, 0.34170875526119066}",
        "curveMode": 2,
        "curveTo": "{0.34170875526119077, -0.048815536465884372}",
        "hasCurveFrom": true,
        "hasCurveTo": true,
        "point": "{0.1464466093976533, 0.14644660939765308}"
      },
      {
        "_class": "curvePoint",
        "cornerRadius": 0,
        "curveFrom": "{0.3417087552611906, 1.0488155364658844}",
        "curveMode": 2,
        "curveTo": "{-0.048815536465884435, 0.6582912447388094}",
        "hasCurveFrom": true,
        "hasCurveTo": true,
        "point": "{0.14644660939765317, 0.85355339060234703}"
      }
    ]
  },
  "resizingConstraint": 63,
  "resizingType": 0,
  "rotation": 0,
  "shouldBreakMaskChain": false
}