2463;0.05000000075;0.009999999776;0.004999999888;2000;700;2;2;2013;6;1;0;2013;6;10;23
1;65380;65380;65380;29689;6002;2881;240;239;;;;;;;
203607296;1.865346662e+10;5907752960;2454675456;7714841088;2515607552;1581320064;9367617536;3566228992;;;;;;;
1;65380;0;0;29689;6002;2881;240;239;;;;;;;
231754096;1.785107866e+10;0;0;7352944640;1544497792;913130432;7903993344;3544092416;;;;;;;
1;65380;0;0;29689;6002;2881;240;239;;;;;;;
213262496;1.781143552e+10;0;0;7860499456;2443073792;1556107008;8038798848;3541114880;;;;;;;
1;20988;0;0;6504;7980;3870;240;239;;;;;;;
224967904;1.136895078e+10;0;0;3353787392;3381980928;2135784832;8177403392;3572143872;;;;;;;
1;20988;0;0;6504;7980;3870;240;239;;;;;;;
217279392;1.140975104e+10;0;0;3332035072;3378874624;2135564160;8051684352;3521172736;;;;;;;
1;20988;0;0;6504;7980;3870;240;239;;;;;;;
201841904;1.141994189e+10;0;0;3309501440;3353794048;2131552256;8160265216;3455804416;;;;;;;
1;3406;0;0;0;3406;1583;240;239;;;;;;;
216953200;3055893760;0;0;0;3836581120;2598117632;8186383360;3496054272;;;;;;;
