162 1957.0
486 1400.0
457 47.5
124 2060.0
357 2726.0
990 760.0
932 2525.0
451 3640.0
278 750.0
1215 880.0
536 515.0
224 250.0
307 295.0
783 1440.0
785 806.0
418 3724.0
662 1000.0
244 5448.0
390 270.0
1424 1412.0
388 3816.0
228 3120.0
398 3122.0
628 1280.0
172 1092.0
508 430.0
368 2600.0
225 234.0
467 3824.0
348 3864.0
306 170.0
218 800.0
535 2963.0
1071 1760.0
269 1995.0
739 1280.0
257 1086.0
823 1400.0
739 2640.0
653 1131.0
739 1321.0
327 1840.0
250 2764.0
508 480.0
563 1020.0
484 2726.0
921 1345.0
459 74.0
218 5706.0
836 1430.0
965 2688.0
224 253.0
954 2387.0
144 440.0
1296 2000.0
788 1316.0
1224 730.0
445 360.0
255 500.0
402 32.0
418 45.0
407 90.0
407 45.0
407 420.0
402 23.0
394 41.0
402 28.0
708 50.0
708 50.0
482 68.0
482 24.3
482 195.0
482 30.0
487 12.0
487 55.0
493 97.0
487 41.0
487 158.0
480 88.0
469 165.0
233 800.0
530 116.0
533 88.8
533 6.3
524 97.0
466 444.0
471 124.0
471 45.0
488 572.5
488 27.0
466 180.0
479 14.5
471 9.8
471 42.0
471 45.0
471 28.6
488 66.5
493 78.0
485 101.0
502 165.0
499 156.0
494 101.0
438 301.8
457 105.0
438 29.0
438 12.0
457 35.0
459 21.0
457 48.0
457 300.0
457 40.0
457 25.0
438 240.0
438 30.0
445 30.0
445 22.0
426 19.0
1253 42.5
464 32.0
460 204.0
478 354.0
470 295.0
461 215.0
442 120.0
442 180.0
486 210.0
1253 54.5
1253 39.0
66 30.0
66 95.0
452 38.0
443 12.0
452 13.5
469 360.0
443 25.0
469 16.5
480 256.0
528 37.3
66 49.3
531 292.0
426 56.0
327 166.0
327 156.0
344 156.0
396 72.0
439 883.0
452 76.0
444 116.0
422 70.0
447 360.0
436 39.0
437 160.0
427 72.0
447 60.0
394 44.0
394 262.0
440 37.0
457 132.0
468 110.0
529 139.0
529 88.0
526 57.0
529 27.4
532 41.1
533 93.3
975 141.0
315 156.0
315 152.0
963 108.0
975 141.0
416 85.0
427 84.0
424 396.0
422 90.0
430 360.0
430 198.0
423 300.0
507 99.0
491 21.7
493 32.5
486 176.0
493 44.0
478 156.0
717 562.5
990 1220.0
1098 350.0
1141 2106.0
1150 840.0
1150 460.0
1169 1155.0
1160 1345.0
1160 190.0
1162 200.0
1159 165.0
1166 55.0
1167 77.0
1162 1775.0
1150 226.0
1146 125.0
1150 81.5
1110 600.0
1102 800.0
1102 464.0
1102 488.0
1164 590.0
1155 460.0
1097 1832.0
1119 4440.0
1119 858.0
1107 2880.0
1085 647.0
1098 622.0
1134 1800.0
872 2216.0
1415 2310.0
1414 1320.0
1473 1285.0
1456 630.0
1456 300.0
1419 550.0
1442 800.0
1429 535.0
1377 1166.0
1446 320.0
1453 510.0
1489 210.0
1468 115.0
1468 220.0
1452 150.0
1414 106.0
1449 335.0
1449 140.0
1453 150.0
1438 146.0
1438 221.0
1453 300.0
1253 131.0
1221 125.0
1221 695.0
1223 124.0
1224 323.0
1419 250.0
1419 100.0
1419 200.0
1423 100.0
1430 74.25
1431 100.0
1468 200.0
1447 225.0
1462 610.0
508 750.0
555 420.0
226 350.0
539 359.0
536 460.0
551 1164.0
546 538.0
548 389.0
539 438.0
544 556.0
535 261.0
548 460.0
535 130.0
541 385.0
555 410.0
230 144.0
539 350.0
545 889.0
539 156.0
548 238.0
628 253.0
608 360.0
538 255.0
555 0.8
552 5.0
552 9.0
548 9.9
548 19.7
548 10.0
544 20.0
992 9.2
240 1.9
551 8.1
992 1.8
1342 864.0
1321 375.0
1286 240.0
1321 120.0
1328 670.0
1290 1450.0
1328 840.0
1285 630.0
1329 120.0
1299 1260.0
1342 46.8
1324 160.0
1286 80.0
1324 60.0
1324 80.0
1286 128.0
1286 66.0
1326 106.0
1341 82.0
1341 104.0
1047 1490.0
1055 800.0
1044 1000.0
1168 800.0
1047 800.0
1041 720.0
1041 352.0
1044 330.0
1043 363.0
1044 237.0
1059 295.8
1462 860.0
466 910.0
1057 388.0
1156 165.0
1212 95.0
1050 370.0
1073 120.0
1058 144.0
1058 22.5
1058 45.0
1066 364.0
1071 450.0
1042 650.0
1066 40.0
1057 13.88
1041 19.5
1149 1532.0
1160 676.0
1128 250.0
1158 50.0
1167 500.0
1158 8.0
813 90.0
1090 160.2
1082 151.0
1091 20.0
1167 12.6
1244 8.2
1244 200.0
1167 21.0
1198 92.8
1084 8.0
1084 3.5
1089 26.0
1079 7.2
1130 9.8
1148 7.5
1074 716.0
1127 10.5
1125 198.0
1130 263.0
1078 322.5
1103 275.0
1112 87.0
1112 205.85
1112 210.0
1089 227.0
1104 97.5
1170 880.0
1211 518.0
1199 735.0
1199 198.0
1218 720.0
1215 430.0
1214 80.0
1217 218.0
1217 24.0
1206 67.5
1201 93.6
1201 55.2
1203 38.4
1172 60.0
1202 38.4
1202 24.75
1201 31.5
1215 43.2
1176 45.06
1199 21.75
1206 16.5
1208 25.5
1208 25.5
1208 25.5
1206 18.9
1206 15.0
1206 16.5
1181 170.0
1175 120.0
1187 120.0
1188 403.0
1180 950.0
1186 95.0
1183 433.0
1175 49.0
1185 240.0
1204 900.0
1188 1290.0
1180 28.0
1175 13.5
1175 4.4
1179 196.0
1179 110.0
1179 114.0
1175 33.4
1174 47.0
1231 182.4
1346 218.5
1350 360.0
1347 307.0
1306 500.0
1306 600.0
1306 250.0
1278 5.0
1513 22.5
1513 5.0
1305 24.0
1305 25.2
1301 186.0
1301 97.0
1411 800.0
1411 678.0
1271 675.0
1280 125.0
1281 210.0
1280 84.0
1314 42.0
1310 80.0
1281 116.0
1311 12.8
1311 150.0
1311 19.2
1253 585.0
638 336.0
704 660.0
704 800.0
1253 1040.0
1313 1595.0
1270 600.0
1262 850.0
1270 330.0
1313 1250.0
1313 550.0
1257 360.0
1275 485.0
1258 435.0
1258 148.0
1273 400.0
1258 420.0
1257 378.0
1257 570.0
1259 380.0
1257 450.0
1274 16.0
1261 316.0
1261 430.0
1258 437.0
1313 50.0
1272 108.0
1267 154.0
1266 162.0
1268 230.0
1266 320.0
1266 437.2
1266 129.9
1327 122.0
1313 375.0
1266 300.0
1266 156.7
1327 384.0
1272 315.0
368 435.0
441 1800.0
825 390.0
859 916.0
808 188.0
1214 880.0
159 1212.6
29 400.0
144 1066.0
190 240.0
1 630.0
8 186.0
4 390.0
127 426.0
127 401.0
5 216.0
7 156.0
6 201.0
6 108.0
2 42.0
2 60.0
2 54.0
2 68.0
2 125.0
16 97.0
19 139.0
24 1192.0
21 1176.0
19 628.0
6 990.0
16 862.0
24 197.0
19 830.0
2 191.6
14 336.0
23 1000.0
22 64.0
21 750.0
1 42.0
2 22.0
18 132.0
6 146.0
9 64.0
16 50.0
18 41.0
9 40.0
14 24.0
24 82.0
31 921.7
33 615.0
33 865.5
94 855.3
63 365.2
68 1199.6
215 568.0
676 1179.0
676 800.0
657 1770.0
675 1140.0
755 1280.0
679 855.0
675 1482.0
671 1740.0
752 814.0
736 760.0
754 760.0
680 840.0
686 1030.0
739 1185.0
690 780.0
674 780.0
727 840.0
659 380.0
744 400.0
728 1520.0
728 1980.0
698 295.0
705 1280.0
724 150.0
27 1400.0
215 800.0
111 850.0
129 410.0
137 800.0
132 424.0
128 804.0
48 755.0
45 800.0
41 400.0
111 800.0
679 1504.0
201 840.0
197 1200.0
201 1200.0
150 854.0
150 795.0
182 335.0
182 221.0
156 400.0
156 400.0
156 629.0
210 400.0
212 1600.0
215 800.0
202 400.0
215 800.0
202 1200.0
94 400.0
89 800.0
128 760.0
27 850.0
126 460.0
126 601.5
111 859.0
128 285.0
136 1050.0
207 1158.0
163 957.0
133 1230.0
127 842.0
83 300.0
29 563.0
47 595.0
51 513.0
96 162.0
191 324.0
73 655.0
39 217.0
56 516.0
136 160.0
128 80.0
111 407.0
215 402.0
575 372.0
640 1000.0
638 785.0
753 857.0
739 1321.0
730 360.0
751 757.0
653 766.0
1398 270.0
680 150.0
744 150.0
737 800.0
727 765.0
733 760.0
671 800.0
710 280.0
726 3600.0
690 750.0
764 750.0
709 390.0
672 2640.0
750 1976.0
676 746.0
678 778.0
678 50.0
735 100.0
734 100.0
727 100.0
719 1280.0
713 528.0
679 180.0
710 125.0
725 133.0
692 120.0
673 133.0
707 100.0
724 100.0
741 100.0
643 180.0
714 310.0
1253 140.0
762 550.0
764 562.6
1377 1026.0
1446 270.0
1404 1564.0
1404 1240.0
1379 115.0
1408 310.0
1408 697.0
1387 230.0
1387 120.0
1355 45.0
1370 365.0
1370 614.0
1295 80.0
1353 96.0
1345 51.0
1345 22.0
1345 104.0
1344 36.0
1400 6.0
1400 7.0
133 525.0
114 190.0
114 291.0
114 206.0
813 3000.0
835 2575.0
856 1866.0
826 875.0
876 2234.0
919 1823.0
895 2200.0
895 2205.0
895 2413.0
868 747.0
875 950.0
1038 646.0
1038 790.0
1511 825.0
1036 750.0
1039 378.0
768 626.0
1032 716.0
1038 397.0
1511 438.0
1511 409.0
1033 52.0
1511 81.0
1511 185.0
1035 95.0
1037 392.0
958 1200.0
808 444.0
950 550.0
950 850.0
972 698.0
972 360.0
972 160.0
940 496.0
890 560.0
858 850.0
878 417.0
865 270.0
924 406.0
904 406.0
903 1800.0
904 3400.0
875 303.0
875 345.0
823 886.0
823 854.0
943 773.0
943 724.0
876 1285.0
868 507.0
263 466.0
802 214.0
808 330.0
785 256.0
876 606.0
902 1060.0
849 1045.0
878 154.0
842 220.0
846 80.0
883 140.0
886 140.0
886 480.0
439 750.0
303 240.0
868 770.0
868 1285.0
940 1455.0
991 992.0
835 1600.0
790 391.7
793 757.0
960 474.0
802 600.0
944 1066.0
808 450.0
933 843.0
876 640.0
832 838.0
953 840.0
955 1462.0
955 365.0
904 430.0
774 553.0
875 364.0
858 305.0
822 750.0
833 320.0
890 458.0
858 1600.0
788 1640.0
950 440.0
607 1705.0
536 870.0
621 790.0
621 120.0
619 266.0
619 435.0
614 860.0
621 870.0
619 266.0
619 425.0
617 435.0
539 460.0
621 428.0
607 1290.0
624 430.0
624 339.0
628 231.0
624 1245.0
622 590.0
621 800.0
617 680.0
621 1080.0
621 1113.0
607 1600.0
536 406.0
621 80.0
621 230.0
623 218.0
952 2235.0
619 128.0
616 350.0
617 820.0
628 640.0
617 69.0
617 144.0
621 82.0
1358 420.0
1346 315.0
1254 210.0
1254 180.0
1357 180.0
1254 160.0
1254 115.0
1372 110.0
1254 72.0
999 172.0
1365 730.0
1361 450.0
1358 300.0
1365 300.0
1357 216.0
1357 8.0
1242 30.0
1254 60.0
1238 48.0
1238 30.0
1021 120.0
1021 730.0
1372 48.5
1021 41.0
1234 330.0
1228 420.0
1234 320.0
1229 328.0
1229 86.8
1228 78.0
1508 89.0
1241 94.0
1241 76.0
1241 76.0
1242 60.0
1242 522.0
1242 237.0
1242 40.8
1242 46.4
1240 7.2
1240 24.0
1240 7.5
1233 90.0
1236 216.0
1229 5.5
1235 55.5
1236 22.5
1235 42.3
434 480.0
875 120.0
868 750.0
1015 200.0
1019 231.0
1015 345.0
1015 360.0
1013 480.0
997 328.0
996 293.0
1001 287.0
304 2726.0
1017 838.0
1017 246.0
997 757.0
412 58.0
423 546.0
233 800.0
1001 179.0
1000 168.0
1000 210.0
1002 236.5
998 187.0
1030 132.0
1017 164.0
999 700.0
1005 405.0
999 529.0
1007 83.7
1007 13.5
996 155.0
1027 88.0
1021 24.0
1027 24.6
1021 24.6
1027 80.0
1029 75.0
1026 90.0
1026 87.0
1022 79.0
1022 28.0
1019 25.3
1019 1.0
1015 25.0
1021 138.1
1013 140.0
1025 108.0
1023 198.0
1023 295.0
1028 29.0
1028 157.0
1028 247.0
1028 450.0
1028 7.0
1023 260.0
1020 94.0
1023 9.0
604 1296.0
606 385.0
601 2069.0
591 105.0
575 11.3
575 45.0
575 15.5
575 15.0
601 388.0
405 408.0
640 568.0
1022 50.0
736 1000.0
647 1016.0
702 1184.0
702 134.0
764 500.0
603 162.0
576 479.0
576 1000.0
582 67.0
582 348.0
582 100.0
582 136.0
582 55.0
582 92.0
582 62.0
582 255.0
582 10.0
397 100.0
397 49.0
602 5.6
990 47.0
599 185.0
599 74.0
590 66.0
596 34.0
599 11.0
594 45.0
603 900.0
603 189.0
1190 1866.0
242 5528.0
235 2764.0
478 250.0
945 2384.0
230 412.0
291 2400.0
499 868.0
255 180.0
437 2782.0
354 1912.0
64 466.0
1072 2026.0
548 3129.0
478 3820.0
793 1410.0
137 2087.0
1253 135.5
984 140.4
887 210.0
887 487.0
