1 2 9.73161837986141 -32.8295559802554 0.0645 0 0 0 0.0083 0.028
2 3 3.67309910958161 -10.4769605474643 0.0409 0 0 0 0.0298 0.085
3 4 7.64505119453925 -24.9829351535836 0.019 0 0 0 0.0112 0.0366
4 5 2.9301109926044 -6.18839441638049 0.0129 0 0 0 0.0625 0.132
4 6 1.81029764661306 -6.23079189997053 0.0174 0 0 0 0.043 0.148
6 7 1.85116623472788 -9.44094779711218 0.0138 0 0 0 0.02 0.102
6 8 1.09079641330694 -5.56660116525373 0.0235 0 0 0 0.0339 0.173
8 9 3.73830364088118 -19.0691246327777 0.0274 0 0 0 0.0099 0.0505
9 10 1.2486456086589 -5.6815067125699 0.022 0 0 0 0.0369 0.1679
9 11 3.28382981106523 -10.7933630999353 0.0109 0 0 0 0.0258 0.0848
9 12 0.710339072902274 -3.23379670534214 0.0386 0 0 0 0.0648 0.295
9 13 1.76335096806502 -5.79229631921565 0.0203 0 0 0 0.0481 0.158
13 14 6.41461755272621 -21.0904849839635 0.0055 0 0 0 0.0132 0.0434
13 15 3.25066886439273 -10.5012313872018 0.0115 0 0 0 0.0269 0.0869
1 15 2.07028742102668 -10.5840536692937 0.0494 0 0 0 0.0178 0.091
1 16 1.02028983422762 -4.62950893944692 0.0273 0 0 0 0.0454 0.206
1 17 1.94596433161849 -8.83042637877296 0.0143 0 0 0 0.0238 0.108
3 15 5.27439897898054 -17.2557497460475 0.0272 0 0 0 0.0162 0.053
4 18 0 -1.8018018018018 0 0.97 0 0 0 0.555
4 18 0 -2.32558139534884 0 0.978 0 0 0 0.43
5 6 6.01491779280401 -12.7667625999582 0.0062 0 0 0 0.0302 0.0641
7 8 2.64125488109603 -13.5293055779883 0.0097 0 0 0 0.0139 0.0712
10 12 1.659305619535 -7.55972451932552 0.0164 0 0 0 0.0277 0.1262
11 13 3.80836576706122 -12.5010033250619 0.0094 0 0 0 0.0223 0.0732
12 13 4.83585268579998 -15.7572727964269 0.0302 0 0 0 0.0178 0.058
12 16 2.59602030087875 -11.725358358969 0.0108 0 0 0 0.018 0.0813
12 17 1.18094695287427 -5.32467265905526 0.0238 0 0 0 0.0397 0.179
14 15 5.20627188308723 -16.6539808189983 0.0074 0 0 0 0.0171 0.0547
18 19 0.676204920894292 -1.00477303863902 0 0 0 0 0.461 0.685
19 20 1.05421967255862 -1.6167185084468 0 0 0 0 0.283 0.434
21 20 0 -1.28749839062701 0 1.043 0 0 0 0.7767
21 22 3.85220109327142 -6.12374358577114 0 0 0 0 0.0736 0.117
22 23 30.0866129767513 -46.1935876006686 0 0 0 0 0.0099 0.0152
23 24 1.78318222833326 -2.74996777381515 0.0042 0 0 0 0.166 0.256
24 25 0 -0.846023688663283 0 1 0 0 0 1.182
24 25 0 -0.813008130081301 0 1 0 0 0 1.23
24 26 0 -21.1416490486258 0 1.043 0 0 0 0.0473
26 27 1.79854154630972 -2.76866395613739 0 0 0 0 0.165 0.254
27 28 4.78313364911303 -7.38367233212594 0 0 0 0 0.0618 0.0954
28 29 8.0494056341988 -11.3038304001787 0 0 0 0 0.0418 0.0587
7 29 0 -15.4320987654321 0 0.967 0 0 0 0.0648
25 30 2.287011468939 -3.42204679056057 0 0 0 0 0.135 0.202
30 31 0.922767737096112 -1.40679621268947 0 0 0 0 0.326 0.497
31 32 0.613004398639058 -0.912856648860924 0 0 0 0 0.507 0.755
32 33 13.8386805241753 -12.7089923181202 0 0 0 0 0.0392 0.036
34 32 0 -1.04931794333683 0 0.975 0 0 0 0.953
34 35 5.91715976331361 -8.87573964497041 0.0016 0 0 0 0.052 0.078
35 36 9.08574193534755 -11.3466126029805 0.0008 0 0 0 0.043 0.0537
36 37 13.2993359503981 -16.7846791649851 0 0 0 0 0.029 0.0366
37 38 4.51493256729746 -6.99779871029668 0.001 0 0 0 0.0651 0.1009
37 39 11.9046433089927 -18.8780745360178 0 0 0 0 0.0239 0.0379
36 40 9.76702392269726 -15.1714438265897 0 0 0 0 0.03 0.0466
22 38 15.4977439482117 -23.8116378370961 0 0 0 0 0.0192 0.0295
11 41 0 -1.33511348464619 0 0.955 0 0 0 0.749
41 42 1.24135697708587 -2.11090655040689 0 0 0 0 0.207 0.352
41 43 0 -2.42718446601942 0 0 0 0 0 0.412
38 44 6.78808491447952 -13.7405871106246 0.001 0 0 0 0.0289 0.0585
15 45 0 -9.59692898272553 0 0.955 0 0 0 0.1042
14 46 0 -13.6054421768707 0 0.9 0 0 0 0.0735
46 47 4.46341936735882 -13.1961963904522 0.0016 0 0 0 0.023 0.068
47 48 20.8207017262879 -26.6550741880498 0 0 0 0 0.0182 0.0233
48 49 3.53441349078001 -5.46689856487556 0.0024 0 0 0 0.0834 0.129
49 50 3.51315635387879 -5.61403262542429 0 0 0 0 0.0801 0.128
50 51 2.04999381747896 -3.2539584404428 0 0 0 0 0.1386 0.22
10 51 0 -14.0449438202247 0 0.93 0 0 0 0.0712
13 49 0 -5.23560209424084 0 0.895 0 0 0 0.191
29 52 2.58596077947529 -3.35349976256504 0 0 0 0 0.1442 0.187
52 53 4.91962037575053 -6.3528956033314 0 0 0 0 0.0762 0.0984
53 54 2.1079134978748 -2.60402519439273 0 0 0 0 0.1878 0.232
54 55 2.13036846395391 -2.78596106862333 0 0 0 0 0.1732 0.2265
11 43 0 -6.5359477124183 0 0.958 0 0 0 0.153
44 45 3.22991397248362 -6.4287710798472 0.002 0 0 0 0.0624 0.1242
40 56 0 -0.836820083682008 0 0.958 0 0 0 1.195
56 41 0.910722814182902 -0.904135307389536 0 0 0 0 0.553 0.549
56 42 1.24653719300355 -2.07658431210945 0 0 0 0 0.2125 0.354
39 57 0 -0.738007380073801 0 0.98 0 0 0 1.355
57 56 1.77775961420573 -2.65642241203155 0 0 0 0 0.174 0.26
38 49 2.58113749607218 -3.97270727656327 0.0015 0 0 0 0.115 0.177
38 48 9.46406687940595 -14.6207699867746 0 0 0 0 0.0312 0.0482
9 55 0 -8.29875518672199 0 0.94 0 0 0 0.1205
