1.04 0 3.84396896731616 -0.240389912254225
1.01904599281664 -0.123898144840274 -0.0739 -0.021
1.02999962036428 -0.175056507269741 -0 -0
1.02997476854773 -0.175106843708489 -0.017 -0.0048
1.03722974069225 -0.0618944848628252 -0 -0
1.03710379557493 -0.0621265232049694 -0.0795 -0.0226
1.01311033600629 -0.136031270708353 -0 -0
1.01274829596533 -0.136727302797441 -0.2374 -0.0677
1.01578674970964 -0.130420766160871 -0 -0
1.01506429207431 -0.131993841319583 -0.4268 -0.1216
1.04626619915883 -0.13271662412734 -0 -0
1.04626162884235 -0.132725867476335 -0.003 -0.0009
1.046226470274 -0.132795567962388 -0.0252 -0.0072
1.04455953446189 -0.109006231671507 -0 -0
1.04901381927407 -0.124013874538816 -0 -0
1.04838744218374 -0.125252091564924 -0.4476 -0.1276
1.024796532533 -0.144968409492169 -0 -0
1.02478538518071 -0.144993993846872 -0.0071 -0.002
1.02478606025678 -0.144989907835506 -0.0077 -0.0022
1.02477923582417 -0.145002438661125 -0.0113 -0.0032
1.0247182570323 -0.145133638919067 -0.0461 -0.0131
1.04446800149052 -0.139995754233341 -0 -0
1.04444734516329 -0.140035140539828 -0.0141 -0.004
1.04443224447673 -0.140058947846833 -0.024 -0.0068
1.04239515139885 -0.069865138549812 -0 -0
1.04237576050016 -0.069901104564085 -0.0135 -0.0039
1.04550656949597 -0.139177878030448 -0 -0
1.04546808005977 -0.13925877900118 -0.0233 -0.0067
1.01817860111928 -0.12313255248763 -0 -0
1.01725573070641 -0.124805970230835 -0.5909 -0.1684
1.02158676783623 -0.10180280997467 -0 -0
1.02157773487754 -0.101820831586411 -0.0051 -0.0015
1.02148790716703 -0.102018074093234 -0.0644 -0.0184
1.03264131636842 -0.162786911126791 -0 -0
1.03231474944755 -0.163470471194393 -0.2076 -0.0592
1.02807075730034 -0.107849207232556 -0 -0
1.02801856168628 -0.107956295688874 -0.0357 -0.0102
1.02758551732337 -0.108786021468241 -0.2981 -0.085
1.02456486007699 -0.183154400847093 -0.0741 -0.0211
1.02453723674122 -0.183211914347195 -0.0204 -0.0058
1.04600933408722 -0.138931062813201 -0.3834 -0.1093
1.03013747269302 -0.193223131665812 -0.1062 -0.0303
1.01726388577937 -0.111728546571482 -0.0209 -0.0059
1.02801162595783 -0.181510028726368 -0.0415 -0.0118
1.03846673579429 -0.0361171022915783 -0 -0
1.03782766617266 -0.0504414360780131 -0.0634 -0.0181
1.03917012713417 -0.143039392694147 -0.0154 -0.0044
1.03511817979816 -0.0728693374507476 -0.0182 -0.0052
1.04000000001909 -0.0663723709749534 0.0136 0.00889172960191442
1.04000000001908 -0.0680026982948331 0.0136 0.0118625787955835
1.04000000001909 -0.0653237619109679 0.0136 0.00773368322522785
1.04000000001908 -0.0683255783705842 0.0136 0.0126187806767912
1.04000000001909 -0.0584590487742447 0.0272 0.00799923777858575
1.03741254996369 -0.148245539607464 -0.0266 -0.0076
1.03712194886749 -0.0401362619529611 -0 -0
1.0364819414509 -0.047778310831201 -0.0131 -0.0037
1.02809419709293 -0.182388287711962 -0.0282 -0.008
1.0349405462152 -0.105260290741535 -0.0423 -0.0121
1.01878795259226 -0.134274807444298 -0.0473 -0.0135
1.02911841773154 -0.114418304279267 -0.038 -0.0108
1.0351792544074 -0.0541646912671538 -0.2055 -0.0586
1.02669851824379 -0.197553194053728 -0.2141 -0.061
1.04364638972453 -0.143698658359767 -0.0798 -0.0227
1.04147725637607 -0.0442009520445059 -0 -0
1.04000000001908 0.0369919558542718 0.865 0.00910373188393749
1.04097447828145 -0.136950454497659 -0 -0
1.0400000000175 -0.134890117218145 0.0141 -0.00902413668714772
1.040000000017 -0.116404123271093 0.0838 -0.00514094070345794
1.04000000001699 -0.129539625644413 0.0838 -0.0142466234083674
1.04000000001699 -0.121464809279052 0.0838 -0.00732535042296426
1.04000000001699 -0.130587034873647 0.0838 -0.0157851549652996
1.04000000001699 -0.131119681894228 0.0838 -0.0173018478828866
1.04000000001699 -0.12555020638451 0.0838 -0.0103842215521878
1.02945577268933 -0.0895311808241803 -0.1876 -0.0535
1.02898407510003 -0.10676700327451 -0.036 -0.0103
1.04000000002398 -0.0984774302537774 0.012 0.0140652408751713
1.04000000002398 -0.0923932741143043 0.0072 0.00501352445412401
1.02898407510003 -0.10676700327451 0 0
1.02898407510003 -0.10676700327451 0 0
1.0474028552556 -0.126691594048958 -0.0148 -0.0042
1.03813356966702 -0.0680089085186528 -0 -0
1.03529161685775 -0.0824638065543662 -0.076 -0.0217
1.03059748978157 -0.0898510748240618 -0.0314 -0.0089
1.0193098245683 -0.101886746876323 -0.0375 -0.0107
1.02409014029123 -0.172659396321866 -0.0483 -0.0138
1.01430188210409 -0.133241956037005 -0.0825 -0.0235
1.03822244098359 -0.161996370991989 -0 -0
1.03676008764959 -0.182841332868874 -0.4934 -0.1406
1.03676680464186 -0.104765081377332 -0.6285 -0.1791
1.04000000001332 -0.0845380945946877 0.0096 0.00131852135809693
1.04000000001332 -0.0978984838931943 0.015 0.00599640188350983
1.03676680464186 -0.104765081377332 0 0
1.04636873019957 -0.134457890205607 -0.0306 -0.0087
1.04000000002068 -0.120285331064654 0.054 -0.0252703478788595
1.04525584808109 -0.107243043588537 -0.03 -0.0085
1.03993642014418 -0.0806855969490589 -0.0296 -0.0084
1.02663365735396 -0.140879779019539 -0.0733 -0.0209
1.02598172234429 -0.0993825791294415 -0 -0
1.02176795411207 -0.114032017091908 -0.1217 -0.0347
1.05536479456849 -0.136928132504628 -0.3739 -0.1066
1.01535565755272 -0.130685142735873 -0.0052 -0.0015
1.03763418831618 -0.0323978444872661 -0 -0
1.03622815598327 -0.0492424604451824 -0 -0
1.04000000002009 0.0225387652204326 0.676 0.0304148539564043
1.0400000000202 0.052866761298083 1.548 0.0821153016786317
1.03334166682857 -0.0626292911468825 -0.0206 -0.0059
1.01650254767154 -0.1029498536914 -0.5256 -0.1498
1.02632117039382 -0.115050113849151 -0.0942 -0.0268
1.02669321818577 -0.124266967584635 -0.0516 -0.0147
1.01541328790277 -0.130821569107392 -0.1086 -0.0309
1.04200621283504 -0.140832059717528 -0.0882 -0.0251
1.03400210559256 -0.0416693667504722 -0 -0
1.02156066053281 -0.091582248079811 -0 -0
1.04000000022982 -0.0367146079599674 0.014 0.0124673916642515
1.04000000002601 0.0361881819623515 1.335 0.124048975310161
1.02607386880448 -0.0943957492908379 -0 -0
1.01942728069574 -0.118022834539829 -0.3408 -0.0971
1.02209937754677 -0.118021435557738 -0.0394 -0.0112
1.01630221331662 -0.137717414566525 -0.1755 -0.05
1.02444607547217 -0.161645929875429 -0.018 -0.0051
1.04135230314486 -0.0445188541490256 -0 -0
1.03919394473589 -0.0606874099748176 -0.1544 -0.044
1.03177898524407 -0.083786424001184 -0 -0
1.02420958009341 -0.110176148309414 -0 -0
1.04000000002383 -0.0460570094794779 0.3902 0.0723534065373075
1.0400000000238 -0.0599413971005243 0.3902 0.125333573436542
1.04000000002379 -0.0725041417724856 0.3902 0.259630458659283
1.03374178252716 -0.0461294712698953 -0 -0
1.01998695457667 -0.0921834240707484 -0.7724 -0.2201
1.03089050458691 -0.0735872597015961 -0.044 -0.0125
1.0159649336949 -0.130628093716466 -0.3025 -0.0862
1.01424678923595 -0.124701657283524 -0.2696 -0.0768
1.03343907149555 -0.0763941534452774 -0 -0
1.03157573671142 -0.0913179095656156 -0 -0
1.04000000002376 -0.0347109803485932 1.3392 0.214283828401884
1.04000000002375 -0.0422492931398211 1.3392 0.25016283997009
1.03126129756981 -0.169643193865071 -0.0116 -0.0033
1.0307755392086 -0.0994731302816824 -0.0209 -0.006
1.02141169214025 -0.128485030141814 -0.0684 -0.0195
1.02312062639861 -0.111557422566462 -0.0821 -0.0234
1.01537109785816 -0.131295764805615 -0.0142 -0.0041
1.01408299860435 -0.132969981963083 -0.3726 -0.1062
1.03716377996466 -0.114324081633717 -0.2678 -0.0763
1.02367008843525 -0.103481308559015 -0.0905 -0.0258
1.03200376410914 -0.194859187659501 -0.1754 -0.05
1.03312777938087 -0.0700091536708081 -0 -0
1.04000000002167 0.0174517085749789 0.924 0.0878494433827047
1.01024146198007 -0.142943411586974 -0.3202 -0.0913
1.0395402487147 -0.154982672540117 -0 -0
1.03964989550479 -0.174541341217739 -0 -0
1.04000000001588 -0.145614764329445 0.0162 0.000253109635779442
1.0400000000159 -0.124618935089887 0.2317 0.00281990412008067
1.04000000001591 -0.115410705016024 0.2317 0.000284308544363301
1.04000000001589 -0.132923032334689 0.2317 0.00159558599053842
1.04000000001589 -0.133588389416096 0.2317 0.00148867582643024
1.03211230211949 -0.082477209390283 -0 -0
1.03052752657007 -0.0949499123804015 -0.1476 -0.0421
1.04331107439588 -0.137880991866118 -0.0897 -0.0256
1.02656168981558 -0.18750688674423 -0.0139 -0.004
1.03113283783568 -0.196181939159305 -0 -0
1.03113283783568 -0.196181939159305 0 0
1.02260801862911 -0.108592721209918 -0.0145 -0.0041
1.04285232480384 -0.138333691543776 -0.458 -0.1305
1.04285232480384 -0.138333691543776 0 0
1.04285232480384 -0.138333691543776 0 0
1.04285232480384 -0.138333691543776 0 0
1.04000000002225 -0.133064862542133 0.0282 -0.0165231727815928
1.04285232480384 -0.138333691543776 0 0
1.04285232480384 -0.138333691543776 0 0
1.04000000001675 -0.128449776545455 0.0282 -0.00900240382900416
1.02934234762591 -0.0967713197406126 -0.0794 -0.0226
1.04444614712283 -0.117595098853576 -0.0538 -0.0153
1.04363557903735 -0.136574651391069 -0.0871 -0.0248
1.04837375454443 -0.121753592277708 -0.0277 -0.0079
1.04224471801985 -0.140522368369044 -0.0731 -0.0208
1.03404290654877 -0.1893598494965 -0.1901 -0.0542
1.02792935476855 -0.0950557867179851 -0.1129 -0.0322
1.04139147662438 -0.0853319979115523 -0 -0
1.04601915816545 -0.120567715590675 -0.2361 -0.0673
1.04496973983365 -0.124348336056932 -0.0774 -0.0221
1.0333784161951 -0.195406677515851 -0.4798 -0.1367
1.04000000001764 -0.181081711825367 0.0525 0.0215611238939035
1.04000000001764 -0.187169913272433 0.0798 0.057360520908279
1.04903435155234 -0.144682410539134 -0.1069 -0.0305
1.03411746282688 -0.189746287953852 -0.1079 -0.0307
1.02947537198303 -0.103254147992262 -0.021 -0.006
1.04110026684871 -0.0278150791085281 -0 -0
1.04218177169675 -0.0746076670246098 -0 -0
1.01916363201228 -0.123674165649436 -0 -0
1.02749002994636 -0.0978754716997033 -0.1679 -0.0478
1.04574813226859 -0.135465640038983 -0.0723 -0.0206
1.01670012559136 -0.104605849328981 -0.5274 -0.1503
1.01648675727708 -0.128812376562725 -0.2199 -0.0627
1.04006939710047 -0.186821473032878 -0.3757 -0.1071
1.03324176050163 -0.0894926371512597 -0 -0
1.03324176050163 -0.0894926371512597 0 0
1.03324176050163 -0.0894926371512597 0 0
1.02323692628669 -0.119565137184289 -0.0537 -0.0153
1.0436978829631 -0.0998534638946638 -0.0426 -0.0121
1.02591857811073 -0.16351024951491 -0.0934 -0.0266
