0 1 105353.64730483163 -16771.54475032073 0.0 0 0 96830.0 9.257240075614368e-06 1.473686200378072e-06
1 2 1004937.0579507005 -159978.7693150218 0.0 0 0 96830.0 9.70492627599244e-07 1.5449546313799622e-07
2 3 1072684.576601494 -170763.68820337686 0.0 0 0 96830.0 9.091992438563328e-07 1.4473799621928166e-07
3 4 1230345.3988013866 -195862.15989887543 0.0 0 0 96830.0 7.926912287334593e-07 1.2619075614366728e-07
4 5 780976.9426188574 -124325.92584291226 0.0 0 0 96830.0 1.2488e-06 1.9879999999999998e-07
5 6 11468.854261791255 -1825.7593107335854 0.0 0 0 96830.0 8.503761436672968e-05 1.3537378071833647e-05
6 7 256067.0829899395 -40764.042359384985 0.0 0 0 96830.0 3.808705103969754e-06 6.063185255198487e-07
7 8 307655.0657997477 -48976.47908471319 0.0 0 0 96830.0 3.1700567107750472e-06 5.046502835538751e-07
8 9 350572.18759494845 -55808.57694897161 0.0 0 0 96830.0 2.7819776937618147e-06 4.4287088846880906e-07
9 10 469816.84973074944 -74791.47159390853 0.0 0 0 96830.0 2.0758812854442346e-06 3.304654064272211e-07
10 11 500468.56771093333 -79671.00517371358 0.0 0 0 96830.0 1.9487417769376185e-06 3.1022570888468805e-07
11 12 813890.8375480556 -129565.58176213442 0.0 0 0 96830.0 1.1982982986767486e-06 1.9076049149338375e-07
12 13 326922.63379127614 -52043.73766632421 0.0 0 0 96830.0 2.9832257088846884e-06 4.749081285444234e-07
13 14 40356.65110965153 -6424.4893022091 0.0 0 0 96830.0 2.416662381852552e-05 3.847153119092627e-06
14 15 137939.25827555306 -3439.795105612028 0.0 0 0 96830.0 7.245062381852553e-06 1.806703213610586e-07
14 16 33279.14405658952 -5297.80095968129 0.0 0 0 96830.0 2.930616257088847e-05 4.665330812854442e-06
15 17 302342.0591195798 -7539.512305500855 0.0 0 0 96830.0 3.3054565217391308e-06 8.242826086956522e-08
16 18 483665.61333237926 -76996.0953959617 0.0 0 0 96830.0 2.0164427221172023e-06 3.2100321361058596e-07
17 19 288401.61116476567 -7191.878968592393 0.0 0 0 96830.0 3.465232136105861e-06 8.641258979206051e-08
18 20 430735.42128651 -68569.98859045337 0.0 0 0 96830.0 2.2642298676748586e-06 3.6044914933837427e-07
19 21 317244.5205336833 -7911.1353986989025 0.0 0 0 96830.0 3.150183742911154e-06 7.855621928166353e-08
20 22 264546.62963547726 -42113.92534555804 0.0 0 0 96830.0 3.6866241965973536e-06 5.868841209829868e-07
21 23 259862.5425684826 -6480.199424251833 0.0 0 0 96830.0 3.845796786389415e-06 9.590274102079397e-08
22 24 145415.84505431194 -23149.15919026042 0.0 0 0 96830.0 6.706862003780718e-06 1.0676843100189035e-06
23 25 238214.30349400546 -5940.356686626333 0.0 0 0 96830.0 4.195291871455577e-06 1.0461810964083177e-07
24 26 7744.790180041078 -592.6448137770564 0.0 0 0 96830.0 0.00012836739130434784 9.822896030245747e-06
24 27 11604.267875198639 -1847.3161864105455 0.0 0 0 96830.0 8.404528544423441e-05 1.3379406427221171e-05
25 28 244064.66027495128 -6086.247195773343 0.0 0 0 96830.0 4.094728544423441e-06 1.0211035916824198e-07
26 29 28116.94530225918 -2151.5575535641806 0.0 0 0 96830.0 3.5358695652173916e-05 2.705708884688091e-06
26 30 28858.592499605325 -2208.3096869263204 0.0 0 0 96830.0 3.4450000000000004e-05 2.6361739130434786e-06
27 31 43589.68450550349 -6939.165022176565 0.0 0 0 96830.0 2.237419281663516e-05 3.5618109640831756e-06
28 32 91029.161213493 -2269.996715399448 0.0 0 0 96830.0 1.0978663516068055e-05 2.737752362948961e-07
29 33 12277.762976300624 -939.5157755777868 0.0 0 0 96830.0 8.097391304347827e-05 6.196264650283554e-06
30 34 852163.5958358097 -65209.04037700108 0.0 0 0 96830.0 1.1666521739130435e-06 8.927425330812854e-08
31 35 7986.066800685333 -611.1077204002689 0.0 0 0 96830.0 0.0001244891304347826 9.526124763705104e-06
31 36 14415.819842069832 -2294.895086966273 0.0 0 0 96830.0 6.765373156899811e-05 1.0769988657844988e-05
32 37 97572.21566472665 -2433.1610455435616 0.0 0 0 96830.0 1.0242449905482042e-05 2.554162570888469e-07
34 38 592677.8924097945 -45352.74307135819 0.0 0 0 96830.0 1.6774347826086957e-06 1.283602268431002e-07
35 39 114319.09692561887 -8747.896112569095 0.0 0 0 96830.0 8.696521739130434e-06 6.654729678638941e-07
35 40 25318.17058856478 -1937.3904450380005 0.0 0 0 96830.0 3.9267391304347827e-05 3.0048090737240075e-06
36 41 20774.06521455089 -3307.0821305675177 0.0 0 0 96830.0 4.6947190926275986e-05 7.473655954631378e-06
36 42 1258979.3713705274 -515726.48947708355 0.0 0 0 96830.0 6.801606805293006e-07 2.7862003780718335e-07
37 43 393541.4620817392 -9813.754344103825 0.0 0 0 96830.0 2.5394491493383745e-06 6.332631379962194e-08
38 44 462151.59955661226 -35364.64413998424 0.0 0 0 96830.0 2.151195652173913e-06 1.6461323251417768e-07
39 45 253631.03285521918 -19408.287731529817 0.0 0 0 96830.0 3.919782608695652e-06 2.999485822306238e-07
40 46 10522.101910619276 -805.1695375082576 0.0 0 0 96830.0 9.448478260869566e-05 7.23013988657845e-06
41 47 27491.398056158836 -4376.433322841429 0.0 0 0 96830.0 3.547596975425331e-05 5.647519848771266e-06
42 48 2614831.1493346286 -1071135.651534667 0.0 0 0 96830.0 3.274812854442344e-07 1.3414896030245745e-07
43 49 276830.5337169859 -6903.330689667911 0.0 0 0 96830.0 3.6100733459357285e-06 9.002449905482043e-08
44 50 189760.21383454176 -14520.781580382325 0.0 0 0 96830.0 5.239130434782609e-06 4.009073724007561e-07
45 51 239322.89253296648 -18313.403950348737 0.0 0 0 96830.0 4.154130434782609e-06 3.178812854442344e-07
47 52 190674.33365316998 -30353.985850616744 0.0 0 0 96830.0 5.1149202268430996e-06 8.142586011342154e-07
47 53 180891.49907067374 -28796.628775824745 0.0 0 0 96830.0 5.391541398865784e-06 8.582947069943288e-07
48 54 2347387.344039242 -961580.3577992074 0.0 0 0 96830.0 3.647920604914934e-07 1.494328922495274e-07
49 55 151905.63964594237 -3788.0751448232477 0.0 0 0 96830.0 6.57894291115312e-06 1.6405928166351607e-07
50 56 221635.22115985543 -16959.912575710674 0.0 0 0 96830.0 4.485652173913043e-06 3.4324990548204156e-07
51 57 251275.887550135 -19228.067916879892 0.0 0 0 96830.0 3.956521739130435e-06 3.027599243856333e-07
52 58 42093.92116033083 -6701.050229559391 0.0 0 0 96830.0 2.3169236294896032e-05 3.6883761814744795e-06
53 59 1769647.3005248003 -281715.15322255786 0.0 0 0 96830.0 5.511177315689981e-07 8.773398865784498e-08
54 60 2721218.3759928388 -1114715.9612500786 0.0 0 0 96830.0 3.146782608695652e-07 1.2890434782608695e-07
55 61 170726.3588964345 -4257.407942253655 0.0 0 0 96830.0 5.853686200378073e-06 1.459735349716446e-07
56 62 46235.25106571959 -3538.0018206811505 0.0 0 0 96830.0 2.1502608695652176e-05 1.645417013232514e-06
57 63 419561.57370756485 -32105.58129240496 0.0 0 0 96830.0 2.3695652173913043e-06 1.8132325141776935e-07
58 64 207056.4629854392 -32961.90330037261 0.0 0 0 96830.0 4.7102321361058596e-06 7.498351606805291e-07
58 65 5537.727078711667 -423.75650689271885 0.0 0 0 96830.0 0.00017952826086956524 1.3737814744801513e-05
59 66 1563220.3343338533 -248853.46129529946 0.0 0 0 96830.0 6.238941398865785e-07 9.931947069943288e-08
60 67 2841296.294793547 -1163904.5063009711 0.0 0 0 96830.0 3.0137943289224954e-07 1.2345663516068053e-07
61 68 159977.126583317 -3989.3540382237743 0.0 0 0 96830.0 6.2470088846880916e-06 1.557818336483932e-07
62 69 13080.547890316506 -1000.9462733459586 0.0 0 0 96830.0 7.600434782608696e-05 5.815984877126653e-06
63 70 213851.8191916042 -16364.313120748844 0.0 0 0 96830.0 4.6489130434782615e-06 3.557429111531191e-07
64 71 17525.42264956294 -2789.921542867643 0.0 0 0 96830.0 5.5649671077504725e-05 8.859028355387523e-06
65 72 11329.388974415242 -866.9445476074274 0.0 0 0 96830.0 8.775217391304348e-05 6.714948960302458e-06
65 73 11329.388974415242 -866.9445476074274 0.0 0 0 96830.0 8.775217391304348e-05 6.714948960302458e-06
66 74 644411.4798100671 -102585.68400563847 0.0 0 0 96830.0 1.5134491493383743e-06 2.4093024574669185e-07
67 75 1158692.9588746203 -474645.30845466367 0.0 0 0 96830.0 7.390294896030246e-07 3.027349716446125e-07
68 76 34226.889747145484 -853.5168979766759 0.0 0 0 96830.0 2.91986370510397e-05 7.281272211720229e-07
70 77 42196.17229574143 -3228.924488717605 0.0 0 0 96830.0 2.3560869565217393e-05 1.8029187145557657e-06
71 78 50277.42730385307 -8003.805691868985 0.0 0 0 96830.0 1.9398049149338377e-05 3.088030245746692e-06
74 79 1116370.4375671213 -177718.16382794981 0.0 0 0 96830.0 8.736204158790172e-07 1.390741020793951e-07
75 80 365355.1730413199 -149663.56486029972 0.0 0 0 96830.0 2.3437693761814745e-06 9.600982986767485e-07
76 81 26066.11336110611 -650.0113911207819 0.0 0 0 96830.0 3.83401436672968e-05 9.56089224952741e-07
77 82 11197.897045574087 -856.8825565308866 0.0 0 0 96830.0 8.878260869565217e-05 6.7937996219281654e-06
78 83 230384.38736672277 -36675.54148663076 0.0 0 0 96830.0 4.233290359168241e-06 6.739094517958411e-07
79 84 1040085.4589166081 -165574.1425629578 0.0 0 0 96830.0 9.376960302457466e-07 1.4927448015122872e-07
80 85 189660.67469040994 -77692.32457197514 0.0 0 0 96830.0 4.514948960302458e-06 1.849497164461248e-06
81 86 42894.688336034436 -1069.6660315535034 0.0 0 0 96830.0 2.3298421550094524e-05 5.809933837429113e-07
83 87 113610.59196690742 -18085.991097870912 0.0 0 0 96830.0 8.584446124763706e-06 1.3665822306238185e-06
84 88 1103800.61775482 -175717.13870087932 0.0 0 0 96830.0 8.83568998109641e-07 1.4065784499054818e-07
85 89 796717.698007538 -326366.28593079874 0.0 0 0 96830.0 1.0747950850661625e-06 4.4027750472589794e-07
86 90 118835.0525961261 -2963.392999248485 0.0 0 0 96830.0 8.409795841209831e-06 2.097153119092628e-07
87 91 120471.88088095847 -19178.259064009082 0.0 0 0 96830.0 8.095532325141777e-06 1.2887506616257089e-06
89 92 4178476.7137452615 -1711665.1598474567 0.0 0 0 96830.0 2.049331190926276e-07 8.39485066162571e-08
90 93 382827.54043184966 -9546.580983061238 0.0 0 0 96830.0 2.610518903591683e-06 6.509858223062383e-08
91 94 207267.93058842368 -32995.56742551139 0.0 0 0 96830.0 4.705426465028356e-06 7.490701323251418e-07
92 95 3171149.7553172717 -1299025.2009733403 0.0 0 0 96830.0 2.700308506616257e-07 1.1061504725897921e-07
93 96 362160.89186624676 -9031.216195153256 0.0 0 0 96830.0 2.7594877126654065e-06 6.881342155009452e-08
94 97 313840.0519295292 -49961.084499992314 0.0 0 0 96830.0 3.1075829867674856e-06 4.947049149338373e-07
95 98 7332431.716051211 -3003646.7270571226 0.0 0 0 96830.0 1.1678366729678639e-07 4.783909262759924e-08
96 99 148643.3003741784 -3706.722100010997 0.0 0 0 96830.0 6.723333837429112e-06 1.6765996219281665e-07
97 100 227301.54983240025 -36184.77587018031 0.0 0 0 96830.0 4.290705482041588e-06 6.830495274102079e-07
98 101 53697.19568361475 -21996.441605336164 0.0 0 0 96830.0 1.5946982986767487e-05 6.5324990548204165e-06
99 102 46589.42726068605 -1161.8018384906597 0.0 0 0 96830.0 2.1450758034026465e-05 5.349181474480151e-07
100 103 1308463.6564381141 -992374.121455873 0.0 0 0 96830.0 4.851761814744802e-07 3.679706994328923e-07
100 104 344260.17719393235 -54803.75018109685 0.0 0 0 96830.0 2.8329852551984876e-06 4.509909262759924e-07
101 105 1234321.4164309835 -505625.64046570414 0.0 0 0 96830.0 6.937482041587902e-07 2.8418601134215503e-07
103 106 1081498.278141655 -820237.4581411427 0.0 0 0 96830.0 5.869962192816635e-07 4.4519376181474476e-07
104 107 607107.7188029032 -96647.19290360116 0.0 0 0 96830.0 1.6064431001890358e-06 2.557342155009451e-07
105 108 605265.1186526824 -247939.92812278552 0.0 0 0 96830.0 1.414765595463138e-06 5.795425330812853e-07
106 109 933073.0693462497 -707667.777313167 0.0 0 0 96830.0 6.803705103969754e-07 5.160113421550094e-07
107 110 15386.43621354914 -2449.410249242127 0.0 0 0 96830.0 6.33859584120983e-05 1.009058979206049e-05
108 111 22784.745148419574 -9333.51006079838 0.0 0 0 96830.0 3.758252551984877e-05 1.5395251417769376e-05
109 112 611970.2707530506 -464134.7559082125 0.0 0 0 96830.0 1.0373631379962192e-06 7.867641776937618e-07
110 113 153590.61121236542 -24450.5233095918 0.0 0 0 96830.0 6.349893383742912e-06 1.0108574669187144e-06
111 114 25595.732110020526 -10484.998695671058 0.0 0 0 96830.0 3.34551190926276e-05 1.370450661625709e-05
112 115 476006.04160868836 -361015.81807400525 0.0 0 0 96830.0 1.3336708884688091e-06 1.0114919659735351e-06
113 116 341294.0930206435 -258846.6435830723 0.0 0 0 96830.0 1.8600831758034025e-06 1.4107372400756143e-06
113 117 49313.350397663686 -13138.228390618424 0.0 0 0 96830.0 1.893448771266541e-05 5.044589792060492e-06
114 118 274354.31788844394 -112386.10612297704 0.0 0 0 96830.0 3.1211765595463134e-06 1.2785542533081285e-06
115 119 663049.3406027576 -502874.4998953499 0.0 0 0 96830.0 9.574482041587902e-07 7.261545368620038e-07
116 120 68357.14795914938 -1704.6240926840778 0.0 0 0 96830.0 1.4619956521739133e-05 3.6457826086956523e-07
116 121 700961.8049889903 -531628.3352444591 0.0 0 0 96830.0 9.05663327032136e-07 6.868794896030246e-07
117 122 27345.10704958731 -7285.375235838954 0.0 0 0 96830.0 3.414589035916825e-05 9.097262759924385e-06
118 123 376495.279724837 -154226.98205595734 0.0 0 0 96830.0 2.2744196597353496e-06 9.316899810964083e-07
119 124 469251.7898368694 -355893.21139313135 0.0 0 0 96830.0 1.3528672967863894e-06 1.0260510396975426e-06
120 125 78941.58512017246 -1968.5684954400688 0.0 0 0 96830.0 1.265972211720227e-05 3.156958412098299e-07
121 126 149214.94354777897 -113168.63696039416 0.0 0 0 96830.0 4.254502835538752e-06 3.2267296786389413e-06
122 127 60807.489615361046 -16200.535554457501 0.0 0 0 96830.0 1.5355395085066165e-05 4.091035916824197e-06
123 128 436530.2321867191 -178819.61318492104 0.0 0 0 96830.0 1.9616241965973536e-06 8.03556899810964e-07
124 129 433718.1025788774 -328943.504764879 0.0 0 0 96830.0 1.4637051039697543e-06 1.1101134215500946e-06
125 130 111763.79348654544 -2787.0568149037776 0.0 0 0 96830.0 8.941880907372403e-06 2.2298393194706997e-07
126 131 11968.023535571174 -915.8139748958813 0.0 0 0 96830.0 8.30695652173913e-05 6.356627599243857e-06
126 132 52566.76454314777 -39868.05176025253 0.0 0 0 96830.0 1.2076744801512288e-05 9.159328922495276e-06
127 133 204376.03731500407 -54450.55008757407 0.0 0 0 96830.0 4.568652173913045e-06 1.217195652173913e-06
128 134 142104.76422671555 -58211.59016516058 0.0 0 0 96830.0 6.025894139886579e-06 2.468438563327032e-06
129 135 459895.1214455238 -348796.8617704816 0.0 0 0 96830.0 1.3803916824196596e-06 1.0469262759924387e-06
130 136 72231.80730050929 -1801.2465800378895 0.0 0 0 96830.0 1.3835712665406428e-05 3.4502155009451804e-07
131 137 138969.8904039278 -10634.217700474475 0.0 0 0 96830.0 7.153913043478261e-06 5.474298676748582e-07
132 138 70659.29164518621 -53589.91220280977 0.0 0 0 96830.0 8.984457466918714e-06 6.814054820415879e-06
133 139 181055.66530110617 -48237.458273652366 0.0 0 0 96830.0 5.157104725897921e-06 1.3739731568998109e-06
134 140 193164.704993673 -79127.71047933592 0.0 0 0 96830.0 4.433047258979206e-06 1.8159470699432894e-06
135 141 279714.4175267779 -212142.95711300574 0.0 0 0 96830.0 2.2695841209829866e-06 1.7213137996219281e-06
136 142 61138.86411974607 -1524.6215485780506 0.0 0 0 96830.0 1.6346043478260874e-05 4.0762173913043487e-07
137 143 141634.02872224152 -10838.082197875874 0.0 0 0 96830.0 7.019347826086957e-06 5.371327032136106e-07
138 144 105512.7647345292 -80023.72606270475 0.0 0 0 96830.0 6.016669187145558e-06 4.563204158790171e-06
139 145 192513.7587715713 -51290.1620084843 0.0 0 0 96830.0 4.85016257088847e-06 1.292196597353497e-06
140 146 1134510.367706988 -464739.18677153724 0.0 0 0 96830.0 7.547822306238186e-07 3.0918790170132326e-07
141 147 58828.02987802428 -44616.76423333303 0.0 0 0 96830.0 1.079137618147448e-05 8.184470699432893e-06
142 148 68639.01857595945 -1711.653108065487 0.0 0 0 96830.0 1.4559918714555768e-05 3.630810964083176e-07
143 149 175407.3777774032 -13422.47760383607 0.0 0 0 96830.0 5.667826086956522e-06 4.337119092627599e-07
144 150 105657.5334594191 -80133.52256753694 0.0 0 0 96830.0 6.0084253308128544e-06 4.55695179584121e-06
144 151 8912.22893053057 -681.9792572927739 0.0 0 0 96830.0 0.00011155217391304349 8.536166351606805e-06
145 152 164991.65633690223 -43957.631067860806 0.0 0 0 96830.0 5.659213610586012e-06 1.5077466918714555e-06
146 153 3283958.057482452 -1345235.8307759443 0.0 0 0 96830.0 2.6075493383742913e-07 1.068152741020794e-07
147 154 270045.6231615426 -204809.8827348778 0.0 0 0 96830.0 2.350844990548204e-06 1.7829442344045369e-06
148 155 60778.895453774036 -1515.644999980763 0.0 0 0 96830.0 1.6442854442344046e-05 4.100359168241966e-07
149 156 116866.53259257018 -8942.83032012711 0.0 0 0 96830.0 8.50695652173913e-06 6.509671077504726e-07
150 157 39839.80543786211 -30215.58277590666 0.0 0 0 96830.0 1.5934701323251416e-05 1.2085307183364839e-05
151 158 146422.7308747945 -11204.522014766882 0.0 0 0 96830.0 6.789782608695652e-06 5.195659735349716e-07
152 159 573395.7305057393 -152766.01579167508 0.0 0 0 96830.0 1.6284094517958415e-06 4.33846313799622e-07
153 160 2226532.1372761247 -912073.4056311836 0.0 0 0 96830.0 3.845928166351607e-07 1.5754404536862006e-07
154 161 3894.6885195384652 -298.02833888642175 0.0 0 0 96830.0 0.00025526521739130436 1.953333837429112e-05
154 162 71405.41012103992 -54155.78857494602 0.0 0 0 96830.0 8.890578449905481e-06 6.742854442344045e-06
155 163 65463.84816597136 -1632.4737955746004 0.0 0 0 96830.0 1.5266113421550095e-05 3.806914933837429e-07
156 164 96935.46045640885 -7417.670017533895 0.0 0 0 96830.0 1.0256086956521739e-05 7.848136105860113e-07
157 165 114694.8993111108 -86987.70453370763 0.0 0 0 96830.0 5.534992438563326e-06 4.197887523629489e-06
158 166 160278.31470271116 -12264.775385946592 0.0 0 0 96830.0 6.202826086956521e-06 4.746510396975425e-07
159 167 100929.33414349664 -26889.932089325743 0.0 0 0 96830.0 9.251255198487715e-06 2.464750472589792e-06
160 168 1093371.9799044868 -447887.31706930784 0.0 0 0 96830.0 7.831810964083176e-07 3.2082117202268434e-07
161 169 20615.88222247873 -1577.5631613722853 0.0 0 0 96830.0 4.822391304347826e-05 3.6901776937618148e-06
162 170 53785.100239982814 -40792.07040672853 0.0 0 0 96830.0 1.1803183364839319e-05 8.951852551984877e-06
163 171 77108.60448130801 -1922.8594064608294 0.0 0 0 96830.0 1.2960661625708886e-05 3.2320037807183367e-07
164 172 128309.89151597711 -9818.49604643999 0.0 0 0 96830.0 7.748260869565217e-06 5.929103969754253e-07
165 173 96300.62763025379 -73036.9928656419 0.0 0 0 96830.0 6.592224952741021e-06 4.999721172022684e-06
165 174 10876.967899660975 -832.3245001479702 0.0 0 0 96830.0 9.140217391304349e-05 6.9942533081285454e-06
166 175 385828.1577163973 -29524.2416339504 0.0 0 0 96830.0 2.5767391304347825e-06 1.9717655954631379e-07
167 176 178697.3470595751 -47609.14720930285 0.0 0 0 96830.0 5.225164461247638e-06 1.3921058601134216e-06
169 177 9992.180461048016 -764.6190265845439 0.0 0 0 96830.0 9.949565217391305e-05 7.613580340264652e-06
170 178 319288.16148555034 -242156.75168847918 0.0 0 0 96830.0 1.9882835538752362e-06 1.5079678638941398e-06
170 179 18878.885210586428 -1444.6451291579178 0.0 0 0 96830.0 5.266086956521739e-05 4.0297013232514176e-06
171 180 74142.06332566055 -1848.8826874660947 0.0 0 0 96830.0 1.34792381852552e-05 3.3613213610586016e-07
172 181 110882.0956602768 -8484.890798351615 0.0 0 0 96830.0 8.96608695652174e-06 6.861005671077505e-07
173 182 642129.8253043981 -487008.57537131326 0.0 0 0 96830.0 9.886402646502834e-07 7.49811436672968e-07
174 183 100711.77857720839 -7706.640447647251 0.0 0 0 96830.0 9.871521739130436e-06 7.55386011342155e-07
175 184 178998.04898087817 -13697.242008971549 0.0 0 0 96830.0 5.5541304347826084e-06 4.250117202268431e-07
176 185 240725.74808869397 -64134.96208202429 0.0 0 0 96830.0 3.87878336483932e-06 1.0333984877126654e-06
178 186 81135.04402425945 -61535.0052992979 0.0 0 0 96830.0 7.82442911153119e-06 5.934258034026465e-06
179 187 4561.452605689777 -349.0502863484351 0.0 0 0 96830.0 0.0002179521739130435 1.667807939508507e-05
180 188 86404.4640145464 -2154.670513209092 0.0 0 0 96830.0 1.1566283553875237e-05 2.884287334593573e-07
181 189 117927.31184663375 -9024.002993481541 0.0 0 0 96830.0 8.430434782608695e-06 6.451115311909263e-07
182 190 162988.5314861662 -123614.89747546315 0.0 0 0 96830.0 3.894969754253308e-06 2.9540500945179588e-06
182 191 1357758.8040862994 -1029760.8907396091 0.0 0 0 96830.0 4.67561247637051e-07 3.546110586011342e-07
183 192 104119.05273802919 -7967.37099212745 0.0 0 0 96830.0 9.548478260869566e-06 7.306661625708885e-07
184 193 70278.32055403094 -5377.8193119606285 0.0 0 0 96830.0 1.4146304347826089e-05 1.0824998109640833e-06
185 194 267756.711691916 -71336.64216609442 0.0 0 0 96830.0 3.487206805293006e-06 9.290733459357278e-07
186 195 45442.30806440862 -34464.671846602054 0.0 0 0 96830.0 1.3970139886578448e-05 1.0595330812854443e-05
187 196 23338.714740558593 -1785.9190410166575 0.0 0 0 96830.0 4.259782608695652e-05 3.2596597353497162e-06
187 197 40381.64373874133 -3090.073607834119 0.0 0 0 96830.0 2.461956521739131e-05 1.8839319470699434e-06
188 198 69545.93688072848 -1734.2689549602312 0.0 0 0 96830.0 1.4370049149338379e-05 3.5834631379962197e-07
189 199 109603.86227471435 -8387.078156673795 0.0 0 0 96830.0 9.070652173913043e-06 6.941020793950852e-07
190 200 405126.4217775643 -307258.80303354596 0.0 0 0 96830.0 1.5670056710775047e-06 1.188459357277883e-06
191 201 2294246.66652656 -1740018.5392195825 0.0 0 0 96830.0 2.7670756143667295e-07 2.098624763705104e-07
192 202 130165.11508545728 -9960.460980452383 0.0 0 0 96830.0 7.637826086956522e-06 5.844597353497164e-07
193 203 119786.81841407242 -9166.29566994641 0.0 0 0 96830.0 8.299565217391304e-06 6.350971644612476e-07
194 204 215535.86134735332 -57423.78787721456 0.0 0 0 96830.0 4.3321005671077515e-06 1.1541727788279773e-06
195 205 14082.28222759802 -1077.6007269814138 0.0 0 0 96830.0 7.059782608695652e-05 5.402268431001891e-06
195 206 176563.91804015878 -133910.83671585078 0.0 0 0 96830.0 3.595499054820416e-06 2.7269234404536865e-06
196 207 9231.184581281073 -706.3862983936822 0.0 0 0 96830.0 0.00010769782608695653 8.241224952741022e-06
197 208 285683.4803481045 -21860.99675707235 0.0 0 0 96830.0 3.4799999999999997e-06 2.6629565217391307e-07
198 209 29699.487028685246 -740.6169309420249 0.0 0 0 96830.0 3.364968998109642e-05 8.391232514177695e-07
199 210 71697.43910656826 -5486.412731633049 0.0 0 0 96830.0 1.3866304347826088e-05 1.0610737240075615e-06
201 211 2430341.0359630515 -1843236.1789607415 0.0 0 0 96830.0 2.612124763705104e-07 1.981105860113422e-07
202 212 163405.19360461846 -12504.049597570805 0.0 0 0 96830.0 6.0841304347826084e-06 4.6556824196597356e-07
203 213 171025.47320166253 -13087.166644996785 0.0 0 0 96830.0 5.8130434782608705e-06 4.448241965973536e-07
204 214 116800.49482551467 -31118.380008257554 0.0 0 0 96830.0 7.994170132325144e-06 2.129833648393195e-06
205 215 4302.385957394475 -329.2260558701859 0.0 0 0 96830.0 0.00023107608695652174 1.768234404536862e-05
206 216 97828.61456628641 -74195.85936207116 0.0 0 0 96830.0 6.4892608695652176e-06 4.921630434782609e-06
208 217 354238.6640908177 -27106.958643471266 0.0 0 0 96830.0 2.806521739130435e-06 2.1475992438563328e-07
209 218 19812.030043772804 -494.05314214949806 0.0 0 0 96830.0 5.0443015122873356e-05 1.2578988657844991e-06
210 219 26254.211799830402 -2009.017946421805 0.0 0 0 96830.0 3.786739130434782e-05 2.897678638941399e-06
211 220 2218833.054472677 -1682822.8222124237 0.0 0 0 96830.0 2.861122873345935e-07 2.169952741020794e-07
212 221 77290.8305601321 -5914.428773297066 0.0 0 0 96830.0 1.2862826086956522e-05 9.842858223062383e-07
213 222 88909.17342404216 -6803.484575057139 0.0 0 0 96830.0 1.1181956521739131e-05 8.556627599243856e-07
214 223 133969.8897991226 -35692.707866189594 0.0 0 0 96830.0 6.969648393194708e-06 1.8568771266540642e-06
215 224 9980.404943940588 -763.7179435363232 0.0 0 0 96830.0 9.961304347826088e-05 7.6225633270321366e-06
216 225 273986.8931481436 -207799.04817415387 0.0 0 0 96830.0 2.3170283553875236e-06 1.757296786389414e-06
217 226 443270.44231971086 -33919.82515142135 0.0 0 0 96830.0 2.2428260869565216e-06 1.7162495274102078e-07
219 227 307919.5497853795 -23562.539461837736 0.0 0 0 96830.0 3.2286956521739132e-06 2.470654064272212e-07
220 228 1621341.250563414 -1229668.9259891063 0.0 0 0 96830.0 3.915495274102079e-07 2.969617202268431e-07
221 229 98144.1112821095 -7510.1580807179425 0.0 0 0 96830.0 1.0129782608695653e-05 7.751485822306237e-07
222 230 178627.49603204653 -13668.886652887039 0.0 0 0 96830.0 5.565652173913045e-06 4.258933837429112e-07
223 231 196943.08531660296 -52470.23805880297 0.0 0 0 96830.0 4.741080529300568e-06 1.263134593572779e-06
225 232 3844.6907106511676 -294.2024195976545 0.0 0 0 96830.0 0.00025858478260869564 1.9787357277882798e-05
225 233 334724.34067561734 -253863.9662427435 0.0 0 0 96830.0 1.8965916824196596e-06 1.4384262759924386e-06
226 234 290381.6847680778 -22220.511530079 0.0 0 0 96830.0 3.4236956521739126e-06 2.6198714555765594e-07
227 235 666650.3139085213 -51013.24141213033 0.0 0 0 96830.0 1.4913043478260869e-06 1.14117202268431e-07
228 236 1819182.0906548232 -1379716.754148321 0.0 0 0 96830.0 3.489674858223062e-07 2.646663516068053e-07
229 237 141489.42371797713 -10827.016771462597 0.0 0 0 96830.0 7.026521739130435e-06 5.376816635160681e-07
230 238 251566.15619189484 -19250.279778162385 0.0 0 0 96830.0 3.951956521739131e-06 3.024105860113421e-07
231 239 299800.23900498817 -79873.78630424866 0.0 0 0 96830.0 3.1144839319470703e-06 8.297712665406427e-07
232 240 26474.59276028978 -2025.8818807873918 0.0 0 0 96830.0 3.755217391304348e-05 2.8735576559546317e-06
234 241 247723.3710748311 -18956.22317790012 0.0 0 0 96830.0 4.013260869565217e-06 3.071017013232514e-07
235 242 623258.4432801538 -47692.82000752482 0.0 0 0 96830.0 1.5951304347826085e-06 1.2206215500945178e-07
236 243 2235263.013113106 -1695283.7459003893 0.0 0 0 96830.0 2.840092627599244e-07 2.1540028355387522e-07
237 244 141827.29581058945 -10852.87133159293 0.0 0 0 96830.0 7.009782608695653e-06 5.364007561436673e-07
238 245 21990.86917393949 -1682.7795541797175 0.0 0 0 96830.0 4.520869565217392e-05 3.4594480151228736e-06
239 246 139301.3551608835 -37113.13476914049 0.0 0 0 96830.0 6.702899810964085e-06 1.7858090737240077e-06
240 247 8625.13891104156 -660.0106297144846 0.0 0 0 96830.0 0.00011526521739130435 8.820294896030245e-06
240 248 8625.13891104156 -660.0106297144846 0.0 0 0 96830.0 0.00011526521739130435 8.820294896030245e-06
241 249 161284.47023143913 -12341.768156840559 0.0 0 0 96830.0 6.164130434782609e-06 4.716899810964084e-07
242 250 652255.0636695178 -49911.69182862397 0.0 0 0 96830.0 1.5242173913043477e-06 1.1663576559546312e-07
243 251 2837743.4702836983 -2152221.17128258 0.0 0 0 96830.0 2.2371134215500945e-07 1.696687145557656e-07
244 252 96945.73492066342 -7418.456237407287 0.0 0 0 96830.0 1.0255000000000001e-05 7.847304347826086e-07
245 253 74574.73670035315 -5706.588547505284 0.0 0 0 96830.0 1.3331304347826087e-05 1.0201345935727787e-06
246 254 10025.036506231 -767.1332283028939 0.0 0 0 96830.0 9.91695652173913e-05 7.588627599243856e-06
246 255 210403.93533193975 -56056.52291690365 0.0 0 0 96830.0 4.437764083175805e-06 1.1823240075614368e-06
249 256 44074.99184090648 -3372.6950278258864 0.0 0 0 96830.0 2.2556521739130437e-05 1.7260642722117204e-06
250 257 585484.7207031695 -44802.309062503395 0.0 0 0 96830.0 1.6980434782608697e-06 1.2993724007561437e-07
251 258 2178229.8057127716 -1652028.2234338436 0.0 0 0 96830.0 2.914455576559546e-07 2.2104017013232514e-07
252 259 25776.243678347742 -1972.4429945170446 0.0 0 0 96830.0 3.8569565217391306e-05 2.9514102079395083e-06
253 260 333325.15695426066 -25506.620706065165 0.0 0 0 96830.0 2.9826086956521738e-06 2.28234404536862e-07
254 261 72521.74363165964 -5549.48994746613 0.0 0 0 96830.0 1.3708695652173913e-05 1.0490132325141778e-06
255 262 56109.89906427396 -14948.987706905104 0.0 0 0 96830.0 1.6640967863894143e-05 4.4335425330812855e-06
256 263 9055.883472103875 -692.9719526479488 0.0 0 0 96830.0 0.00010978260869565216 8.400756143667297e-06
257 264 283645.79503891687 -21705.069533412767 0.0 0 0 96830.0 3.5050000000000003e-06 2.6820869565217394e-07
258 265 1941421.842167233 -1472426.6780481825 0.0 0 0 96830.0 3.2699508506616255e-07 2.4800189035916825e-07
259 266 110437.60331833994 -8450.877471316448 0.0 0 0 96830.0 9.002173913043478e-06 6.888620037807183e-07
260 267 13225.811653110233 -1012.0621091075657 0.0 0 0 96830.0 7.516956521739131e-05 5.752105860113422e-06
260 268 385243.12639309716 -29479.474019645688 0.0 0 0 96830.0 2.5806521739130437e-06 1.974759924385633e-07
261 269 157746.23688084085 -12071.016387403475 0.0 0 0 96830.0 6.302391304347825e-06 4.82269943289225e-07
262 270 10748.633636713415 -822.5041391572005 0.0 0 0 96830.0 9.249347826086956e-05 7.077761814744801e-06
262 271 167040.29254419883 -44503.43560484129 0.0 0 0 96830.0 5.58980718336484e-06 1.4892551984877124e-06
264 272 272345.2330521949 -20840.33087703752 0.0 0 0 96830.0 3.650434782608696e-06 2.7933761814744805e-07
265 273 2109429.5015855506 -1599848.2174946598 0.0 0 0 96830.0 3.0095122873345934e-07 2.2824952741020797e-07
266 274 241063.7896480131 -18446.620425239267 0.0 0 0 96830.0 4.124130434782609e-06 3.155856332703214e-07
267 275 13345.456850158913 -1021.217567664334 0.0 0 0 96830.0 7.449565217391306e-05 5.70053686200378e-06
268 276 328583.2126320202 -25143.758879667632 0.0 0 0 96830.0 3.0256521739130432e-06 2.315281663516068e-07
269 277 132815.0655886056 -10163.239801562864 0.0 0 0 96830.0 7.485434782608696e-06 5.727984877126655e-07
270 278 147871.47649020134 -11315.382548815405 0.0 0 0 96830.0 6.723260869565217e-06 5.144756143667296e-07
271 279 46080.08070184795 -12276.809822025183 0.0 0 0 96830.0 2.0263051039697546e-05 5.398550094517959e-06
272 280 71619.96356394989 -5480.484168371819 0.0 0 0 96830.0 1.3881304347826087e-05 1.062221550094518e-06
273 281 623261.1232592637 -472698.0429213517 0.0 0 0 96830.0 1.0185705103969754e-06 7.725113421550093e-07
274 282 366679.05335250613 -28058.918865235246 0.0 0 0 96830.0 2.711304347826087e-06 2.074737240075614e-07
276 283 363588.8975522704 -27822.45476921721 0.0 0 0 96830.0 2.7343478260869567e-06 2.0923705103969756e-07
277 284 86082.5425104931 -6587.185861672516 0.0 0 0 96830.0 1.1549130434782608e-05 8.837595463137995e-07
278 285 179405.32554283692 -13728.40751979969 0.0 0 0 96830.0 5.541521739130436e-06 4.240468809073724e-07
279 286 62695.62909558053 -10025.953480103497 0.0 0 0 96830.0 1.5552359168241965e-05 2.4870510396975425e-06
279 287 197434.8714363781 -52601.26136808614 0.0 0 0 96830.0 4.729271077504726e-06 1.259988279773157e-06
280 288 13489.929953135472 -1032.2729007616708 0.0 0 0 96830.0 7.369782608695653e-05 5.639485822306238e-06
281 289 465592.4550165631 -353117.87318671925 0.0 0 0 96830.0 1.3635001890359168e-06 1.034115311909263e-06
282 290 52194.9959302022 -3994.051862485037 0.0 0 0 96830.0 1.9047391304347827e-05 1.457539508506616e-06
282 291 423172.124864667 -32381.86694616582 0.0 0 0 96830.0 2.3493478260869566e-06 1.7977618147448015e-07
283 292 358993.7321149585 -27470.82471836204 0.0 0 0 96830.0 2.7693478260869568e-06 2.1191531190926276e-07
284 293 96605.7828304877 -7392.442512246015 0.0 0 0 96830.0 1.0291086956521738e-05 7.874918714555765e-07
285 294 126304.16353878859 -9665.014253402953 0.0 0 0 96830.0 7.871304347826087e-06 6.023258979206049e-07
286 295 136212.47003971582 -21782.377938120866 0.0 0 0 96830.0 7.158411720226843e-06 1.1447353497164461e-06
287 296 47109.675355067004 -12551.117886568945 0.0 0 0 96830.0 1.98201965973535e-05 5.280563327032137e-06
290 297 113626.0473417923 -8694.862753111067 0.0 0 0 96830.0 8.749565217391303e-06 6.695319470699434e-07
291 298 597923.9267062112 -45754.17873925789 0.0 0 0 96830.0 1.662717391304348e-06 1.2723402646502834e-07
292 299 333884.8764994127 -25549.451419085493 0.0 0 0 96830.0 2.9776086956521743e-06 2.2785179584120985e-07
293 300 124255.43141998253 -9508.24170865953 0.0 0 0 96830.0 8.00108695652174e-06 6.122570888468808e-07
294 301 28120.403083148598 -2151.8221489713715 0.0 0 0 96830.0 3.535434782608696e-05 2.7053761814744806e-06
295 302 20850.99771726147 -3334.3812980695316 0.0 0 0 96830.0 4.6763466918714555e-05 7.478166351606805e-06
296 303 213417.96149275388 -56859.529886755576 0.0 0 0 96830.0 4.3750911153119105e-06 1.1656264650283554e-06
297 304 67135.76466789671 -5137.345470239054 0.0 0 0 96830.0 1.4808478260869565e-05 1.1331705103969753e-06
298 305 513810.43451143254 -39317.66803217919 0.0 0 0 96830.0 1.934913043478261e-06 1.480629111531191e-07
299 306 57571.86571929825 -4405.499289824563 0.0 0 0 96830.0 1.7268478260869565e-05 1.321413988657845e-06
300 307 99823.65602367138 -7638.6797652896375 0.0 0 0 96830.0 9.959347826086956e-06 7.621066162570888e-07
301 308 146071.9673378196 -11177.68097889402 0.0 0 0 96830.0 6.80608695652174e-06 5.208136105860114e-07
302 309 279160.0186802735 -44641.794032026686 0.0 0 0 96830.0 3.4928531190926272e-06 5.585586011342154e-07
303 310 642284.1191210296 -171119.49159063923 0.0 0 0 96830.0 1.4537538752362951e-06 3.8731398865784497e-07
304 311 34976.83482533427 -2676.488230112536 0.0 0 0 96830.0 2.8423913043478265e-05 2.1750472589792066e-06
305 312 268633.7613611641 -20556.322608506467 0.0 0 0 96830.0 3.700869565217391e-06 2.831969754253308e-07
306 313 13611.587455838016 -1041.582344446735 0.0 0 0 96830.0 7.303913043478261e-05 5.589081285444234e-06
307 314 96514.03751081497 -7385.42200082758 0.0 0 0 96830.0 1.0300869565217391e-05 7.882404536862004e-07
308 315 197283.16955318823 -15096.451235374401 0.0 0 0 96830.0 5.039347826086957e-06 3.856196597353497e-07
309 316 70462.4000957191 -5391.905398628939 0.0 0 0 96830.0 1.4109347826086957e-05 1.0796718336483931e-06
309 317 15240.590407752912 -2437.1946281054766 0.0 0 0 96830.0 6.39781606805293e-05 1.0231049149338375e-05
310 318 1230595.1512983774 -327859.29213423916 0.0 0 0 96830.0 7.58757277882798e-07 2.0215066162570889e-07
311 319 11880.039364625161 -909.0812731191428 0.0 0 0 96830.0 8.368478260869566e-05 6.403705103969754e-06
312 320 70044.74120711374 -5359.945414109573 0.0 0 0 96830.0 1.4193478260869567e-05 1.086109640831758e-06
314 321 81822.46391992515 -6261.197239089924 0.0 0 0 96830.0 1.2150434782608696e-05 9.297724007561436e-07
315 322 171268.8620108028 -13105.791179957085 0.0 0 0 96830.0 5.804782608695652e-06 4.4419206049149337e-07
316 323 13681.219234189297 -1046.9106892249201 0.0 0 0 96830.0 7.266739130434783e-05 5.5606351606805285e-06
317 324 31757.867967851736 -5078.550314688443 0.0 0 0 96830.0 3.070309829867675e-05 4.909877126654063e-06
318 325 1437558.8812894686 -382999.2639931795 0.0 0 0 96830.0 6.495198487712667e-07 1.7304725897920607e-07
320 326 20525.206020432015 -1570.6244606939279 0.0 0 0 96830.0 4.843695652173913e-05 3.7064801512287333e-06
321 327 143581.71339714472 -10987.122416477163 0.0 0 0 96830.0 6.924130434782609e-06 5.298465028355388e-07
322 328 172652.5654414247 -13211.674572909022 0.0 0 0 96830.0 5.758260869565217e-06 4.4063213610586013e-07
323 329 39187.841931554896 -2998.721817371157 0.0 0 0 96830.0 2.5369565217391307e-05 1.9413232514177695e-06
324 330 5007.249543875592 -383.1634433574366 0.0 0 0 96830.0 0.00019854782608695655 1.5193224952741022e-05
324 331 16481.690503299516 -2635.6647926385153 0.0 0 0 96830.0 5.916049338374291e-05 9.46063327032136e-06
325 332 1263987.4050883423 -336755.76850893785 0.0 0 0 96830.0 7.387122873345937e-07 1.9681020793950852e-07
327 333 31782.75872828172 -2432.071972251123 0.0 0 0 96830.0 3.12804347826087e-05 2.3936332703213614e-06
328 334 19652.86271341838 -1503.87123372245 0.0 0 0 96830.0 5.058695652173913e-05 3.871001890359168e-06
329 335 18005.51656920531 -1377.81344181745 0.0 0 0 96830.0 5.5215217391304345e-05 4.225164461247637e-06
330 336 12642.986711855734 -967.4633309941779 0.0 0 0 96830.0 7.863478260869566e-05 6.017270321361059e-06
331 337 6718.705324771851 -514.1270161564546 0.0 0 0 96830.0 0.0001479717391304348 1.1323054820415878e-05
331 338 90675.79566284719 -14500.393762715436 0.0 0 0 96830.0 1.0753310018903592e-05 1.7196124763705104e-06
332 339 1604395.5474697344 -427448.4487784328 0.0 0 0 96830.0 5.819780718336485e-07 1.5505255198487712e-07
333 340 81666.12177739704 -6249.233666444295 0.0 0 0 96830.0 1.2173695652173914e-05 9.315523629489602e-07
334 341 9614.272822360997 -735.7008768415371 0.0 0 0 96830.0 0.00010340652173913045 7.912846880907373e-06
335 342 21965.51946883985 -1680.8397506590495 0.0 0 0 96830.0 4.526086956521739e-05 3.4634404536862003e-06
335 343 46684.57690294463 -3572.38501518185 0.0 0 0 96830.0 2.1295652173913047e-05 1.6295803402646504e-06
337 344 13363.785843232097 -1022.6201340908037 0.0 0 0 96830.0 7.439347826086958e-05 5.692718336483932e-06
338 345 105842.24093876177 -16925.7314934054 0.0 0 0 96830.0 9.212436672967863e-06 1.4732041587901701e-06
339 346 1913652.4034914267 -509841.6987404166 0.0 0 0 96830.0 4.879271833648394e-07 1.2999519848771267e-07
340 347 235078.70635408952 -17988.631442747723 0.0 0 0 96830.0 4.229130434782608e-06 3.23620415879017e-07
342 348 14679.87401987756 -1123.3294902167174 0.0 0 0 96830.0 6.772391304347827e-05 5.1823516068052926e-06
343 349 335280.143212057 -25656.21965448784 0.0 0 0 96830.0 2.9652173913043475e-06 2.2690359168241964e-07
344 350 143604.25652868353 -10988.847456107958 0.0 0 0 96830.0 6.92304347826087e-06 5.297633270321362e-07
345 351 150470.8822693182 -24062.507825583933 0.0 0 0 96830.0 6.480090548204158e-06 1.0362618147448015e-06
346 352 2120822.161337639 -565036.5612322907 0.0 0 0 96830.0 4.40264650283554e-07 1.17296786389414e-07
347 353 312037.46952868835 -23877.649842195286 0.0 0 0 96830.0 3.1860869565217392e-06 2.4380491493383745e-07
349 354 308709.4068727189 -23622.980699825446 0.0 0 0 96830.0 3.220434782608695e-06 2.4643327032136104e-07
350 355 347720.5864820907 -26608.184009064335 0.0 0 0 96830.0 2.8591304347826084e-06 2.1878563327032136e-07
351 356 119088.56609436432 -19044.01376775549 0.0 0 0 96830.0 8.187729300567108e-06 1.3093383742911152e-06
352 357 2562508.119713135 -682712.0172958352 0.0 0 0 96830.0 3.6437856332703223e-07 9.707896030245747e-08
353 358 426487.09814533766 -32635.534466773664 0.0 0 0 96830.0 2.3310869565217394e-06 1.7837882797731571e-07
354 359 352436.8952999735 -26969.084162084928 0.0 0 0 96830.0 2.8208695652173914e-06 2.158578449905482e-07
355 360 492798.6932697338 -37709.81305020571 0.0 0 0 96830.0 2.017413043478261e-06 1.5437595463137994e-07
356 361 190057.67114152687 -30393.01777316528 0.0 0 0 96830.0 5.130363516068053e-06 8.204206049149338e-07
357 362 2208946.1176304007 -588514.8415584641 0.0 0 0 96830.0 4.227006805293007e-07 1.1261733459357278e-07
358 363 839862.8431301803 -64267.765387352934 0.0 0 0 96830.0 1.1837391304347825e-06 9.058177693761815e-08
359 364 331705.3132235045 -25382.667446668172 0.0 0 0 96830.0 2.997173913043478e-06 2.2934896030245745e-07
360 365 481792.34873341577 -36867.5884248179 0.0 0 0 96830.0 2.0635000000000002e-06 1.579026086956522e-07
361 366 123767.08855343443 -19792.178340101458 0.0 0 0 96830.0 7.878224763705103e-06 1.25984404536862e-06
362 367 2009832.137196461 -535466.2263333636 0.0 0 0 96830.0 4.645776181474481e-07 1.2377432892249528e-07
363 368 571252.7672394894 -43713.25523223918 0.0 0 0 96830.0 1.7403478260869568e-06 1.3317444234404537e-07
364 369 232414.5526966741 -17784.765771571583 0.0 0 0 96830.0 4.277608695652174e-06 3.2733005671077504e-07
365 370 408323.3172689693 -31245.610364929824 0.0 0 0 96830.0 2.4347826086956525e-06 1.8631379962192817e-07
366 371 124154.105210272 -19854.06799737825 0.0 0 0 96830.0 7.853666540642722e-06 1.2559168241965971e-06
367 372 368665.1472733023 -98221.00639033236 0.0 0 0 96830.0 2.5327130434782614e-06 6.747739130434783e-07
368 373 340776.5390024185 -26076.813419315502 0.0 0 0 96830.0 2.9173913043478265e-06 2.2324385633270323e-07
369 374 191180.18282732565 -14629.44007722144 0.0 0 0 96830.0 5.200217391304348e-06 3.979296786389414e-07
370 375 323699.11901277304 -24770.019541846978 0.0 0 0 96830.0 3.0713043478260866e-06 2.3502155009451793e-07
371 376 110651.2189462818 -17694.75782723057 0.0 0 0 96830.0 8.812057844990548e-06 1.4091776937618147e-06
372 377 48922.56939690061 -13034.115204283737 0.0 0 0 96830.0 1.9085731568998113e-05 5.084884688090737e-06
372 378 32399.72478506877 -2479.2832879009147 0.0 0 0 96830.0 3.068478260869565e-05 2.3480529300567107e-06
373 379 76399.89230378818 -5846.25262846379 0.0 0 0 96830.0 1.3012826086956522e-05 9.957640831758033e-07
374 380 30843.87369941631 -2360.2268569988128 0.0 0 0 96830.0 3.223260869565218e-05 2.466495274102079e-06
375 381 361433.7432555486 -27657.538614337627 0.0 0 0 96830.0 2.7506521739130437e-06 2.1048468809073724e-07
376 382 152910.21558493897 -24452.593110597918 0.0 0 0 96830.0 6.376715500945179e-06 1.0197306238185254e-06
377 383 51079.53182412427 -13608.780376500259 0.0 0 0 96830.0 1.827978827977316e-05 4.870162570888469e-06
378 384 5276.712458361168 -403.7832142050285 0.0 0 0 96830.0 0.0001884086956521739 1.4417361058601134e-05
378 385 31407.328847005403 -2403.3434248143267 0.0 0 0 96830.0 3.1654347826086956e-05 2.4222457466918713e-06
379 386 20783.59004459397 -1590.3964555863213 0.0 0 0 96830.0 4.783478260869565e-05 3.6604007561436677e-06
380 387 9014.115097198046 -689.7757639595027 0.0 0 0 96830.0 0.0001102913043478261 8.439682419659737e-06
381 388 456773.98655737686 -34953.13984091232 0.0 0 0 96830.0 2.1765217391304346e-06 1.6655122873345938e-07
382 389 128290.25821139808 -20515.499713976234 0.0 0 0 96830.0 7.600459735349717e-06 1.2154253308128543e-06
383 390 1147411.900666408 -305697.33119944436 0.0 0 0 96830.0 8.137644612476373e-07 2.1680586011342156e-07
384 391 14437.95154984201 -1104.817162074867 0.0 0 0 96830.0 6.885869565217391e-05 5.269187145557656e-06
385 392 5838.030450516955 -446.73624316999314 0.0 0 0 96830.0 0.00017029347826086956 1.3031153119092629e-05
388 393 266148.00403960055 -20366.108135204213 0.0 0 0 96830.0 3.735434782608696e-06 2.85841965973535e-07
389 394 88416.00816743095 -14139.020495857829 0.0 0 0 96830.0 1.102814933837429e-05 1.763563327032136e-06
390 395 11263.814077023855 -861.9266424157385 0.0 0 0 96830.0 8.826304347826089e-05 6.754041587901702e-06
390 396 62608.92707036411 -16680.48056984153 0.0 0 0 96830.0 1.4913576559546318e-05 3.973325141776938e-06
391 397 141844.89170349733 -10854.217799919794 0.0 0 0 96830.0 7.00891304347826e-06 5.363342155009451e-07
392 398 80401.21577729353 -6152.4408594798515 0.0 0 0 96830.0 1.2365217391304349e-05 9.462079395085065e-07
393 399 76240.68340578249 -5834.069686703355 0.0 0 0 96830.0 1.304e-05 9.978434782608696e-07
394 400 119259.02467953518 -19071.272603337187 0.0 0 0 96830.0 8.176026465028354e-06 1.3074669187145558e-06
395 401 122932.74786732765 -9407.02766289116 0.0 0 0 96830.0 8.087173913043479e-06 6.188446124763705e-07
396 402 129774.59053610207 -34574.98215012938 0.0 0 0 96830.0 7.194960302457468e-06 1.916905482041588e-06
397 403 203254.27348499806 -15553.370492765069 0.0 0 0 96830.0 4.891304347826087e-06 3.7429111531190926e-07
398 404 184352.0439155261 -14106.939012666344 0.0 0 0 96830.0 5.392826086956522e-06 4.126684310018904e-07
399 405 12470.607420954562 -954.2725678643492 0.0 0 0 96830.0 7.972173913043477e-05 6.1004461247637045e-06
400 406 123627.96344405678 -19769.930188281996 0.0 0 0 96830.0 7.887090548204159e-06 1.2612618147448014e-06
401 407 216248.39953718823 -16547.70361675875 0.0 0 0 96830.0 4.5973913043478265e-06 3.5180037807183364e-07
402 408 43016.65204230782 -11460.640872585658 0.0 0 0 96830.0 2.1706083175803405e-05 5.783007561436673e-06
402 409 475520.66397704923 -126689.81193549119 0.0 0 0 96830.0 1.9635803402646508e-06 5.231436672967864e-07
403 410 196208.21835474754 -15014.194100189377 0.0 0 0 96830.0 5.066956521739131e-06 3.8773232514177697e-07
404 411 273747.2257519728 -20947.6137966727 0.0 0 0 96830.0 3.631739130434782e-06 2.7790699432892246e-07
406 412 126318.73815205402 -20200.224651181346 0.0 0 0 96830.0 7.719083931947069e-06 1.2343950850661624e-06
407 413 318469.43965267803 -24369.83538211797 0.0 0 0 96830.0 3.121739130434783e-06 2.388809073724008e-07
408 414 30203.043211758093 -8046.796184154527 0.0 0 0 96830.0 3.091486578449906e-05 8.236442344045369e-06
409 415 1899157.0222995898 -505979.79061266436 0.0 0 0 96830.0 4.916513043478262e-07 1.3098739130434783e-07
410 416 46722.73348398506 -3575.304823122335 0.0 0 0 96830.0 2.1278260869565216e-05 1.628249527410208e-06
411 417 163598.09520685615 -12518.810763655081 0.0 0 0 96830.0 6.07695652173913e-06 4.650192816635161e-07
412 418 105033.5904493051 -16796.416383151136 0.0 0 0 96830.0 9.2833629489603e-06 1.4845463137996217e-06
413 419 195411.74863959564 -14953.24685242123 0.0 0 0 96830.0 5.087608695652174e-06 3.893126654064272e-07
414 420 144331.37206861435 -38453.24876280601 0.0 0 0 96830.0 6.469300567107753e-06 1.7235727788279775e-06
415 421 2707852.7888738583 -721435.2320722323 0.0 0 0 96830.0 3.4482045368620044e-07 9.186822306238185e-08
416 422 191348.16541474717 -14642.294396954565 0.0 0 0 96830.0 5.195652173913043e-06 3.9758034026465026e-07
417 423 14316.369751479016 -1095.5135114175246 0.0 0 0 96830.0 6.944347826086957e-05 5.313935727788279e-06
418 424 62713.504339092986 -10028.811994524467 0.0 0 0 96830.0 1.5547926275992437e-05 2.486342155009452e-06
418 425 62713.504339092986 -10028.811994524467 0.0 0 0 96830.0 1.5547926275992437e-05 2.486342155009452e-06
419 426 58787.05222079694 -4498.487474287071 0.0 0 0 96830.0 1.6911521739130436e-05 1.294099054820416e-06
420 427 564702.2012771337 -150449.85654463776 0.0 0 0 96830.0 1.6534786389413991e-06 4.4052533081285447e-07
421 428 2175254.7115912223 -579538.6640370773 0.0 0 0 96830.0 4.2924767485822314e-07 1.14361606805293e-07
422 429 200597.4714190919 -15350.067378156598 0.0 0 0 96830.0 4.956086956521739e-06 3.79248393194707e-07
423 430 40360.26081910208 -3088.437349635637 0.0 0 0 96830.0 2.4632608695652175e-05 1.8849300567107751e-06
424 431 18593.205957543803 -2973.327178711696 0.0 0 0 96830.0 5.244200189035916e-05 8.38624763705104e-06
424 432 18593.205957543803 -2973.327178711696 0.0 0 0 96830.0 5.244200189035916e-05 8.38624763705104e-06
426 433 52803.68041534796 -4040.629457870105 0.0 0 0 96830.0 1.882782608695652e-05 1.4407379962192816e-06
427 434 1077911.2874533564 -287180.7444675 0.0 0 0 96830.0 8.66233648393195e-07 2.3078487712665407e-07
428 435 2526770.0677520093 -673190.5654959733 0.0 0 0 96830.0 3.6953224952741026e-07 9.845202268431003e-08
429 436 201694.50266439345 -15434.014116927498 0.0 0 0 96830.0 4.9291304347826085e-06 3.7718563327032135e-07
430 437 119094.30087011606 -9113.303023104532 0.0 0 0 96830.0 8.347826086956522e-06 6.387901701323251e-07
431 438 13145.676411253162 -2102.1870593688427 0.0 0 0 96830.0 7.417381285444235e-05 1.186148393194707e-05
431 439 13145.676411253162 -2102.1870593688427 0.0 0 0 96830.0 7.417381285444235e-05 1.186148393194707e-05
433 440 93890.55500969976 -7184.668557263981 0.0 0 0 96830.0 1.0588695652173914e-05 8.102654064272213e-07
434 441 1300273.2524069487 -346423.16578725266 0.0 0 0 96830.0 7.180975425330815e-07 1.913179584120983e-07
435 442 2311152.355303838 -615744.9705736501 0.0 0 0 96830.0 4.040075614366731e-07 1.0763705103969755e-07
436 443 175825.496094289 -13454.472744606464 0.0 0 0 96830.0 5.654347826086956e-06 4.3268052930056715e-07
437 444 67393.98675782453 -5157.105073642226 0.0 0 0 96830.0 1.4751739130434781e-05 1.1288287334593572e-06
438 445 18320.036073404182 -2929.643295320498 0.0 0 0 96830.0 5.322396408317581e-05 8.511294896030245e-06
438 446 18320.036073404182 -2929.643295320498 0.0 0 0 96830.0 5.322396408317581e-05 8.511294896030245e-06
440 447 99948.0101716159 -7648.195560958435 0.0 0 0 96830.0 9.94695652173913e-06 7.611584120982987e-07
441 448 1604395.5474697344 -427448.4487784328 0.0 0 0 96830.0 5.819780718336485e-07 1.5505255198487712e-07
442 449 2274813.665215902 -606063.4947473023 0.0 0 0 96830.0 4.104613232514178e-07 1.0935648393194707e-07
443 450 50913.131829048536 -3895.9613921358878 0.0 0 0 96830.0 1.9526956521739133e-05 1.4942366729678642e-06
444 451 77034.34884298178 -5894.802346245562 0.0 0 0 96830.0 1.2905652173913043e-05 9.875629489603024e-07
445 452 60382.49289528239 -9656.048970460937 0.0 0 0 96830.0 1.6148139886578448e-05 2.5823251417769374e-06
445 453 60382.49289528239 -9656.048970460937 0.0 0 0 96830.0 1.6148139886578448e-05 2.5823251417769374e-06
447 454 104758.24426554707 -8016.283039450559 0.0 0 0 96830.0 9.490217391304347e-06 7.262079395085066e-07
448 455 1049606.3098323105 -279639.63729109 0.0 0 0 96830.0 8.895935727788283e-07 2.370085066162571e-07
449 456 3324111.3701333073 -885620.9124807714 0.0 0 0 96830.0 2.808940264650284e-07 7.483672967863894e-08
450 457 10447.584477674494 -799.4673339437875 0.0 0 0 96830.0 9.515869565217391e-05 7.281708884688091e-06
451 458 68191.89361524001 -5218.162294035758 0.0 0 0 96830.0 1.457913043478261e-05 1.1156204158790171e-06
452 459 20402.684826911664 -3262.6894712545304 0.0 0 0 96830.0 4.7791011342155016e-05 7.642485822306239e-06
452 460 20402.684826911664 -3262.6894712545304 0.0 0 0 96830.0 4.7791011342155016e-05 7.642485822306239e-06
452 461 12407.339193717833 -949.431173084495 0.0 0 0 96830.0 8.012826086956522e-05 6.131553875236295e-06
454 462 63804.96900470815 -4882.467193403755 0.0 0 0 96830.0 1.5581521739130434e-05 1.1923251417769376e-06
455 463 1164308.4913369461 -310198.97761896736 0.0 0 0 96830.0 8.01955009451796e-07 2.1365954631379962e-07
456 464 4471977.468028562 -1191439.252430967 0.0 0 0 96830.0 2.0879421550094523e-07 5.562765595463138e-08
458 465 72108.94109857077 -5517.9015797167185 0.0 0 0 96830.0 1.378717391304348e-05 1.055018525519849e-06
459 466 18363.472401440507 -2936.5894032154324 0.0 0 0 96830.0 5.3098069943289223e-05 8.491162570888467e-06
459 467 18363.472401440507 -2936.5894032154324 0.0 0 0 96830.0 5.3098069943289223e-05 8.491162570888467e-06
459 468 124564.70864797187 -19919.72952792727 0.0 0 0 96830.0 7.827778449905483e-06 1.2517769376181474e-06
461 469 84959.89361322093 -6501.278815620384 0.0 0 0 96830.0 1.1701739130434783e-05 8.954374291115311e-07
462 470 91605.49553136744 -7009.81183196551 0.0 0 0 96830.0 1.0852826086956521e-05 8.304771266540643e-07
463 471 1223329.8297618036 -325923.64077595493 0.0 0 0 96830.0 7.63263516068053e-07 2.0335122873345937e-07
464 472 3642036.562088599 -970323.6096075464 0.0 0 0 96830.0 2.563738752362949e-07 6.830398865784499e-08
465 473 14286.851463331635 -1093.2547206723336 0.0 0 0 96830.0 6.958695652173914e-05 5.324914933837429e-06
466 474 50111.9390164794 -8013.636303274958 0.0 0 0 96830.0 1.9457737240075615e-05 3.111578449905482e-06
466 475 50111.9390164794 -8013.636303274958 0.0 0 0 96830.0 1.9457737240075615e-05 3.111578449905482e-06
469 476 155811.42562135725 -11922.96126493864 0.0 0 0 96830.0 6.380652173913044e-06 4.882586011342155e-07
470 477 130376.63293361623 -9976.646694050633 0.0 0 0 96830.0 7.6254347826086966e-06 5.835115311909263e-07
471 478 1085897.7393753352 -289308.52180437755 0.0 0 0 96830.0 8.598627599243857e-07 2.290875236294896e-07
472 479 2818786.9797147806 -750990.6916758355 0.0 0 0 96830.0 3.31249943289225e-07 8.825272211720227e-08
473 480 240898.71225307925 -18433.9884158878 0.0 0 0 96830.0 4.126956521739131e-06 3.1580189035916826e-07
474 481 23686.39570974056 -3787.803151877488 0.0 0 0 96830.0 4.116561058601134e-05 6.582986767485822e-06
474 482 23686.39570974056 -3787.803151877488 0.0 0 0 96830.0 4.116561058601134e-05 6.582986767485822e-06
474 483 4450.000635806963 -340.52178778348934 0.0 0 0 96830.0 0.00022341086956521736 1.7095788279773157e-05
476 484 230006.59625873648 -17600.504757190272 0.0 0 0 96830.0 4.322391304347826e-06 3.307568998109641e-07
477 485 272865.22395062394 -20880.12148491731 0.0 0 0 96830.0 3.643478260869565e-06 2.7880529300567106e-07
478 486 1027998.8806666251 -273882.913462276 0.0 0 0 96830.0 9.082918714555767e-07 2.419901701323251e-07
479 487 1614887.4291292606 -430243.7311183795 0.0 0 0 96830.0 5.781969754253309e-07 1.5404517958412095e-07
480 488 266971.46254596947 -20429.12061221332 0.0 0 0 96830.0 3.7239130434782607e-06 2.8496030245746695e-07
481 489 16526.518086113385 -2642.8333826407334 0.0 0 0 96830.0 5.900002268431001e-05 9.434971644612475e-06
481 490 16526.518086113385 -2642.8333826407334 0.0 0 0 96830.0 5.900002268431001e-05 9.434971644612475e-06
483 491 79126.94915586643 -6054.9317614923875 0.0 0 0 96830.0 1.2564347826086957e-05 9.614457466918715e-07
483 492 11229.242138713493 -859.2811375711195 0.0 0 0 96830.0 8.853478260869565e-05 6.774835538752363e-06
484 493 151426.14990935585 -11587.392340889839 0.0 0 0 96830.0 6.565434782608696e-06 5.023984877126654e-07
485 494 430745.1401914341 -32961.367249431474 0.0 0 0 96830.0 2.3080434782608698e-06 1.7661550094517957e-07
486 495 470162.9641481909 -125262.39555772964 0.0 0 0 96830.0 1.985956143667297e-06 5.291051039697542e-07
487 496 1290222.4714693625 -343745.40298271325 0.0 0 0 96830.0 7.236914933837432e-07 1.9280831758034028e-07
488 497 196418.89590741988 -15030.315512915608 0.0 0 0 96830.0 5.0615217391304345e-06 3.873164461247637e-07
489 498 27080.831419153783 -4330.623361271927 0.0 0 0 96830.0 3.6005724007561435e-05 5.757844990548204e-06
489 499 27080.831419153783 -4330.623361271927 0.0 0 0 96830.0 3.6005724007561435e-05 5.757844990548204e-06
491 500 187204.59918181086 -14325.221502608138 0.0 0 0 96830.0 5.310652173913043e-06 4.063803402646503e-07
492 501 17548.814863439973 -1342.86583302845 0.0 0 0 96830.0 5.665217391304348e-05 4.3351228733459355e-06
493 502 99780.09629333572 -7635.346498968297 0.0 0 0 96830.0 9.963695652173914e-06 7.624393194706994e-07
494 503 637080.8471821654 -48750.53439307005 0.0 0 0 96830.0 1.560521739130435e-06 1.1941383742911153e-07
495 504 20729.969033670193 -5522.947954225998 0.0 0 0 96830.0 4.5042181474480164e-05 1.2000289224952741e-05
496 505 1874550.3521343013 -499423.99892629177 0.0 0 0 96830.0 4.98105066162571e-07 1.3270682419659735e-07
497 506 149627.70427340845 -11449.772153095604 0.0 0 0 96830.0 6.644347826086957e-06 5.084370510396976e-07
498 507 157254.52909643875 -25147.312755294046 0.0 0 0 96830.0 6.20055236294896e-06 9.915595463137996e-07
498 508 157254.52909643875 -25147.312755294046 0.0 0 0 96830.0 6.20055236294896e-06 9.915595463137996e-07
500 509 318602.5604996835 -24380.022020845343 0.0 0 0 96830.0 3.1204347826086956e-06 2.3878109640831756e-07
502 510 140640.93100262806 -10762.08863324458 0.0 0 0 96830.0 7.068913043478261e-06 5.409255198487713e-07
503 511 456728.36846224475 -34949.64906493699 0.0 0 0 96830.0 2.1767391304347826e-06 1.6656786389413988e-07
504 512 8218.123119271953 -628.8650734747233 0.0 0 0 96830.0 0.00012097391304347826 9.257134215500945e-06
504 513 134841.71120779368 -35924.9814531713 0.0 0 0 96830.0 6.924586011342156e-06 1.8448714555765595e-06
505 514 2108616.9900540328 -561784.818518045 0.0 0 0 96830.0 4.428130056710776e-07 1.1797572778827976e-07
507 515 58323.525777943134 -9326.789836558071 0.0 0 0 96830.0 1.6718209829867672e-05 2.6734877126654064e-06
507 516 58323.525777943134 -9326.789836558071 0.0 0 0 96830.0 1.6718209829867672e-05 2.6734877126654064e-06
507 517 9665.274227349008 -739.6035930493154 0.0 0 0 96830.0 0.0001028608695652174 7.871092627599245e-06
509 518 346193.8798949626 -26491.3577658754 0.0 0 0 96830.0 2.8717391304347827e-06 2.1975047258979204e-07
510 519 205852.59062893665 -15752.198239431675 0.0 0 0 96830.0 4.8295652173913045e-06 3.695667296786389e-07
511 520 598432.4984837028 -45793.09553614422 0.0 0 0 96830.0 1.661304347826087e-06 1.2712589792060493e-07
512 521 9319.030756434071 -713.1084404923463 0.0 0 0 96830.0 0.00010668260869565218 8.16353875236295e-06
513 522 249951.30988283653 -66592.86723155863 0.0 0 0 96830.0 3.7356196597353505e-06 9.952563327032135e-07
514 523 2707852.7888738583 -721435.2320722323 0.0 0 0 96830.0 3.4482045368620044e-07 9.186822306238185e-08
515 524 79231.08750051679 -12670.21655125535 0.0 0 0 96830.0 1.2306595463137995e-05 1.9680056710775043e-06
515 525 79231.08750051679 -12670.21655125535 0.0 0 0 96830.0 1.2306595463137995e-05 1.9680056710775043e-06
517 526 16356.29883194727 -1251.612432357704 0.0 0 0 96830.0 6.078260869565217e-05 4.651190926275992e-06
518 527 388581.9656226066 -29734.967804164684 0.0 0 0 96830.0 2.558478260869565e-06 1.9577920604914935e-07
519 528 260508.18304827443 -19934.53922456361 0.0 0 0 96830.0 3.816304347826087e-06 2.920302457466919e-07
520 529 83858.46068419283 -6416.995252355625 0.0 0 0 96830.0 1.1855434782608697e-05 9.071984877126655e-07
522 530 1673659.6761089903 -445902.0304961909 0.0 0 0 96830.0 5.578930056710777e-07 1.486357277882798e-07
523 531 2964818.9022531677 -789897.0068046759 0.0 0 0 96830.0 3.149342533081286e-07 8.390584120982988e-08
524 532 58193.911084960775 -9306.062540238932 0.0 0 0 96830.0 1.6755446124763702e-05 2.6794423440453688e-06
524 533 58193.911084960775 -9306.062540238932 0.0 0 0 96830.0 1.6755446124763702e-05 2.6794423440453688e-06
526 534 20642.868797564577 -1579.6282210310285 0.0 0 0 96830.0 4.816086956521739e-05 3.685353497164461e-06
527 535 374577.8649694862 -28663.349667230246 0.0 0 0 96830.0 2.6541304347826087e-06 2.0309867674858223e-07
528 536 81249.70957986811 -6217.369080894256 0.0 0 0 96830.0 1.223608695652174e-05 9.363266540642723e-07
529 537 23785.411938484718 -1820.1010874666565 0.0 0 0 96830.0 4.1797826086956524e-05 3.198442344045369e-06
529 538 8190.305986017258 -626.736458060451 0.0 0 0 96830.0 0.00012138478260869565 9.288574669187145e-06
530 539 2192557.483230146 -584148.5265540169 0.0 0 0 96830.0 4.258602268431003e-07 1.1345911153119092e-07
531 540 2751665.8329445967 -733108.0503830492 0.0 0 0 96830.0 3.393300945179585e-07 9.040546313799622e-08
532 541 82234.68861931161 -13150.53655959141 0.0 0 0 96830.0 1.1857100189035916e-05 1.8961247637051038e-06
532 542 82234.68861931161 -13150.53655959141 0.0 0 0 96830.0 1.1857100189035916e-05 1.8961247637051038e-06
534 543 49957.62768360378 -3822.844553180116 0.0 0 0 96830.0 1.9900434782608695e-05 1.5228158790170135e-06
535 544 124080.1246279528 -9494.82692805204 0.0 0 0 96830.0 8.012391304347827e-06 6.131221172022685e-07
536 545 10045.07468845401 -768.6665848556112 0.0 0 0 96830.0 9.897173913043478e-05 7.573489603024574e-06
537 546 21540.30028454833 -1648.3012391654374 0.0 0 0 96830.0 4.615434782608696e-05 3.531810964083176e-06
539 547 2344333.6937382873 -624585.2541711495 0.0 0 0 96830.0 3.982893005671079e-07 1.0611357277882799e-07
540 548 2092633.161689005 -557526.3532967056 0.0 0 0 96830.0 4.461952741020795e-07 1.1887684310018904e-07
541 549 29405.810689411337 -4702.421752038061 0.0 0 0 96830.0 3.3158920604914935e-05 5.302599243856333e-06
541 550 29405.810689411337 -4702.421752038061 0.0 0 0 96830.0 3.3158920604914935e-05 5.302599243856333e-06
543 551 158770.34972269327 -12149.38328312783 0.0 0 0 96830.0 6.261739130434783e-06 4.79159168241966e-07
543 552 12069.731204572332 -923.5968226107523 0.0 0 0 96830.0 8.23695652173913e-05 6.303062381852552e-06
544 553 123124.71134298405 -9421.717041897911 0.0 0 0 96830.0 8.074565217391304e-06 6.178797731568999e-07
545 554 201712.29505171385 -15435.375621348536 0.0 0 0 96830.0 4.9286956521739135e-06 3.7715236294896034e-07
546 555 7946.794247258736 -608.1025163119729 0.0 0 0 96830.0 0.00012510434782608696 9.573202268431003e-06
547 556 2198413.216020724 -585708.6305456671 0.0 0 0 96830.0 4.24725897920605e-07 1.1315689981096409e-07
548 557 2925889.172786135 -779525.2175671089 0.0 0 0 96830.0 3.1912453686200384e-07 8.502223062381853e-08
549 558 40610.24760337765 -6494.176055977236 0.0 0 0 96830.0 2.4010317580340263e-05 3.839603024574669e-06
549 559 40610.24760337765 -6494.176055977236 0.0 0 0 96830.0 2.4010317580340263e-05 3.839603024574669e-06
551 560 431476.66321468604 -33017.344663384676 0.0 0 0 96830.0 2.3041304347826086e-06 1.7631606805293007e-07
552 561 15954.581193875443 -1220.8723000530777 0.0 0 0 96830.0 6.231304347826087e-05 4.768302457466919e-06
553 562 13177.412918635515 -1008.3585537738481 0.0 0 0 96830.0 7.544565217391305e-05 5.773232514177694e-06
554 563 255644.31513290055 -19562.347592778475 0.0 0 0 96830.0 3.88891304347826e-06 2.975863894139886e-07
556 564 2484425.078744479 -661908.8713443318 0.0 0 0 96830.0 3.7583062381852556e-07 1.0013005671077505e-07
557 565 1499624.687743943 -399535.0445449189 0.0 0 0 96830.0 6.22637807183365e-07 1.658852551984877e-07
558 566 183093.61483563186 -29279.362713587187 0.0 0 0 96830.0 5.325499432892249e-06 8.51625708884688e-07
558 567 183093.61483563186 -29279.362713587187 0.0 0 0 96830.0 5.325499432892249e-06 8.51625708884688e-07
558 568 11884.052682845113 -909.3883792090173 0.0 0 0 96830.0 8.365652173913044e-05 6.401542533081285e-06
560 569 289664.3750577943 -22165.621743552954 0.0 0 0 96830.0 3.4321739130434783e-06 2.626359168241966e-07
563 570 226128.41937363808 -17303.73991728709 0.0 0 0 96830.0 4.396521739130435e-06 3.364294896030246e-07
564 571 2428989.48627923 -647139.5346656342 0.0 0 0 96830.0 3.8440801512287344e-07 1.024152741020794e-07
566 572 773259.3163148938 -123655.54098852245 0.0 0 0 96830.0 1.2609805293005672e-06 2.016493383742911e-07
566 573 773259.3163148938 -123655.54098852245 0.0 0 0 96830.0 1.2609805293005672e-06 2.016493383742911e-07
568 574 94006.35490487701 -7193.5297666340675 0.0 0 0 96830.0 1.0575652173913043e-05 8.092672967863895e-07
569 575 481391.7003592059 -36836.93011444358 0.0 0 0 96830.0 2.065217391304348e-06 1.5803402646502835e-07
570 576 254067.8418562476 -19441.713115956336 0.0 0 0 96830.0 3.913043478260869e-06 2.9943289224952737e-07
571 577 470617.10929043044 -125383.39043139204 0.0 0 0 96830.0 1.9840396975425334e-06 5.285945179584121e-07
572 578 28523.438082749977 -4561.317390631661 0.0 0 0 96830.0 3.418469187145557e-05 5.466635160680529e-06
572 579 28523.438082749977 -4561.317390631661 0.0 0 0 96830.0 3.418469187145557e-05 5.466635160680529e-06
572 580 343915.29616144137 -54997.11559084883 0.0 0 0 96830.0 2.8351892249527412e-06 4.5338846880907376e-07
574 581 127391.3243659282 -9748.205690610159 0.0 0 0 96830.0 7.804130434782609e-06 5.971856332703213e-07
575 582 398954.99898913526 -30528.73035742948 0.0 0 0 96830.0 2.49195652173913e-06 1.9068884688090735e-07
576 583 220736.61325477637 -16891.149536017667 0.0 0 0 96830.0 4.503913043478261e-06 3.4464725897920604e-07
577 584 9664.865703141419 -739.5723320664737 0.0 0 0 96830.0 0.00010286521739130435 7.871425330812855e-06
577 585 218183.65795686358 -58129.222740332254 0.0 0 0 96830.0 4.279527788279774e-06 1.1401661625708885e-06
578 586 40700.419124960164 -6508.5958088955485 0.0 0 0 96830.0 2.3957122873345932e-05 3.83109640831758e-06
578 587 40700.419124960164 -6508.5958088955485 0.0 0 0 96830.0 2.3957122873345932e-05 3.83109640831758e-06
580 588 945826.2174016802 -151251.52730304055 0.0 0 0 96830.0 1.0309134215500944e-06 1.6485822306238183e-07
581 589 130925.31215037094 -10018.632581941427 0.0 0 0 96830.0 7.5934782608695654e-06 5.810661625708885e-07
582 590 454368.71866989136 -34769.08455908734 0.0 0 0 96830.0 2.1880434782608696e-06 1.6743289224952743e-07
583 591 215281.32342006575 -16473.701270405036 0.0 0 0 96830.0 4.618043478260869e-06 3.5338071833648396e-07
584 592 167713.8460251011 -12833.755174094693 0.0 0 0 96830.0 5.9278260869565215e-06 4.5360756143667295e-07
585 593 45657.59534830164 -12164.249855569413 0.0 0 0 96830.0 2.045055198487713e-05 5.448504725897921e-06
586 594 20313.374563087316 -3248.407446122706 0.0 0 0 96830.0 4.800113043478261e-05 7.67608695652174e-06
586 595 171208.12067540607 -27378.697336152352 0.0 0 0 96830.0 5.695202646502835e-06 9.107466918714554e-07
588 596 1231931.3644297658 -197003.9495356768 0.0 0 0 96830.0 7.914929111531191e-07 1.2657136105860112e-07
589 597 13937.64827932603 -1066.5330857223396 0.0 0 0 96830.0 7.13304347826087e-05 5.458328922495274e-06
590 598 69436.41482816279 -5313.3952216333255 0.0 0 0 96830.0 1.431782608695652e-05 1.0956249527410207e-06
591 599 179103.2017471785 -13705.288481523225 0.0 0 0 96830.0 5.550869565217392e-06 4.2476219281663517e-07
592 600 333933.6366128117 -25553.182627762977 0.0 0 0 96830.0 2.9771739130434784e-06 2.2781852551984874e-07
593 601 4988.841542301603 -381.75483106307917 0.0 0 0 96830.0 0.0001992804347826087 1.5249285444234405e-05
593 602 38831.18294711773 -10345.534142845236 0.0 0 0 96830.0 2.4045701323251424e-05 6.406336483931948e-06
594 603 22778.342803775107 -3642.5921327998567 0.0 0 0 96830.0 4.280666729678639e-05 6.845415879017012e-06
594 604 22778.342803775107 -3642.5921327998567 0.0 0 0 96830.0 4.280666729678639e-05 6.845415879017012e-06
594 605 23047.564399812938 -3685.6446268357577 0.0 0 0 96830.0 4.230663705103969e-05 6.765453686200377e-06
595 606 3920.7328007171154 -300.0212925766141 0.0 0 0 96830.0 0.00025356956521739127 1.9403584120982988e-05
595 607 3920.7328007171154 -300.0212925766141 0.0 0 0 96830.0 0.00025356956521739127 1.9403584120982988e-05
596 608 996472.5247754586 -159350.61696835692 0.0 0 0 96830.0 9.785166351606804e-07 1.564792060491493e-07
597 609 29947.096807101418 -2291.6039295868914 0.0 0 0 96830.0 3.319782608695652e-05 2.5403553875236293e-06
598 610 9417.283376739953 -720.6269018722746 0.0 0 0 96830.0 0.00010556956521739131 8.078366729678639e-06
599 611 285683.4803481045 -21860.99675707235 0.0 0 0 96830.0 3.4799999999999997e-06 2.6629565217391307e-07
600 612 398225.45745493355 -30472.904570464485 0.0 0 0 96830.0 2.4965217391304345e-06 1.9103818525519848e-07
601 613 9453.882567934132 -723.4275356332205 0.0 0 0 96830.0 0.00010516086956521739 8.047092627599243e-06
602 614 40541.061420793274 -10801.085706999665 0.0 0 0 96830.0 2.3031538752362953e-05 6.13613988657845e-06
603 615 10659.465941398981 -720.8071638973059 0.0 0 0 96830.0 9.338630812854443e-05 6.314905482041589e-06
603 616 35377.21067919047 -5657.336462557111 0.0 0 0 96830.0 2.7561950850661624e-05 4.407561436672967e-06
603 617 35377.21067919047 -5657.336462557111 0.0 0 0 96830.0 2.7561950850661624e-05 4.407561436672967e-06
606 618 16657.758991084927 -1274.6806880134554 0.0 0 0 96830.0 5.968260869565218e-05 4.567017013232514e-06
608 619 1728168.9591368216 -276359.6416530098 0.0 0 0 96830.0 5.642185255198488e-07 9.022684310018903e-08
609 620 63806.74945115256 -4882.6034362621085 0.0 0 0 96830.0 1.5581086956521738e-05 1.1922918714555765e-06
611 621 66474.13627647217 -5086.716515069174 0.0 0 0 96830.0 1.4955869565217392e-05 1.144449149338374e-06
612 622 488341.57199432515 -37368.74637869618 0.0 0 0 96830.0 2.0358260869565217e-06 1.557849527410208e-07
614 623 28018.75476909972 -2144.0438432006745 0.0 0 0 96830.0 3.5482608695652174e-05 2.7151909262759927e-06
614 624 144089.1085554307 -38388.70410418408 0.0 0 0 96830.0 6.480177693761817e-06 1.7264706994328923e-06
615 625 7825.012065728773 -529.1376496316196 0.0 0 0 96830.0 0.00012721362759924386 8.602353497164463e-06
619 626 1411873.0189797727 -225779.26742746896 0.0 0 0 96830.0 6.906180151228733e-07 1.104399810964083e-07
620 627 95660.07390993906 -7320.075220934467 0.0 0 0 96830.0 1.0392826086956522e-05 7.952771266540643e-07
621 628 15767.553280280159 -1206.5605988388295 0.0 0 0 96830.0 6.305217391304348e-05 4.824862003780718e-06
622 629 311103.47982397664 -23806.179325660825 0.0 0 0 96830.0 3.1956521739130433e-06 2.445368620037807e-07
623 630 114267.68161042566 -8743.961723232573 0.0 0 0 96830.0 8.700434782608697e-06 6.657724007561438e-07
624 631 626285.0323572101 -166856.961175461 0.0 0 0 96830.0 1.4908914933837433e-06 3.9720831758034026e-07
625 632 26678.193400173303 -1804.014669065021 0.0 0 0 96830.0 3.731317769376181e-05 2.5231663516068058e-06
626 633 1684262.738471758 -269338.3910136073 0.0 0 0 96830.0 5.789268620037807e-07 9.25789224952741e-08
627 634 62571.43653421158 -4788.075143487494 0.0 0 0 96830.0 1.5888695652173914e-05 1.2158306238185253e-06
629 635 130465.89887919599 -9983.477479451516 0.0 0 0 96830.0 7.620217391304349e-06 5.831122873345935e-07
630 636 166407.87254975826 -12733.819812503241 0.0 0 0 96830.0 5.974347826086957e-06 4.5716748582230625e-07
631 637 1262040.6308716002 -336237.1023854993 0.0 0 0 96830.0 7.3985179584121e-07 1.9711379962192816e-07
632 638 8060.331530436783 -545.0502625991461 0.0 0 0 96830.0 0.00012349965595463138 8.351209829867676e-06
633 639 1591086.5060756528 -254438.14063043482 0.0 0 0 96830.0 6.128296219281664e-07 9.800047258979205e-08
634 640 32038.819906210294 -2451.666218910005 0.0 0 0 96830.0 3.103043478260869e-05 2.374502835538752e-06
635 641 188578.66287627135 -14430.367246184242 0.0 0 0 96830.0 5.271956521739131e-06 4.034192816635161e-07
636 642 120044.65438398928 -9186.025726774831 0.0 0 0 96830.0 8.281739130434784e-06 6.337330812854443e-07
637 643 1148435.2660616636 -305969.97964416584 0.0 0 0 96830.0 8.130393194706996e-07 2.1661266540642722e-07
639 644 1603380.4114044777 -256404.11696233653 0.0 0 0 96830.0 6.081307561436673e-07 9.724905482041587e-08
640 645 115903.9246119182 -8869.169883346784 0.0 0 0 96830.0 8.577608695652174e-06 6.563735349716445e-07
641 646 148312.6691555848 -11349.14337886214 0.0 0 0 96830.0 6.7032608695652175e-06 5.12945179584121e-07
642 647 50624.009579822836 -3873.8372548038337 0.0 0 0 96830.0 1.9638478260869568e-05 1.5027705103969753e-06
643 648 995306.3367584992 -265172.8561436877 0.0 0 0 96830.0 9.381262759924387e-07 2.4993875236294896e-07
644 649 1170206.3389456433 -187133.20985271482 0.0 0 0 96830.0 8.332418903591682e-07 1.332476370510397e-07
645 650 399233.62317000935 -30550.051164313754 0.0 0 0 96830.0 2.490217391304348e-06 1.9055576559546313e-07
646 651 244139.5021040175 -18681.979291437856 0.0 0 0 96830.0 4.0721739130434785e-06 3.116098298676748e-07
647 652 66596.10539255953 -5096.049803952382 0.0 0 0 96830.0 1.4928478260869567e-05 1.1423531190926277e-06
648 653 984543.3299492045 -262305.3397309924 0.0 0 0 96830.0 9.483818525519851e-07 2.526710775047259e-07
649 654 887370.2804539887 -141903.56297238625 0.0 0 0 96830.0 1.0988253308128543e-06 1.7571833648393193e-07
650 655 460230.773831863 -35217.65921495995 0.0 0 0 96830.0 2.1601739130434784e-06 1.6530026465028356e-07
650 656 86645.21614619762 -6630.242626839469 0.0 0 0 96830.0 1.147413043478261e-05 8.78020415879017e-07
651 657 270428.7832424136 -20693.680804636864 0.0 0 0 96830.0 3.6763043478260876e-06 2.8131720226843104e-07
652 658 94868.29758562123 -7259.487119595365 0.0 0 0 96830.0 1.0479565217391304e-05 8.019145557655955e-07
653 659 888072.731236511 -236603.31890607774 0.0 0 0 96830.0 1.0514037807183366e-06 2.801185255198488e-07
654 660 301597.85158631974 -48229.9336225458 0.0 0 0 96830.0 3.2329969754253303e-06 5.170037807183364e-07
655 661 491744.2100443501 -37629.12215991549 0.0 0 0 96830.0 2.0217391304347828e-06 1.547069943289225e-07
656 662 65661.91639978832 -5024.564037549018 0.0 0 0 96830.0 1.514086956521739e-05 1.1586056710775047e-06
657 663 160345.750619279 -12269.935699562218 0.0 0 0 96830.0 6.200217391304349e-06 4.7445141776937625e-07
658 664 90558.83472103874 -6929.719526479486 0.0 0 0 96830.0 1.0978260869565218e-05 8.400756143667298e-07
659 665 610691.025148885 -162702.3534155788 0.0 0 0 96830.0 1.5289614366729683e-06 4.0735103969754255e-07
660 666 422693.6952206747 -67594.94060032112 0.0 0 0 96830.0 2.3067884688090734e-06 3.688894139886578e-07
661 667 477361.76211482607 -36528.552231395384 0.0 0 0 96830.0 2.0826521739130435e-06 1.593681663516068e-07
662 668 15805.153459175584 -1209.437829919523 0.0 0 0 96830.0 6.290217391304349e-05 4.813383742911153e-06
663 669 163096.3321473772 -12480.414981712338 0.0 0 0 96830.0 6.095652173913044e-06 4.6644990548204155e-07
664 670 110301.75715521711 -8440.48228666009 0.0 0 0 96830.0 9.013260869565217e-06 6.897103969754252e-07
665 671 95255.59578030526 -7289.123851014662 0.0 0 0 96830.0 1.0436956521739132e-05 7.986540642722117e-07
665 672 222113.92628688575 -59176.33802533815 0.0 0 0 96830.0 4.203802268431003e-06 1.1199911153119092e-06
666 673 544890.371380635 -87135.98689455783 0.0 0 0 96830.0 1.7894699432892246e-06 2.8616257088846876e-07
667 674 66023.0868005321 -5052.201424736369 0.0 0 0 96830.0 1.505804347826087e-05 1.1522676748582231e-06
668 675 37216.96902191127 -2847.907194720167 0.0 0 0 96830.0 2.6713043478260868e-05 2.0441285444234405e-06
669 676 344706.5013501512 -26377.540972881136 0.0 0 0 96830.0 2.884130434782609e-06 2.2069867674858223e-07
670 677 66618.417920587 -5097.75719740144 0.0 0 0 96830.0 1.4923478260869565e-05 1.1419705103969753e-06
671 678 158627.16453043555 -12138.426503198547 0.0 0 0 96830.0 6.267391304347826e-06 4.795916824196598e-07
672 679 35076.73879977805 -9345.262526948169 0.0 0 0 96830.0 2.661943667296787e-05 7.092039697542534e-06
673 680 273230.3303176671 -43693.5496243604 0.0 0 0 96830.0 3.568655576559546e-06 5.70680529300567e-07
674 681 9066.475988605413 -693.7825104324141 0.0 0 0 96830.0 0.00010965434782608697 8.390941398865785e-06
676 682 313836.2032262185 -24015.29207296281 0.0 0 0 96830.0 3.1678260869565216e-06 2.4240756143667296e-07
677 683 20614.023680020087 -1577.4209424711023 0.0 0 0 96830.0 4.822826086956522e-05 3.6905103969754254e-06
678 684 170999.89356163834 -13085.209246455803 0.0 0 0 96830.0 5.813913043478261e-06 4.4489073724007564e-07
679 685 49003.692530975444 -13055.728302048201 0.0 0 0 96830.0 1.9054136105860117e-05 5.076466918714556e-06
682 686 326985.6394546301 -25021.509801745604 0.0 0 0 96830.0 3.040434782608696e-06 2.3265935727788283e-07
683 687 8822.140424808937 -675.0855281592926 0.0 0 0 96830.0 0.00011269130434782608 8.623334593572779e-06
684 688 175252.77460863983 -13410.647100487222 0.0 0 0 96830.0 5.672826086956522e-06 4.3409451795841213e-07
685 689 5615.10363240525 -429.6774953492713 0.0 0 0 96830.0 0.00017705434782608697 1.354850661625709e-05
685 690 17127.129013025577 -4563.067218798784 0.0 0 0 96830.0 5.4517194706994336e-05 1.452465406427221e-05
686 691 271134.2356917328 -20747.6632529326 0.0 0 0 96830.0 3.6667391304347823e-06 2.805852551984877e-07
688 692 233649.4739392253 -17879.26409274072 0.0 0 0 96830.0 4.255e-06 3.256e-07
689 693 60049.912068653655 -4595.123706123062 0.0 0 0 96830.0 1.655586956521739e-05 1.26688393194707e-06
689 694 21509.906182270148 -1645.9754295998027 0.0 0 0 96830.0 4.621956521739131e-05 3.536801512287335e-06
690 695 4823.20802536724 -369.08026628897136 0.0 0 0 96830.0 0.00020612391304347826 1.5772960302457464e-05
690 696 82288.713066006 -21923.635232914006 0.0 0 0 96830.0 1.1346914933837432e-05 3.0230831758034027e-06
691 697 169976.62714783335 -13006.907120877682 0.0 0 0 96830.0 5.848913043478261e-06 4.4756899810964084e-07
692 698 147082.0169624178 -11254.97173277632 0.0 0 0 96830.0 6.759347826086956e-06 5.172370510396975e-07
693 699 191910.2456320796 -14685.305752715658 0.0 0 0 96830.0 5.180434782608695e-06 3.9641587901701327e-07
694 700 10558.785448403343 -807.9766256169515 0.0 0 0 96830.0 9.415652173913044e-05 7.20502079395085e-06
695 701 8325.543698183974 -637.0850829914692 0.0 0 0 96830.0 0.00011941304347826087 9.137693761814744e-06
696 702 45825.2802331114 -7328.136497832314 0.0 0 0 96830.0 2.1277882797731566e-05 3.4026465028355385e-06
697 703 62105.77914895508 -4752.442230528736 0.0 0 0 96830.0 1.600782608695652e-05 1.2249466918714554e-06
698 704 87235.25777148742 -6675.393638165993 0.0 0 0 96830.0 1.1396521739130436e-05 8.720816635160681e-07
699 705 298474.1648226378 -22839.76217773229 0.0 0 0 96830.0 3.330869565217391e-06 2.5488393194706996e-07
702 706 17372.318278806368 -2778.0892769946217 0.0 0 0 96830.0 5.6127508506616256e-05 8.975614366729678e-06
702 707 987968.6719319741 -157990.72578869518 0.0 0 0 96830.0 9.869391304347825e-07 1.5782608695652172e-07
703 708 46667.42676652574 -3571.0726569167523 0.0 0 0 96830.0 2.1303478260869566e-05 1.6301792060491493e-06
704 709 11642.323651160754 -890.890853306214 0.0 0 0 96830.0 8.539347826086957e-05 6.534457466918714e-06
705 710 494840.95667645446 -37866.090597850416 0.0 0 0 96830.0 2.0090869565217393e-06 1.5373882797731567e-07
706 711 14659.20327350448 -2344.2222718823796 0.0 0 0 96830.0 6.651554820415878e-05 1.0636814744801511e-05
706 712 11593.036791250399 -887.1193370695958 0.0 0 0 96830.0 8.575652173913043e-05 6.562238185255198e-06
707 713 1050035.0635809372 -167916.05494364665 0.0 0 0 96830.0 9.286022684310018e-07 1.4849716446124763e-07
708 714 489963.4825486358 -37492.857795026044 0.0 0 0 96830.0 2.029086956521739e-06 1.5526926275992438e-07
709 715 14191.531895771781 -1085.9607015894928 0.0 0 0 96830.0 7.005434782608696e-05 5.360680529300567e-06
710 716 489596.3036798192 -37464.76062941225 0.0 0 0 96830.0 2.0306086956521743e-06 1.553857088846881e-07
711 717 14203.150109702112 -2271.2926614662224 0.0 0 0 96830.0 6.86513156899811e-05 1.097835538752363e-05
712 718 108293.18383643041 -8286.782763135545 0.0 0 0 96830.0 9.180434782608696e-06 7.025028355387524e-07
713 719 1133821.3665924468 -181314.7174721397 0.0 0 0 96830.0 8.599810964083176e-07 1.3752362948960303e-07
714 720 619534.9517607675 -47407.89196082394 0.0 0 0 96830.0 1.6047173913043478e-06 1.2279576559546313e-07
715 721 44791.58818229635 -3427.5302261235465 0.0 0 0 96830.0 2.2195652173913042e-05 1.6984499054820414e-06
716 722 548130.973764872 -41943.93538374672 0.0 0 0 96830.0 1.8137608695652174e-06 1.387921361058601e-07
717 723 33803.80284600195 -5405.725401812679 0.0 0 0 96830.0 2.8844829867674857e-05 4.612712665406427e-06
717 724 4892.453761339883 -374.37907043296497 0.0 0 0 96830.0 0.00020320652173913046 1.5549716446124764e-05
718 725 283628.2035110678 -21703.7233991078 0.0 0 0 96830.0 3.5052173913043474e-06 2.6822533081285444e-07
719 726 1001919.2179964228 -160221.62334697595 0.0 0 0 96830.0 9.731971644612477e-07 1.5562854442344046e-07
720 727 637880.5971786282 -48811.73265366894 0.0 0 0 96830.0 1.5585652173913042e-06 1.1926412098298675e-07
721 728 49201.402418664606 -3764.976880732597 0.0 0 0 96830.0 2.0206304347826088e-05 1.5462215500945182e-06
722 729 486512.8886608996 -37228.81234970362 0.0 0 0 96830.0 2.043478260869565e-06 1.5637051039697542e-07
723 730 24876.876851270605 -3978.178600949457 0.0 0 0 96830.0 3.919563327032136e-05 6.2679584120982985e-06
724 731 36471.976660120075 -2790.8990835570144 0.0 0 0 96830.0 2.7258695652173916e-05 2.085882797731569e-06
725 732 268129.7580565465 -20517.755399109643 0.0 0 0 96830.0 3.7078260869565216e-06 2.8372930056710774e-07
726 733 1223516.4765373666 -195658.2851605597 0.0 0 0 96830.0 7.969365028355387e-07 1.2744187145557656e-07
727 734 595533.539094236 -45571.2621219937 0.0 0 0 96830.0 1.669391304347826e-06 1.277447258979206e-07
728 735 90335.23265999915 -6912.609107895588 0.0 0 0 96830.0 1.1005434782608695e-05 8.421550094517959e-07
729 736 607228.6528769875 -46466.19256797817 0.0 0 0 96830.0 1.637239130434783e-06 1.2528438563327033e-07
730 737 21247.78743831598 -3397.8338120974386 0.0 0 0 96830.0 4.589018714555765e-05 7.33851606805293e-06
731 738 69420.60435982903 -5312.185377099961 0.0 0 0 96830.0 1.4321086956521738e-05 1.0958744801512288e-06
732 739 323081.67809342686 -24722.771888888314 0.0 0 0 96830.0 3.0771739130434783e-06 2.3547069943289225e-07
733 740 799220.060747528 -127807.04596175818 0.0 0 0 96830.0 1.220020604914934e-06 1.950992438563327e-07
734 741 644115.6554102051 -49288.85015312874 0.0 0 0 96830.0 1.5434782608695651e-06 1.1810964083175803e-07
735 742 113108.95215206906 -8655.29372989746 0.0 0 0 96830.0 8.789565217391305e-06 6.725928166351607e-07
736 743 506234.4919538241 -38737.943732118714 0.0 0 0 96830.0 1.9638695652173914e-06 1.502787145557656e-07
737 744 26461.833540124957 -4231.636493623394 0.0 0 0 96830.0 3.684797353497164e-05 5.892533081285444e-06
738 745 12232.115851532502 -936.022778204226 0.0 0 0 96830.0 8.127608695652175e-05 6.219387523629489e-06
738 746 374792.7514679935 -28679.793155811672 0.0 0 0 96830.0 2.652608695652174e-06 2.0298223062381853e-07
739 747 272816.3904678433 -20876.384661887136 0.0 0 0 96830.0 3.644130434782609e-06 2.7885519848771267e-07
740 748 669511.6123422862 -107064.75677115451 0.0 0 0 96830.0 1.4563824196597351e-06 2.328969754253308e-07
741 749 683488.4402051198 -52301.724120043946 0.0 0 0 96830.0 1.4545652173913044e-06 1.1130586011342155e-07
742 750 132645.56525835936 -10150.269341509238 0.0 0 0 96830.0 7.495000000000001e-06 5.735304347826087e-07
743 751 469771.0481163283 -35947.6975949886 0.0 0 0 96830.0 2.1163043478260873e-06 1.6194328922495276e-07
744 752 71258.69674709559 -11395.31397874663 0.0 0 0 96830.0 1.368345179584121e-05 2.188185255198488e-06
744 753 7721.514095619322 -590.8636873169568 0.0 0 0 96830.0 0.00012875434782608696 9.852506616257088e-06
745 754 15047.945620125884 -1151.4949691922413 0.0 0 0 96830.0 6.606739130434783e-05 5.0555916824196595e-06
746 755 518282.50338997453 -39659.87852027631 0.0 0 0 96830.0 1.9182173913043476e-06 1.4678533081285443e-07
747 756 279741.93500198534 -21406.339374064966 0.0 0 0 96830.0 3.553913043478261e-06 2.71951606805293e-07
748 757 883095.1707039294 -141219.91002728086 0.0 0 0 96830.0 1.1041448015122872e-06 1.7656899810964084e-07
749 758 491432.4410763555 -37605.26505627764 0.0 0 0 96830.0 2.0230217391304347e-06 1.548051417769376e-07
750 759 113033.46976970407 -8649.517686725181 0.0 0 0 96830.0 8.795434782608696e-06 6.73041965973535e-07
751 760 257486.69294591842 -19703.32954716593 0.0 0 0 96830.0 3.861086956521739e-06 2.954570888468809e-07
752 761 51685.075689396755 -8265.204001502678 0.0 0 0 96830.0 1.886550283553875e-05 3.016871455576559e-06
753 762 9237.710890422286 -706.8857029192704 0.0 0 0 96830.0 0.00010762173913043479 8.235402646502835e-06
755 763 614143.712269181 -46995.344938859074 0.0 0 0 96830.0 1.618804347826087e-06 1.2387372400756143e-07
756 764 203480.36277697247 -15570.671238585719 0.0 0 0 96830.0 4.8858695652173916e-06 3.7387523629489604e-07
757 765 903925.968270464 -144551.0610240614 0.0 0 0 96830.0 1.0787e-06 1.725e-07
758 766 401019.0418635966 -30686.674507823045 0.0 0 0 96830.0 2.479130434782609e-06 1.8970737240075616e-07
759 767 123704.21578653618 -9466.061729752333 0.0 0 0 96830.0 8.036739130434784e-06 6.149852551984878e-07
760 768 34416.17364097273 -2633.5854612222606 0.0 0 0 96830.0 2.8886956521739132e-05 2.210480151228733e-06
761 769 21009.928469533563 -3359.7966635714656 0.0 0 0 96830.0 4.6409722117202266e-05 7.4215973534971646e-06
762 770 12700.922468998962 -971.8966758886162 0.0 0 0 96830.0 7.827608695652174e-05 5.989822306238185e-06
762 771 350760.94135699165 -26840.837251665445 0.0 0 0 96830.0 2.8343478260869566e-06 2.1688922495274101e-07
763 772 363588.8975522704 -27822.45476921721 0.0 0 0 96830.0 2.7343478260869567e-06 2.0923705103969756e-07
764 773 147914.5207779435 -11318.676372573069 0.0 0 0 96830.0 6.721304347826087e-06 5.14325897920605e-07
765 774 1386718.8571361408 -221756.74687678154 0.0 0 0 96830.0 7.031453686200379e-07 1.1244328922495275e-07
766 775 84607.80643477496 -6474.336492400171 0.0 0 0 96830.0 1.1750434782608697e-05 8.991637051039699e-07
767 776 79738.13319987546 -6101.70062746873 0.0 0 0 96830.0 1.246804347826087e-05 9.54076370510397e-07
768 777 11230.620941068386 -859.3866459252332 0.0 0 0 96830.0 8.852391304347825e-05 6.774003780718336e-06
769 778 25921.719750982218 -4145.264352502488 0.0 0 0 96830.0 3.7615750472589785e-05 6.0153119092627595e-06
770 779 12961.542820657134 -991.839798450285 0.0 0 0 96830.0 7.670217391304348e-05 5.869383742911153e-06
771 780 366855.53934000136 -28072.42387993054 0.0 0 0 96830.0 2.71e-06 2.0737391304347827e-07
772 781 259635.58268493574 -19867.766327195084 0.0 0 0 96830.0 3.829130434782608e-06 2.930117202268431e-07
773 782 139768.3726593049 -10695.318951320722 0.0 0 0 96830.0 7.11304347826087e-06 5.443024574669187e-07
774 783 1133821.3665924468 -181314.7174721397 0.0 0 0 96830.0 8.599810964083176e-07 1.3752362948960303e-07
775 784 9895.320134612379 -757.2071059529474 0.0 0 0 96830.0 0.0001004695652173913 7.688105860113422e-06
776 785 39495.821343919655 -3022.288937621678 0.0 0 0 96830.0 2.517173913043478e-05 1.9261852551984876e-06
778 786 33174.67198343006 -5305.118121017599 0.0 0 0 96830.0 2.939184877126654e-05 4.700189035916823e-06
780 787 340294.7506073708 -26039.94613343359 0.0 0 0 96830.0 2.921521739130435e-06 2.2355992438563328e-07
781 788 349902.1540483899 -26775.121353268092 0.0 0 0 96830.0 2.8413043478260875e-06 2.1742155009451798e-07
782 789 210408.1506055881 -16100.797611558044 0.0 0 0 96830.0 4.725e-06 3.6156521739130433e-07
783 790 1195650.032173719 -191202.03073140496 0.0 0 0 96830.0 8.155103213610585e-07 1.3041209829867674e-07
785 791 132219.87838014503 -10117.695041263272 0.0 0 0 96830.0 7.519130434782609e-06 5.753769376181475e-07
785 792 22178.570094143826 -1697.1427550301362 0.0 0 0 96830.0 4.4826086956521737e-05 3.4301701323251415e-06
786 793 36705.494296120996 -5869.748554816791 0.0 0 0 96830.0 2.656455009451796e-05 4.248062381852552e-06
787 794 381101.76278437144 -29162.56967393451 0.0 0 0 96830.0 2.608695652173913e-06 1.996219281663516e-07
788 795 211224.47708708403 -16163.264333620345 0.0 0 0 96830.0 4.7067391304347825e-06 3.601678638941399e-07
789 796 206736.63728640007 -15819.847027133223 0.0 0 0 96830.0 4.808913043478261e-06 3.6798638941398866e-07
790 797 1199274.5573841117 -191781.64563711808 0.0 0 0 96830.0 8.130456332703213e-07 1.3001795841209828e-07
791 798 151611.89342966638 -11601.605758096212 0.0 0 0 96830.0 6.557391304347826e-06 5.017829867674859e-07
792 799 13860.345971851664 -1060.6177787156055 0.0 0 0 96830.0 7.172826086956522e-05 5.488771266540643e-06
793 800 222487.04224823433 -17025.095406821412 0.0 0 0 96830.0 4.468478260869565e-06 3.419357277882798e-07
793 801 55668.48795460828 -12793.379219382026 0.0 0 0 96830.0 1.7062347826086957e-05 3.9211606805293e-06
794 802 345096.676230943 -26407.397833324332 0.0 0 0 96830.0 2.8808695652173913e-06 2.2044914933837429e-07
795 803 30431.335862473094 -2328.65874425881 0.0 0 0 96830.0 3.2669565217391305e-05 2.499931947069943e-06
796 804 432374.1281471548 -33086.020240825754 0.0 0 0 96830.0 2.2993478260869566e-06 1.759500945179584e-07
797 805 893352.8759602578 -142860.2680107022 0.0 0 0 96830.0 1.091466729678639e-06 1.745415879017013e-07
798 806 183317.47919238615 -14027.77232080868 0.0 0 0 96830.0 5.423260869565217e-06 4.149973534971645e-07
799 807 16222.273610061568 -1241.356589291668 0.0 0 0 96830.0 6.128478260869565e-05 4.689618147448016e-06
800 808 221904.07848088007 -16980.486005493432 0.0 0 0 96830.0 4.480217391304347e-06 3.4283402646502834e-07
801 809 35767.23553919391 -5719.707175777278 0.0 0 0 96830.0 2.7261400756143665e-05 4.3594990548204155e-06
801 810 35767.23553919391 -5719.707175777278 0.0 0 0 96830.0 2.7261400756143665e-05 4.3594990548204155e-06
802 811 535255.2848095103 -40958.66527237993 0.0 0 0 96830.0 1.8573913043478262e-06 1.4213081285444236e-07
803 812 13776.83733517836 -1054.2275526049527 0.0 0 0 96830.0 7.216304347826087e-05 5.522041587901701e-06
804 813 271827.2202456286 -20800.691636187235 0.0 0 0 96830.0 3.657391304347826e-06 2.7986994328922494e-07
805 814 261323.65289993666 -41789.49673239925 0.0 0 0 96830.0 3.731254064272212e-06 5.966824196597353e-07
806 815 235733.049144972 -18038.702891093508 0.0 0 0 96830.0 4.217391304347826e-06 3.227221172022684e-07
807 816 28663.24759268227 -2193.3615549182955 0.0 0 0 96830.0 3.468478260869565e-05 2.6541398865784496e-06
808 817 221474.21925577303 -16947.592430006982 0.0 0 0 96830.0 4.4889130434782605e-06 3.4349943289224955e-07
809 818 42657.92900452539 -6821.630437823888 0.0 0 0 96830.0 2.2857765595463136e-05 3.655293005671077e-06
809 819 42657.92900452539 -6821.630437823888 0.0 0 0 96830.0 2.2857765595463136e-05 3.655293005671077e-06
811 820 348489.00048864254 -26666.98438521786 0.0 0 0 96830.0 2.852826086956522e-06 2.1830321361058603e-07
813 821 289554.3341403354 -22157.20122117349 0.0 0 0 96830.0 3.433478260869565e-06 2.6273572778827977e-07
814 822 226060.45622796522 -36150.39278698804 0.0 0 0 96830.0 4.31329281663516e-06 6.897589792060491e-07
815 823 231778.4782024457 -17736.092245056716 0.0 0 0 96830.0 4.289347826086957e-06 3.282283553875237e-07
817 824 222823.09264336663 -17050.8105674924 0.0 0 0 96830.0 4.461739130434782e-06 3.4142003780718335e-07
818 825 39682.72508008924 -6345.851558649666 0.0 0 0 96830.0 2.4571521739130434e-05 3.929347826086957e-06
818 826 39682.72508008924 -6345.851558649666 0.0 0 0 96830.0 2.4571521739130434e-05 3.929347826086957e-06
820 827 42368.17818614469 -3242.0866785919407 0.0 0 0 96830.0 2.3465217391304346e-05 1.7955992438563326e-06
821 828 202650.82436355992 -15507.193516515892 0.0 0 0 96830.0 4.905869565217391e-06 3.7540567107750475e-07
822 829 221471.7826767904 -35416.596376885456 0.0 0 0 96830.0 4.402659924385633e-06 7.040500945179583e-07
823 830 267080.6023134063 -20437.47217702587 0.0 0 0 96830.0 3.7223913043478264e-06 2.8484385633270317e-07
824 831 221979.475459298 -16986.255513407155 0.0 0 0 96830.0 4.478695652173913e-06 3.4271758034026467e-07
825 832 48332.53023927372 -7729.0826608646685 0.0 0 0 96830.0 2.0174092627599242e-05 3.226134215500945e-06
825 833 48332.53023927372 -7729.0826608646685 0.0 0 0 96830.0 2.0174092627599242e-05 3.226134215500945e-06
827 834 12293.274786732765 -940.702766289116 0.0 0 0 96830.0 8.087173913043479e-05 6.188446124763705e-06
828 835 19198.275275649456 -1469.0854123975234 0.0 0 0 96830.0 5.1784782608695653e-05 3.962661625708885e-06
830 836 371867.06402768387 -28455.914464727113 0.0 0 0 96830.0 2.6734782608695655e-06 2.0457920604914935e-07
831 837 222130.42322772762 -16997.80629916524 0.0 0 0 96830.0 4.475652173913044e-06 3.4248468809073723e-07
832 838 45018.6952760816 -7199.151696601534 0.0 0 0 96830.0 2.1659111531190927e-05 3.463610586011342e-06
832 839 45018.6952760816 -7199.151696601534 0.0 0 0 96830.0 2.1659111531190927e-05 3.463610586011342e-06
835 840 47998.710651067995 -3672.9448150382473 0.0 0 0 96830.0 2.0712608695652172e-05 1.5849648393194707e-06
836 841 320298.44189749664 -24509.79381476496 0.0 0 0 96830.0 3.1039130434782607e-06 2.3751682419659735e-07
837 842 221990.2506389232 -16987.080048891512 0.0 0 0 96830.0 4.478478260869566e-06 3.427009451795841e-07
838 843 8710.96379778178 -589.0468757449892 0.0 0 0 96830.0 0.00011427531947069942 7.727448015122873e-06
838 844 30371.3334141907 -4856.823040648833 0.0 0 0 96830.0 3.210477882797731e-05 5.134026465028355e-06
838 845 30371.3334141907 -4856.823040648833 0.0 0 0 96830.0 3.210477882797731e-05 5.134026465028355e-06
840 846 94523.19361358474 -7233.079163474311 0.0 0 0 96830.0 1.0517826086956522e-05 8.048423440453687e-07
841 847 212609.0726830524 -16269.215996616185 0.0 0 0 96830.0 4.676086956521739e-06 3.578223062381853e-07
842 848 454775.3732510399 -34800.202474862184 0.0 0 0 96830.0 2.186086956521739e-06 1.6728317580340263e-07
843 849 59540.60133071651 -4026.214091575898 0.0 0 0 96830.0 1.6718812854442344e-05 1.1305482041587903e-06
844 850 25201.80397787978 -4030.1392288720335 0.0 0 0 96830.0 3.869028355387523e-05 6.187145557655955e-06
844 851 25201.80397787978 -4030.1392288720335 0.0 0 0 96830.0 3.869028355387523e-05 6.187145557655955e-06
846 852 427164.3147218809 -32687.35625697871 0.0 0 0 96830.0 2.327391304347826e-06 1.780960302457467e-07
847 853 130131.78025246724 -9957.910141058364 0.0 0 0 96830.0 7.639782608695652e-06 5.846094517958413e-07
848 854 20234.596493130644 -1548.3865142569534 0.0 0 0 96830.0 4.9132608695652174e-05 3.759712665406427e-06
849 855 21134.48042391895 -1429.1414765577654 0.0 0 0 96830.0 4.710066918714555e-05 3.1850094517958417e-06
850 856 16027.261706979984 -2562.9949424808074 0.0 0 0 96830.0 6.083789981096408e-05 9.728875236294895e-06
850 857 16027.261706979984 -2562.9949424808074 0.0 0 0 96830.0 6.083789981096408e-05 9.728875236294895e-06
852 858 542397.100564841 -41505.169434526964 0.0 0 0 96830.0 1.8329347826086957e-06 1.402593572778828e-07
853 859 16217.096288696655 -1240.9604116567878 0.0 0 0 96830.0 6.130434782608695e-05 4.691115311909263e-06
853 860 6090.238714909186 -466.03565818435493 0.0 0 0 96830.0 0.0001632413043478261 1.2491508506616256e-05
854 861 31116.69832899542 -2381.1038721318228 0.0 0 0 96830.0 3.1950000000000004e-05 2.444869565217391e-06
855 862 17998.267355341184 -1217.0666071630874 0.0 0 0 96830.0 5.530799999999999e-05 3.74e-06
856 863 39436.557859820474 -6306.485798478754 0.0 0 0 96830.0 2.4724899810964084e-05 3.953875236294896e-06
856 864 39436.557859820474 -6306.485798478754 0.0 0 0 96830.0 2.4724899810964084e-05 3.953875236294896e-06
858 865 506234.4919538241 -38737.943732118714 0.0 0 0 96830.0 1.9638695652173914e-06 1.502787145557656e-07
861 866 35578.19475192513 -2722.5053375386187 0.0 0 0 96830.0 2.7943478260869567e-05 2.1382835538752365e-06
862 867 138745.33714079665 -9382.142925193091 0.0 0 0 96830.0 7.174642344045368e-06 4.851587901701324e-07
863 868 63305.51577704906 -10123.4833332168 0.0 0 0 96830.0 1.540252741020794e-05 2.4630907372400753e-06
863 869 63305.51577704906 -10123.4833332168 0.0 0 0 96830.0 1.540252741020794e-05 2.4630907372400753e-06
865 870 632735.331213589 -48418.007953735505 0.0 0 0 96830.0 1.5712391304347826e-06 1.2023395085066163e-07
866 871 33918.424337406046 -2595.496818862375 0.0 0 0 96830.0 2.931086956521739e-05 2.2429187145557655e-06
867 872 110383.5557975657 -7464.281816064507 0.0 0 0 96830.0 9.01808393194707e-06 6.098147448015124e-07
867 873 49613.05450833399 -3354.9002650822517 0.0 0 0 96830.0 2.0064238752362945e-05 1.3567703213610587e-06
868 874 91650.5604662228 -14656.272995664627 0.0 0 0 96830.0 1.0638941398865783e-05 1.7013232514177692e-06
868 875 91650.5604662228 -14656.272995664627 0.0 0 0 96830.0 1.0638941398865783e-05 1.7013232514177692e-06
870 876 651660.2287629253 -49866.17402707601 0.0 0 0 96830.0 1.525608695652174e-06 1.1674223062381852e-07
871 877 19864.569339816073 -1520.0713929598387 0.0 0 0 96830.0 5.004782608695652e-05 3.8297466918714555e-06
872 878 119291.43771368566 -8066.6445550225 0.0 0 0 96830.0 8.344674102079395e-06 5.642778827977316e-07
873 879 21199.72020459093 -1433.5530766827599 0.0 0 0 96830.0 4.6955722117202264e-05 3.1752079395085067e-06
874 880 108762.53219884033 -17392.729029665297 0.0 0 0 96830.0 8.965081285444235e-06 1.433648393194707e-06
874 881 108762.53219884033 -17392.729029665297 0.0 0 0 96830.0 8.965081285444235e-06 1.433648393194707e-06
876 882 653317.3076303509 -49992.97658388772 0.0 0 0 96830.0 1.5217391304347827e-06 1.1644612476370511e-07
877 883 80987.83653418675 -6197.330100007333 0.0 0 0 96830.0 1.2275652173913042e-05 9.393542533081285e-07
878 884 78450.87471215756 -5304.951750623225 0.0 0 0 96830.0 1.2688809073724007e-05 8.580340264650285e-07
879 885 8936.361077730355 -604.2885374757997 0.0 0 0 96830.0 0.00011139301134215501 7.532542533081286e-06
882 886 661051.6114847221 -50584.818965787425 0.0 0 0 96830.0 1.503934782608696e-06 1.1508370510396976e-07
883 887 73414.68790092718 -5617.8195958970355 0.0 0 0 96830.0 1.354195652173913e-05 1.0362540642722118e-06
883 888 19087.74652825728 -2023.125208064136 0.0 0 0 96830.0 5.180762192816635e-05 5.491130434782608e-06
884 889 62078.99337061502 -4197.863513526076 0.0 0 0 96830.0 1.6035185444234406e-05 1.084320415879017e-06
886 890 36967.27146885827 -2828.7999037039376 0.0 0 0 96830.0 2.6893478260869565e-05 2.05793572778828e-06
887 891 44712.76059261298 -3421.4982018695146 0.0 0 0 96830.0 2.2234782608695653e-05 1.7014442344045367e-06
888 892 22505.564393113837 -2385.3824011134484 0.0 0 0 96830.0 4.39398336483932e-05 4.657217391304348e-06
889 893 15946.392256211086 -1078.3161032441867 0.0 0 0 96830.0 6.242466351606804e-05 4.221238185255199e-06
890 894 7851.158223166847 -600.7842814249414 0.0 0 0 96830.0 0.00012662826086956523 9.689814744801513e-06
890 895 14033.882080008767 -1073.8970635137146 0.0 0 0 96830.0 7.084130434782608e-05 5.420899810964084e-06
891 896 226139.60111815538 -17304.595563824063 0.0 0 0 96830.0 4.396304347826087e-06 3.3641285444234407e-07
892 897 13389.835789451132 -1419.1991850570325 0.0 0 0 96830.0 7.385383742911153e-05 7.827826086956522e-06
893 898 8778.318021979367 -593.6014573335293 0.0 0 0 96830.0 0.00011339850850661625 7.668156899810966e-06
894 899 11821.996570707415 -904.6397375845675 0.0 0 0 96830.0 8.409565217391305e-05 6.435145557655955e-06
896 900 267627.64240475517 -20479.332636189964 0.0 0 0 96830.0 3.7147826086956525e-06 2.8426162570888473e-07
900 901 317584.8023203095 -24302.141394945418 0.0 0 0 96830.0 3.1304347826086955e-06 2.395463137996219e-07
901 902 244139.5021040175 -18681.979291437856 0.0 0 0 96830.0 4.0721739130434785e-06 3.116098298676748e-07
902 903 134895.32043573997 -10322.424520300101 0.0 0 0 96830.0 7.370000000000001e-06 5.639652173913044e-07
903 904 77802.33333467942 -5953.569855175469 0.0 0 0 96830.0 1.2778260869565218e-05 9.778147448015122e-07
904 905 9498.45505101555 -726.8382995559724 0.0 0 0 96830.0 0.00010466739130434783 8.009330812854443e-06
