1 0 0.259738031377188 -0.00998483991246335
0.999999999894349 -0.00725168102563249 0.3927 0.192989819963578
0.983138288981402 -0.0265652016350453 -0.024 -0.012
0.980092995223495 -0.0313239067144895 -0.076 -0.016
0.982406196652677 -0.0325298422630214 -0 -0
0.973184020986937 -0.0395658584947453 -0 -0
0.967355447549853 -0.0462832827888145 -0.228 -0.109
0.960623708125338 -0.0475736513162021 -0.3 -0.3
0.980506116823456 -0.0523063500024377 -0 -0
0.984404295520718 -0.0589037443467686 -0.058 -0.02
0.980506116823456 -0.0523063500024377 -0 -0
0.985468316748769 -0.0268241674179459 -0.112 -0.075
0.999999999701219 0.0257639091072406 0.37 0.113528772207398
0.976676833787039 -0.0402828175053781 -0.062 -0.016
0.980229028632012 -0.0403491393669341 -0.082 -0.025
0.977395654900811 -0.0461549913921951 -0.035 -0.018
0.976865409616945 -0.0592074887187038 -0.09 -0.058
0.968440328812094 -0.0607093184070292 -0.032 -0.009
0.965287039352965 -0.0690837043906456 -0.095 -0.034
0.969166350495127 -0.0675621199944362 -0.022 -0.007
0.993383296469914 -0.0608839491180912 -0.175 -0.112
0.999999999701567 -0.0592142919835965 0.2159 0.395699678516211
0.999999999689884 -0.0277372598195448 0.16 0.0635095249380918
0.988566295891874 -0.0459276668261828 -0.087 -0.067
0.990214836612054 -0.0294958704650505 -0 -0
0.97219414950671 -0.0373386312997705 -0.035 -0.023
0.999999999722174 -0.0144589938200654 0.2691 0.105405100905398
0.974714899565125 -0.0395479151308918 -0 -0
0.979596704382191 -0.0371493013458709 -0.024 -0.009
0.967882878900034 -0.0530846007815837 -0.106 -0.019
