0 0 0.94 1.06 1.04 0
0 0 0.94 1.06 1.01 -0.0205948851735331
0 0 0.94 1.06 0.985 -0.104196156344061
0 0 0.94 1.06 0.981 -0.127758101245985
0 0 0.94 1.06 0.976 -0.148702052269917
0 0 0.94 1.06 0.98 -0.150970980297509
0 0 0.94 1.06 0.984 -0.13229595730117
0 0 0.94 1.06 1.005 -0.0776671517137477
0 0 0.94 1.06 0.98 -0.166853476490658
0 0 0.94 1.06 0.986 -0.199491133502952
0 0 0.94 1.06 0.974 -0.177499984927823
0 0 0.94 1.06 1.015 -0.182561439758607
0 0 0.94 1.06 0.979 -0.170867733770245
0 0 0.94 1.06 0.97 -0.162839219211071
0 0 0.94 1.06 0.988 -0.125314640293193
0 0 0.94 1.06 1.013 -0.154461638801498
0 0 0.94 1.06 1.017 -0.0940732466824944
0 10 0.94 1.06 1.001 -0.204378055408536
0 0 0.94 1.06 0.97 -0.230383461263251
0 0 0.94 1.06 0.964 -0.23404865269244
0 0 0.94 1.06 1.008 -0.224972940582069
0 0 0.94 1.06 1.01 -0.224100275956072
0 0 0.94 1.06 1.008 -0.225322006432468
0 0 0.94 1.06 0.999 -0.231256125889249
0 5.9 0.94 1.06 0.982 -0.316428193386572
0 0 0.94 1.06 0.959 -0.226020138133266
0 0 0.94 1.06 0.982 -0.200363798128949
0 0 0.94 1.06 0.997 -0.182386906833407
0 0 0.94 1.06 1.01 -0.170169602069447
0 0 0.94 1.06 0.962 -0.326027504272541
0 0 0.94 1.06 0.936 -0.337546677335703
0 0 0.94 1.06 0.949 -0.322187779918153
0 0 0.94 1.06 0.947 -0.322885911618951
0 0 0.94 1.06 0.959 -0.2460914245312
0 0 0.94 1.06 0.966 -0.241902634326414
0 0 0.94 1.06 0.976 -0.237190245346029
0 0 0.94 1.06 0.985 -0.23404865269244
0 0 0.94 1.06 1.013 -0.221831347928479
0 0 0.94 1.06 0.983 -0.234921317318437
0 0 0.94 1.06 0.973 -0.237713844121628
0 0 0.94 1.06 0.996 -0.245218759905203
0 0 0.94 1.06 0.966 -0.270526034059121
0 0 0.94 1.06 1.01 -0.197745804250958
0 0 0.94 1.06 1.017 -0.206996049286527
0 0 0.94 1.06 1.036 -0.161442955809475
0 0 0.94 1.06 1.05 -0.207519648062126
0 0 0.94 1.06 1.033 -0.217991623574092
0 0 0.94 1.06 1.027 -0.219736952826086
0 0 0.94 1.06 1.036 -0.225496539357667
0 0 0.94 1.06 1.023 -0.233699586842041
0 0 0.94 1.06 1.052 -0.21851522234969
0 0 0.94 1.06 0.98 -0.20018926520375
0 6.3 0.94 1.06 0.971 -0.213453767518907
0 0 0.94 1.06 0.996 -0.204028989558137
0 0 0.94 1.06 1.031 -0.188146493364989
0 0 0.94 1.06 0.968 -0.27995081201989
0 0 0.94 1.06 0.965 -0.289026524130261
