31 266 278.810408921933 -2137.54646840149 0 1.0082 0 0 6e-05 0.00046
266 270 62.7431296273058 -272.93261387878 0 0 0 0 0.0008 0.00348
266 271 0.127425083435413 -2.28215764437299 0 0.9668 0 0 0.02439 0.43682
266 273 0.0857775074702765 -1.53608959155795 0 0.9796 0 0 0.03624 0.64898
270 292 0.112098522126614 -2.66294372651348 0 1.0435 0 0 0.01578 0.37486
270 293 0.112098522126614 -2.66294372651348 0 0.9391 0 0 0.01578 0.37486
270 294 0.110477842737646 -2.62374532134612 0 1.0435 0 0 0.01602 0.38046
270 295 0 -6.57894736842105 0 1.0435 0 0 0 0.152
270 296 0 -1.25 0 1.0435 0 0 0 0.8
271 272 0.869384422645841 -3.85826487387231 0 0 0 0 0.05558 0.24666
271 268 0.434762861307236 -1.92909889134813 0 0 0 0 0.11118 0.49332
271 268 0.434762861307236 -1.92909889134813 0 0 0 0 0.11118 0.49332
273 267 0.394559881652328 -2.24073983694603 0 0 0 0 0.07622 0.43286
273 267 0.394559881652328 -2.24073983694603 0 0 0 0 0.07622 0.43286
267 274 6.86686928150911 -8.98447366329292 0 0 0 0 0.0537 0.07026
274 276 0.518943216509505 -0.446728151270262 0 0 0 0 1.1068 0.95278
274 275 0.0546208879056061 -0.346606986817831 0 1 0 0 0.44364 2.8152
267 277 0.0477528280629473 -0.303014221108818 0 1 0 0 0.50748 3.2202
276 278 0.0416803518488582 -0.246502080871966 0 1 0 0 0.66688 3.944
276 279 0.0454722671824439 -0.268920890426912 0 1 0 0 0.6113 3.6152
272 297 0.0490409685138664 -0.329770501783633 0 1 0 0 0.4412 2.9668
272 298 0.0711778696464651 -0.475489990461089 0 1 0 0 0.30792 2.057
272 268 0.872491256933984 -3.85678662070495 0 0 0 0 0.0558 0.24666
268 280 0.0329108043252054 -0.208836312698233 0 1 0 0 0.73633 4.6724
268 281 0.031481425972393 -0.199763793947298 0 1 0 0 0.76978 4.8846
268 282 0.0319985465971806 -0.203047873458262 0 1 0 0 0.75732 4.8056
268 291 7.78411371482341 -6.70163869836789 0 0 0 0 0.07378 0.06352
291 269 16.6179086587457 -12.5501637939483 0 0 0 0 0.03832 0.02894
269 288 0.0593805265352981 -0.398313686487934 0 1 0 0 0.36614 2.456
269 289 0.0343216848333319 -0.176698518273444 0 1 0 0 1.0593 5.4536
269 290 0.053802293395717 -0.583481923399371 0 1 0 0 0.1567 1.6994
268 283 0.0666170498344801 -0.712576039748798 0 1 0 0 0.13006 1.3912
268 284 0.0444800662849739 -0.282241548271808 0 1 0 0 0.54484 3.4572
268 285 0.0546557950970379 -0.592724488641479 0 1 0 0 0.15426 1.6729
268 286 0.0569444618178396 -0.380399065279369 0 1 0 0 0.3849 2.5712
268 287 0.0490409685138664 -0.329770501783633 0 1 0 0 0.4412 2.9668
273 299 0.227273911575858 -0.955685254196105 0 0 0 0 0.23552 0.99036
294 300 0 -1.33333333333333 0 0.9583 0 0 0 0.75
257 5 27.027027027027 -162.162162162162 0 0 0 0 0.001 0.006
2 6 12.1951219512195 -109.756097560976 0 0 0 0 0.001 0.009
2 8 7.84313725490196 -35.2941176470588 0.027 0 0 0 0.006 0.027
3 7 0 -333.333333333333 0 0 0 0 0 0.003
3 18 1.6580310880829 -14.300518134715 0.0695 0 0 0 0.008 0.069
3 129 20 -140 0 0 0 0 0.001 0.007
4 16 5.47945205479452 -52.0547945205479 0.5635 0 0 0 0.002 0.019
5 9 6.84150513112885 -33.0672748004561 0.009 0 0 0 0.006 0.029
7 12 12.1951219512195 -109.756097560976 0.035 0 0 0 0.001 0.009
7 110 20 -140 0.007 0 0 0 0.001 0.007
8 11 3.50475163442744 -16.0409786344948 0.0165 0 0 0 0.013 0.0595
8 14 6.72529746508019 -21.7278841179514 0.0405 0 0 0 0.013 0.042
9 11 7.84313725490196 -35.2941176470588 0.0065 0 0 0 0.006 0.027
11 13 6.55737704918033 -27.8688524590164 0.009 0 0 0 0.008 0.034
12 20 8.73362445414847 -65.5021834061135 0.059 0 0 0 0.002 0.015
13 19 5.03355704697986 -28.5234899328859 0.008 0 0 0 0.006 0.034
14 15 7.14285714285714 -21.4285714285714 0.0485 0 0 0 0.014 0.042
15 31 0.988909005157541 -3.77306820429339 0.0605 0 0 0 0.065 0.248
15 74 1.38840193534815 -3.47801696935699 0.0175 0 0 0 0.099 0.248
15 75 0.680923502500266 -2.57474199382913 0.024 0 0 0 0.096 0.363
16 36 4.09836065573771 -45.0819672131148 0.64 0 0 0 0.002 0.022
18 20 6.09756097560976 -54.8780487804878 0.018 0 0 0 0.002 0.018
18 72 1.97899223626123 -12.1784137616075 0.0755 0 0 0 0.013 0.08
19 21 11.8959107806691 -24.5353159851301 0.0075 0 0 0 0.016 0.033
19 26 1.75318240719567 -4.72596996722311 0.049 0 0 0 0.069 0.186
20 23 3.41296928327645 -29.0102389078498 0.14 0 0 0 0.004 0.034
21 22 3.46089850249584 -7.38768718801997 0.025 0 0 0 0.052 0.111
22 24 10.0956429330499 -20.7226354941552 0.009 0 0 0 0.019 0.039
23 231 1.49796704472502 -14.551679863043 0.067 0 0 0 0.007 0.068
24 25 5.68092157172164 -11.204039766451 0.017 0 0 0 0.036 0.071
25 26 2.73972602739726 -7.30593607305936 0.0325 0 0 0 0.045 0.12
25 232 2.29345565096805 -6.93370313083364 0.007 0 0 0 0.043 0.13
27 28 0 -15.8730158730159 0 0 0 0 0 0.063
27 32 16.6389351081531 -79.8668885191348 0.0065 0 0 0 0.0025 0.012
27 34 6.84150513112885 -33.0672748004561 0.01 0 0 0 0.006 0.029
27 35 3.68809272918862 -22.6554267650158 0.013 0 0 0 0.007 0.043
28 36 15.3846153846154 -123.076923076923 0.021 0 0 0 0.001 0.008
29 60 3.20512820512821 -16.025641025641 0.004 0 0 0 0.012 0.06
29 63 25.8620689655172 -60.3448275862069 0.001 0 0 0 0.006 0.014
29 64 10.6269925611052 -30.8182784272051 0.0015 0 0 0 0.01 0.029
30 73 5.36912751677852 -36.241610738255 0.0215 0 0 0 0.004 0.027
31 32 3.51957765068192 -20.6775186977563 0.004 0 0 0 0.008 0.047
31 34 4.80349344978166 -13.9737991266376 0.0035 0 0 0 0.022 0.064
31 35 7.16332378223496 -25.7879656160458 0.01 0 0 0 0.01 0.036
31 43 2.48175182481752 -11.8248175182482 0.024 0 0 0 0.017 0.081
31 74 1.36145221569674 -3.39028296849973 0.0165 0 0 0 0.102 0.254
31 75 2.56298396771731 -6.92550987021485 0.008 0 0 0 0.047 0.127
32 35 5.58269364968597 -25.8199581297976 0.01 0 0 0 0.008 0.037
32 37 3.72396136390085 -10.1245199581054 0.02 0 0 0 0.032 0.087
33 36 14.5208131655373 -154.888673765731 0.202 0 0 0 0.0006 0.0064
34 42 1.06592325352575 -6.31354542472942 0.011 0 0 0 0.026 0.154
35 36 0 -34.4827586206897 0 0 0 0 0 0.029
35 43 1.59681619417285 -4.69218297056945 0.01 0 0 0 0.065 0.191
35 44 3.49020490880432 -10.0202657059221 0.018 0 0 0 0.031 0.089
36 40 10 -70 0.403 0 0 0 0.002 0.014
37 38 4.43686006825939 -12.2866894197952 0.0175 0 0 0 0.026 0.072
37 42 1.22313921899342 -3.37328921448712 0.016 0 0 0 0.095 0.262
37 46 7.69230769230769 -23.0769230769231 0.008 0 0 0 0.013 0.039
38 41 3.46820809248555 -10.7899807321773 0.0195 0 0 0 0.027 0.084
38 47 3.57142857142857 -10.7142857142857 0.0185 0 0 0 0.028 0.084
39 52 4.04624277456647 -23.6994219653179 0.156 0 0 0 0.007 0.041
39 62 3.003003003003 -18.018018018018 0.2055 0 0 0 0.009 0.054
40 68 2.79485746226942 -23.4768026830632 0.345 0 0 0 0.005 0.042
41 61 2.19141135319651 -6.11066627333642 0.0365 0 0 0 0.052 0.145
41 92 2.72617764534331 -7.48113865466303 0.0065 0 0 0 0.043 0.118
42 87 5.59409263817409 -13.8733497426717 0.0035 0 0 0 0.025 0.062
43 44 3.16423394916811 -9.59477391038073 0.0215 0 0 0 0.031 0.094
44 45 2.79245283018868 -8.22641509433962 0.0245 0 0 0 0.037 0.109
45 48 3.78734745406088 -11.2217702342545 0.018 0 0 0 0.027 0.08
46 47 4.1988579106483 -12.260665099093 0.0175 0 0 0 0.025 0.073
47 48 2.95757985465608 -8.70373500084502 0.0235 0 0 0 0.035 0.103
48 49 1.98255352894528 -5.15463917525773 0.041 0 0 0 0.065 0.169
49 50 5.40159699389385 -9.39408172851104 0.018 0 0 0 0.046 0.08
49 55 0.506934481109517 -1.71209947393592 0.0355 0 0 0 0.159 0.537
50 51 11.889035667107 -34.3461030383091 0.0025 0 0 0 0.009 0.026
51 53 11.5606936416185 -75.1445086705202 0.0075 0 0 0 0.002 0.013
52 54 2.0901068276823 -15.0952159777055 0.2425 0 0 0 0.009 0.065
54 56 1.41831397925716 -9.3076854888751 0.1015 0 0 0 0.016 0.105
54 123 20 -140 0.0065 0 0 0 0.001 0.007
55 236 0.874984522679434 -5.67914482644765 0.013 0 0 0 0.0265 0.172
57 190 0.903854674346477 -4.1116526362428 0.014 0 0 0 0.051 0.232
57 66 1.87155963302752 -5.76146788990826 0.0115 0 0 0 0.051 0.157
58 59 2.90275761973875 -9.0711175616836 0.031 0 0 0 0.032 0.1
58 237 1.27979031915411 -7.89630626918086 0.014 0 0 0 0.02 0.1234
59 60 1.95047949287533 -7.09757815462968 0.034 0 0 0 0.036 0.131
59 61 3.10303915305284 -9.03531988683034 0.0235 0 0 0 0.034 0.099
60 64 2.28050171037628 -11.0224249334854 0.0055 0 0 0 0.018 0.087
60 238 0.675384045529327 -5.09176253074844 0 0 0 0 0.0256 0.193
61 63 5.69105691056911 -15.4471544715447 0.015 0 0 0 0.021 0.057
61 66 5.9445178335535 -17.1730515191546 0.009 0 0 0 0.018 0.052
62 73 5.36912751677852 -36.241610738255 0.025 0 0 0 0.004 0.027
62 240 0.691829756662187 -4.86941713343001 0.1895 0 0 0 0.0286 0.2013
63 64 7.60095011876485 -20.4275534441805 0.002 0 0 0 0.016 0.043
64 65 27.027027027027 -162.162162162162 0.0035 0 0 0 0.001 0.006
64 67 2.74725274725275 -13.7362637362637 0.019 0 0 0 0.014 0.07
64 239 1.12007041735634 -3.36398253293554 0.0145 0 0 0 0.0891 0.2676
64 241 1.52268854613036 -4.14163495859241 0.011 0 0 0 0.0782 0.2127
65 66 11.5384615384615 -42.3076923076923 0.0055 0 0 0 0.006 0.022
65 69 0 -27.7777777777778 0 0 0 0 0 0.036
66 190 0.658130908220653 -2.49292010689641 0.0255 0 0 0 0.099 0.375
67 190 1.84362691695299 -8.96673091427135 0.029 0 0 0 0.022 0.107
68 173 3.17820658342792 -29.9659477866061 0.265 0 0 0 0.0035 0.033
68 174 3.17820658342792 -29.9659477866061 0.265 0 0 0 0.0035 0.033
70 71 1.92307692307692 -15.3846153846154 0.064 0 0 0 0.008 0.064
71 72 1.36472193790515 -10.5765950187649 0.0915 0 0 0 0.012 0.093
71 234 2.56410256410256 -20.5128205128205 0.046 0 0 0 0.006 0.048
74 76 2.87110568112401 -7.26939523518632 0.007 0 0 0 0.047 0.119
75 77 1.0223642172524 -5.5591054313099 0.012 0 0 0 0.032 0.174
76 78 1.35118701779513 -3.41850315502169 0.0155 0 0 0 0.1 0.253
76 79 3.43053173241852 -12.0068610634648 0.0195 0 0 0 0.022 0.077
77 84 0.900601981324359 -6.82561501635304 0.0085 0 0 0 0.019 0.144
77 86 1.94219124871473 -10.5106820518679 0.006 0 0 0 0.017 0.092
78 79 1.07082465053753 -1.64475584812779 0.0215 0 0 0 0.278 0.427
79 82 6.6808381415123 -16.0947464318251 0.0035 0 0 0 0.022 0.053
79 83 3.83528461849011 -9.28542591844974 0.006 0 0 0 0.038 0.092
79 84 2.79264603211543 -7.09797533162672 0.0075 0 0 0 0.048 0.122
80 82 5.13698630136986 -13.6986301369863 0.0035 0 0 0 0.024 0.064
80 83 2.15230740013927 -7.65968221814269 0.0075 0 0 0 0.034 0.121
81 87 2.5197299610155 -6.4181800893791 0.0085 0 0 0 0.053 0.135
81 88 100 -200 0.001 0 0 0 0.002 0.004
81 89 0.353381864442717 -2.77993733361604 0.022 0 0 0 0.045 0.354
81 90 1.52550646814743 -5.30876250915304 0.011 0 0 0 0.05 0.174
82 83 9.41176470588235 -22.3529411764706 0.002 0 0 0 0.016 0.038
83 85 7.23296888141295 -10.7653490328007 0.0135 0 0 0 0.043 0.064
84 86 4.51843043995244 -14.7443519619501 0.004 0 0 0 0.019 0.062
85 88 3.35156112189099 -5.73293349797142 0.022 0 0 0 0.076 0.13
85 233 2.54158964879852 -7.16266173752311 0.0075 0 0 0 0.044 0.124
86 87 1.52129817444219 -11.1561866125761 0.0055 0 0 0 0.012 0.088
86 90 0.850261848155148 -2.1662722245991 0.0235 0 0 0 0.157 0.4
88 235 1.51826015592942 -4.26754205990972 0.013 0 0 0 0.074 0.208
89 90 1.80617194756941 -4.74765197646816 0.0105 0 0 0 0.07 0.184
89 92 1.17541962480606 -3.22064977196859 0.0155 0 0 0 0.1 0.274
89 93 0.655323753983046 -2.36277280105814 0.018 0 0 0 0.109 0.393
90 91 0.774348347693314 -2.20307558076126 0.025 0 0 0 0.142 0.404
91 93 8.28056502679006 -20.4578665367754 0.003 0 0 0 0.017 0.042
94 101 8.80260165782331 -48.6588258307455 0.002 0 0 0 0.0036 0.0199
95 99 0.18168588146268 -9.52942448271759 0.0005 0 0 0 0.002 0.1049
96 97 30.7692307692308 -553.846153846154 0.0085 0 0 0 0.0001 0.0018
97 98 0 -36.90036900369 0 0 0 0 0 0.0271
97 245 0 -1.62258640272595 0 0 0 0 0 0.6163
245 99 0 2.70489586150933 0 0 0 0 0 -0.3697
97 100 0.0258893308772988 -3.43033634124209 0 0 0 0 0.0022 0.2915
98 99 0 -29.4985250737463 0 0 0 0 0 0.0339
98 100 0 -17.1821305841924 0 0 0 0 0 0.0582
101 102 1.31441957313899 -3.81311816762103 0.0145 0 0 0 0.0808 0.2344
101 104 0.670474778128432 -2.54919374192043 0.027 0 0 0 0.0965 0.3669
102 103 2.79638582667379 -8.35808652639167 0.0585 0 0 0 0.036 0.1076
102 104 2.13839167788274 -6.35228116076932 0.0745 0 0 0 0.0476 0.1414
104 105 1.54460033466341 -50.7143776547818 0 0 0 0 0.0006 0.0197
105 106 3.52226188912636 -24.1782383914606 0.125 0 0 0 0.0059 0.0405
105 108 0.930073815510558 -8.94488382569284 0.0925 0 0 0 0.0115 0.1106
105 111 0.685465500313652 -5.84376648752245 0.1605 0 0 0 0.0198 0.1688
105 136 1.98019801980198 -19.8019801980198 0.165 0 0 0 0.005 0.05
105 137 2.60687334319657 -18.2142579044124 0.1675 0 0 0 0.0077 0.0538
105 148 1.20801772345033 -8.47076670322446 0.0855 0 0 0 0.0165 0.1157
106 107 1.75381231235695 -17.1516899022027 0.0475 0 0 0 0.0059 0.0577
106 113 4.24989375265618 -29.1421285896424 0.104 0 0 0 0.0049 0.0336
106 147 1.75381231235695 -17.1516899022027 0.0475 0 0 0 0.0059 0.0577
107 109 1.29221868978965 -12.806218553941 0.063 0 0 0 0.0078 0.0773
107 112 6.8556361239288 -50.8899143045484 0.015 0 0 0 0.0026 0.0193
108 109 1.33034588993138 -13.1634224898474 0.061 0 0 0 0.0076 0.0752
108 112 5.99366384108228 -53.0867368781574 0.015 0 0 0 0.0021 0.0186
109 111 5.89275191514437 -60.4007071302298 0.013 0 0 0 0.0016 0.0164
109 130 6.17867267572872 -59.9694700879552 0.013 0 0 0 0.0017 0.0165
109 146 1.2439181848242 -12.4864192476657 0.0635 0 0 0 0.0079 0.0793
109 147 1.25656474530399 -12.6300866707478 0.0625 0 0 0 0.0078 0.0784
112 116 12.1619688081271 -83.7029617971097 0.1445 0 0 0 0.0017 0.0117
112 147 6.8556361239288 -50.8899143045484 0.015 0 0 0 0.0026 0.0193
112 148 5.99366384108228 -53.0867368781574 0.015 0 0 0 0.0021 0.0186
112 150 1.95982361587457 -98.9710926016658 0 0 0 0 0.0002 0.0101
113 114 4.9031904946521 -33.4101119751876 0.09 0 0 0 0.0043 0.0293
113 163 2.65881294228331 -25.9745572053831 0.129 0 0 0 0.0039 0.0381
114 115 2.2956030372594 -15.7160515627759 0.1925 0 0 0 0.0091 0.0623
115 116 1.54755640843109 -11.0186016280293 0.27 0 0 0 0.0125 0.089
115 131 3.60741065216831 -25.1230384704579 0.4765 0 0 0 0.0056 0.039
116 119 11.3455865668255 -86.2264579078738 0.142 0 0 0 0.0015 0.0114
116 160 42.3370025402202 -287.891617273497 0.0105 0 0 0 0.0005 0.0034
116 165 3.06345733041575 -66.0831509846827 0.063 0 0 0 0.0007 0.0151
116 167 42.3370025402202 -287.891617273497 0.0105 0 0 0 0.0005 0.0034
118 151 1.04668201800293 -4.18672807201172 0.0405 0 0 0 0.0562 0.2248
119 120 1.6823310378861 -11.7202395639398 0.0615 0 0 0 0.012 0.0836
119 121 1.165172384188 -8.6774680190843 0.342 0 0 0 0.0152 0.1132
119 124 0.404522876935584 -2.91204609486321 0.2595 0 0 0 0.0468 0.3369
119 125 0.458820291935615 -3.23414954617872 0.2315 0 0 0 0.043 0.3031
119 126 0.393302279343547 -2.8086125960484 0.269 0 0 0 0.0489 0.3492
119 161 16.0692212608158 -110.012360939431 0.0595 0 0 0 0.0013 0.0089
120 125 0.557047609385199 -4.33961144493556 0.171 0 0 0 0.0291 0.2267
121 122 1.82648401826484 -17.351598173516 0.3835 0 0 0 0.006 0.057
122 124 1.24346352672783 -12.8159640821415 0.0595 0 0 0 0.0075 0.0773
122 128 1.50757944468845 -10.7904701985969 0.0675 0 0 0 0.0127 0.0909
124 125 2.40814349135477 -16.6586867401953 0.0435 0 0 0 0.0085 0.0588
124 128 0.935363386530338 -6.4831838396667 0.1115 0 0 0 0.0218 0.1511
125 126 2.81478339663383 -19.4335730397733 0.037 0 0 0 0.0073 0.0504
127 157 2.00983396773121 -5.86425742783524 0.037 0 0 0 0.0523 0.1526
127 158 0.795326565960881 -2.27343895842501 0.038 0 0 0 0.1371 0.3919
131 132 1.46583951946143 -10.2394775191576 0.0705 0 0 0 0.0137 0.0957
132 140 6.39765496865149 -33.5004478358478 0.095 0 0 0 0.0055 0.0288
133 135 1.33891218522815 -2.42399852090846 0.02 0 0 0 0.1746 0.3161
133 162 0.806149840394364 -3.06216618478158 0.0225 0 0 0 0.0804 0.3054
134 140 3.28628959978968 -16.969204478914 0.194 0 0 0 0.011 0.0568
136 138 8.27472072817543 -101.365328920149 0.0345 0 0 0 0.0008 0.0098
137 138 3.53374113518388 -34.728145638876 0.095 0 0 0 0.0029 0.0285
137 139 3.21857017458305 -21.8472642153516 0.1385 0 0 0 0.0066 0.0448
141 143 2.2460974057575 -30.5094897615393 0.118 0 0 0 0.0024 0.0326
141 144 2.9826509138511 -40.5971929940844 0.831 0 0 0 0.0018 0.0245
142 143 1.65331489636722 -19.3137240166534 1.7985 0 0 0 0.0044 0.0514
144 145 1.32161501354655 -81.2793233331131 0 0 0 0 0.0002 0.0123
146 148 5.62359410147463 -55.6110972256936 0.0145 0 0 0 0.0018 0.0178
151 152 0.27989043690939 -2.02617247526484 0.0315 0 0 0 0.0669 0.4843
151 153 1.0740137935707 -4.25371054442876 0.0155 0 0 0 0.0558 0.221
152 153 0.686995022478443 -2.83566346948661 0.0245 0 0 0 0.0807 0.3331
152 154 0.740691591456568 -3.07802960400964 0.0215 0 0 0 0.0739 0.3071
152 155 0.633301521578191 -1.76613325945402 0.0345 0 0 0 0.1799 0.5017
154 155 0.647328352724064 -2.59647412276267 0.024 0 0 0 0.0904 0.3626
154 158 0.758369344386747 -3.04529612057639 0.027 0 0 0 0.077 0.3092
155 156 3.34558715721061 -11.0497679415442 0.0235 0 0 0 0.0251 0.0829
156 157 2.89555271797186 -11.0474466311809 0.025 0 0 0 0.0222 0.0847
157 158 1.34994872634506 -5.02842346861464 0.0145 0 0 0 0.0498 0.1855
157 159 6.94594686919985 -33.0217146240649 0.042 0 0 0 0.0061 0.029
160 117 0.979911807937286 -49.4855463008329 0 0 0 0 0.0004 0.0202
160 166 5.7929036929761 -120.202751629254 0.0575 0 0 0 0.0004 0.0083
163 164 4.12201154163232 -40.3957131079967 0.082 0 0 0 0.0025 0.0245
165 167 9.4022834116857 -115.513767629281 0.0575 0 0 0 0.0007 0.0086
166 167 9.4022834116857 -115.513767629281 0.0575 0 0 0 0.0007 0.0086
167 117 0.979911807937286 -49.4855463008329 0 0 0 0 0.0004 0.0202
168 187 3.26280403401226 -9.39292070397469 0 0 0 0 0.033 0.095
168 188 6.68896321070234 -10.0334448160535 0 0 0 0 0.046 0.069
169 210 80 -440 3.1 0 0 0 0.0004 0.0022
169 219 0 -36.3636363636364 0 0 0 0 0 0.0275
170 171 1.2970168612192 -20.7522697795071 0 0 0 0 0.003 0.048
171 204 23.5294117647059 -105.882352941176 0 0 0 0 0.002 0.009
172 184 7.50750750750751 -10.5105105105105 0 0 0 0 0.045 0.063
172 187 2.60402538924754 -6.88981717571746 0 0 0 0 0.048 0.127
173 198 3.74590669067269 -34.5590101139481 0.25 0 0 0 0.0031 0.0286
173 242 1.89571962306775 -28.0408527578771 0.18 0 0 0 0.0024 0.0355
174 198 3.74590669067269 -34.5590101139481 0.25 0 0 0 0.0031 0.0286
175 176 7.79510022271715 -22.271714922049 0.002 0 0 0 0.014 0.04
175 189 4.02090872537193 -10.8564535585042 0.005 0 0 0 0.03 0.081
176 177 2.7027027027027 -16.2162162162162 0.0045 0 0 0 0.01 0.06
176 190 8.21917808219178 -21.9178082191781 0.003 0 0 0 0.015 0.04
177 181 0.568913991171552 -1.17895429495791 0 0 0 0 0.332 0.688
177 182 4.09649522075558 -20.9376422394174 0.0125 0 0 0 0.009 0.046
177 189 3.49101064758248 -12.742188863676 0.004 0 0 0 0.02 0.073
177 190 2.60796195443737 -8.36081920687275 0.016 0 0 0 0.034 0.109
178 179 3.16653472771968 -5.62476563476522 0.0045 0 0 0 0.076 0.135
178 189 3.33222259246918 -8.4971676107964 0.0025 0 0 0 0.04 0.102
179 189 3.53018086729135 -5.57855741991719 0.007 0 0 0 0.081 0.128
180 183 2.53760360175995 -3.74501176711348 0 0 0 0 0.124 0.183
182 190 2.79251605696733 -16.4758447361072 0.004 0 0 0 0.01 0.059
183 184 6.82492581602374 -10.0890207715134 0 0 0 0 0.046 0.068
184 185 1.04094857300427 -1.53729491245002 0 0 0 0 0.302 0.446
185 186 5.22249248819574 -6.65331234797539 0 0 0 0 0.073 0.093
185 187 1.02196805498188 -1.79270229644738 0 0 0 0 0.24 0.421
191 194 2.22540645688075 -12.4558721111743 0.043 0 0 0 0.0139 0.0778
192 193 1.72384071711774 -26.2023789001896 0 1 0 0 0.0025 0.038
193 194 4.92553746305847 -53.6014370979892 0.01 0 0 0 0.0017 0.0185
193 221 12.6167045167802 -90.8402725208176 0.001 0 0 0 0.0015 0.0108
194 195 7.02839471464717 -38.890450754381 0.013 0 0 0 0.0045 0.0249
195 196 1.60895221009698 -19.991231210455 0.009 0 0 0 0.004 0.0497
196 197 0 -21.9298245614035 0 0 0 0 0 0.0456
196 198 1.59469286215475 -56.4521273202781 0.01 0 0 0 0.0005 0.0177
196 199 1.72244408436148 -25.198719011955 0.416 0 0 0 0.0027 0.0395
198 216 90.0900900900901 -540.540540540541 2.6 0 0 0 0.0003 0.0018
199 197 1.57029177718833 -20.5411140583554 0.215 0 0 0 0.0037 0.0484
199 200 1.14777618364419 -33.8593974175036 0.2515 0 0 0 0.001 0.0295
199 217 67.4536256323778 -193.929173693086 0.201 0 0 0 0.0016 0.0046
200 202 168.539325842697 -730.337078651685 0.5 0 0 0 0.0003 0.0013
201 216 0.529516778117341 -19.4408302823081 0.165 1 0 0 0.0014 0.0514
203 204 2.38322211630124 -15.2526215443279 0.24 0 0 0 0.01 0.064
203 205 27.448714244438 -117.018202831552 0.43 0 0 0 0.0019 0.0081
204 170 0.268672756582483 -16.3890381515314 0 0 0 0 0.001 0.061
205 210 1.11187707087104 -47.1435878049323 0 0 0 0 0.0005 0.0212
206 210 0.403831916182442 -21.1787404931236 0.093 1 0 0 0.0009 0.0472
207 208 23.9596469104666 -109.709962168979 0.64 0 0 0 0.0019 0.0087
207 210 0.308948209585712 -10.8963656996192 0 0 0 0 0.0026 0.0917
207 213 1.56413557445887 -34.6516188803196 0.405 0 0 0 0.0013 0.0288
208 169 0 -15.9744408945687 0 0 0 0 0 0.0626
210 211 4.19727177334732 -144.805876180483 0.682 0 0 0 0.0002 0.0069
210 216 270.27027027027 -1621.62162162162 1.785 0 0 0 0.0001 0.0006
211 212 0.721825454113131 -20.5932556026393 0 0 0 0 0.0017 0.0485
213 214 0.298129239025117 -38.6077364537527 0.072 0 0 0 0.0002 0.0259
213 216 0.810591731964334 -36.7468251823831 0 0 0 0 0.0006 0.0272
214 217 500 -1500 0.4 0 0 0 0.0002 0.0006
220 216 2.10606124426098 -64.8666863232383 0 1 0 0 0.0005 0.0154
219 230 16.1463939720129 -231.431646932185 0.0045 0 0 0 0.0003 0.0043
221 224 1.12186612853576 -11.6427814071211 0 0 0 0 0.0082 0.0851
221 226 2.09239023825226 -13.5071262701463 0 0 0 0 0.0112 0.0723
222 223 8.93397301518072 -24.9729166959776 0 0 0 0 0.0127 0.0355
222 224 0.970038313537807 -5.36794207859572 0 0 0 0 0.0326 0.1804
223 225 5.70799646396937 -16.1287489828058 0 0 0 0 0.0195 0.0551
224 225 2.80120541043012 -13.060397200222 0 0 0 0 0.0157 0.0732
224 226 0.779261091645217 -4.58681736998949 0 0 0 0 0.036 0.2119
225 226 1.55538234838359 -7.45771014057058 0 0 0 0 0.0268 0.1285
226 227 2.57923152158389 -7.32188387552436 0 0 0 0 0.0428 0.1215
227 228 3.10285294510249 -8.8753970281564 0 0 0 0 0.0351 0.1004
228 229 1.60923533891254 -4.85121757201393 0 0 0 0 0.0616 0.1857
3 257 0 -19.2307692307692 0 0.947 0 0 0 0.052
3 2 0 -19.2307692307692 0 0.956 0 0 0 0.052
3 4 0 -200 0 0.971 0 0 0 0.005
7 5 0 -25.6410256410256 0 0.948 0 0 0 0.039
7 6 0 -25.6410256410256 0 0.959 0 0 0 0.039
10 11 0 -11.2359550561798 0 1.046 0 0 0 0.089
12 10 0 -18.8679245283019 0 0.985 0 0 0 0.053
15 17 14.4391434759633 -23.1472867063123 0 0.9561 0 0 0.0194 0.0311
16 15 0.69204152249135 -26.2975778546713 0 0.971 0 0 0.001 0.038
20 19 0 -71.4285714285714 0 0.952 0 0 0 0.014
23 22 0 -15.625 0 0.943 0 0 0 0.064
30 29 0 -21.2765957446809 0 1.01 0 0 0 0.047
39 38 0 -50 0 1.008 0 0 0 0.02
39 40 0 -47.6190476190476 0 1 0 0 0 0.021
54 53 0 -16.9491525423729 0 0.975 0 0 0 0.059
55 56 0 -26.3157894736842 0 1.017 0 0 0 0.038
61 62 0 -40.983606557377 0 1 0 0 0 0.0244
68 73 0 -50 0 1 0 0 0 0.02
70 81 0 -20.8333333333333 0 1 0 0 0 0.048
71 83 0 -20.8333333333333 0 1 0 0 0 0.048
72 78 0 -21.7391304347826 0 1.015 0 0 0 0.046
93 186 0 -6.71140939597315 0 0.967 0 0 0 0.149
95 103 15.767131594906 -52.7592480291085 0 1.01 0 0 0.0052 0.0174
100 94 0 -35.7142857142857 0 1.05 0 0 0 0.028
101 136 1.31406044678055 -51.2483574244415 0 1 0 0 0.0005 0.0195
109 110 0 -55.5555555555556 0 1.0522 0 0 0 0.018
109 129 0 -71.4285714285714 0 1.0522 0 0 0 0.014
111 149 0.618413892049671 -24.8602384603968 0 1.05 0 0 0.001 0.0402
120 153 0.659005725112237 -16.557518843445 0 0.975 0 0 0.0024 0.0603
121 154 0.965483948829351 -20.033791938209 -0.0435 1 0 0 0.0024 0.0498
122 123 0 -12.0048019207683 0 1.035 0 0 0 0.0833
122 127 0.943327770118279 -26.9211232856832 0 0.9565 0 0 0.0013 0.0371
124 159 1.50834112642915 -54.9036170020212 0 1 0 0 0.0005 0.0182
130 149 0.650347285450431 -25.4936135896569 0 1.05 0 0 0.001 0.0392
132 162 0.66006600660066 -15.6215621562156 0 1.073 0 0 0.0027 0.0639
134 135 1.21951219512195 -39.0243902439024 0 1.05 0 0 0.0008 0.0256
138 96 0 -62.5 0 1.0506 0 0 0 0.016
139 103 0.764525993883792 -25.2293577981651 0 0.975 0 0 0.0012 0.0396
142 116 0.880609652836579 -26.0118543607113 -0.0285 0.98 0 0 0.0013 0.0384
143 134 1.68406871000337 -43.2244302234198 -0.0165 0.956 0 0 0.0009 0.0231
161 118 1.7472335468841 -76.2958648806057 0 1.05 0 0 0.0003 0.0131
168 189 0 -3.96825396825397 0 1.03 0 0 0 0.252
172 175 0 -4.21940928270042 0 1.03 0 0 0 0.237
174 191 0.596925831965378 -27.3093568124161 0 0.985 0 0 0.0008 0.0366
179 227 0 -4.54545454545455 0 1 0 0 0 0.22
180 57 0 -10.2040816326531 0 1.03 0 0 0 0.098
181 190 0 -7.8125 0 1.01 0 0 0 0.128
183 246 0.476009139375476 -4.85529322162986 -0.006 1.05 0 0 0.02 0.204
188 177 0.575259419873 -4.66845144589243 0 1.03 0 0 0.026 0.211
190 191 19.0065889508363 -77.2934617334009 0 1 0 0 0.003 0.0122
197 198 0.797346431077375 -28.2260636601391 -0.005 0.97 0 0 0.001 0.0354
202 203 3.14391259922974 -51.0885797374833 -0.182 1 0 0 0.0012 0.0195
208 209 0.906421086980168 -30.0931800877416 0 1.02 0 0 0.001 0.0332
213 215 1.95121951219512 -62.4390243902439 0 1.07 0 0 0.0005 0.016
217 218 1.95121951219512 -62.4390243902439 0 1.02 0 0 0.0005 0.016
175 246 0.249993750156246 -49.9987500312492 0 1 0 0 0.0001 0.02
98 243 1.88679245283019 -43.3962264150943 0 1.0223 0 0 0.001 0.023
99 244 0 -43.4782608695652 0 0.9284 0 0 0 0.023
248 2 4.66940605155024 -68.1733283526335 0 1 0 0 0.001 0.0146
249 3 0 -94.876660341556 0 1 0 0 0 0.01054
260 53 0 -42.0168067226891 0 1 0 0 0 0.0238
261 54 0 -31.1138767890479 0 0.95 0 0 0 0.03214
265 145 0 -64.9350649350649 0 1 0 0 0 0.0154
254 23 0 -34.6020761245675 0 1 0 0 0 0.0289
247 257 0 -51.2032770097286 0 1 0 0 0 0.01953
263 109 0 -51.8134715025907 0 1 0 0 0 0.0193
250 11 0 -52.0020800832033 0 1 0 0 0 0.01923
253 22 0 -43.4782608695652 0 1 0 0 0 0.023
1 43 0 -80.6451612903226 0 1 0 0 0 0.0124
264 118 0 -59.8802395209581 0 1 0 0 0 0.0167
251 12 0 -32.0512820512821 0 1 0 0 0 0.0312
252 17 0 -60.459492140266 0 0.942 0 0 0 0.01654
255 33 0 -31.6555872111428 0 0.965 0 0 0 0.03159
259 49 0 -18.7020759304283 0 0.95 0 0 0 0.05347
256 38 0 -5.500247511138 0 0.942 0 0 0 0.18181
258 48 0 -5.10021930943031 0 0.942 0 0 0 0.19607
262 59 0 -14.5011600928074 0 0.9565 0 0 0 0.06896
