1 2 755.856324830817 -524.900225576956 0 0 0 0 0.000892561983471074 0.000619834710743802
2 3 504.256896683967 -346.483266433155 0 0 0 0 0.00134710743801653 0.000925619834710744
3 4 378.943570500794 -260.196276518978 0 0 0 0 0.00179338842975207 0.00123140495867769
4 5 762.42707117853 -522.403733955659 0 0 0 0 0.000892561983471074 0.000611570247933884
5 6 189.314783709613 -129.691507001068 0 0 0 0 0.00359504132231405 0.00246280991735537
6 7 303.112912138515 -207.275741388838 0 0 0 0 0.00224793388429752 0.00153719008264463
7 8 68.7993448631466 -47.1307124375775 0 0 0 0 0.00989256198347107 0.00677685950413223
8 9 762.42707117853 -522.403733955659 0 0 0 0 0.000892561983471074 0.000611570247933884
9 10 137.640192960297 -94.3686941701033 0 0 0 0 0.00494214876033058 0.00338842975206612
10 11 151.296932642249 -103.738521830071 0 0 0 0 0.00449586776859504 0.00308264462809917
11 12 151.296932642249 -103.738521830071 0 0 0 0 0.00449586776859504 0.00308264462809917
12 13 137.640192960297 -94.3686941701033 0 0 0 0 0.00494214876033058 0.00338842975206612
13 14 303.112912138515 -207.275741388838 0 0 0 0 0.00224793388429752 0.00153719008264463
14 15 252.850870164418 -172.96240505112 0 0 0 0 0.00269421487603306 0.00184297520661157
2 16 141.805701333574 -58.8259914872792 0 0 0 0 0.00601652892561983 0.00249586776859504
3 17 226.800853567103 -94.2095853278736 0 0 0 0 0.0037603305785124 0.00156198347107438
5 18 125.913705583756 -52.2081218274112 0 0 0 0 0.00677685950413223 0.0028099173553719
18 19 162.108672562649 -67.184755975729 0 0 0 0 0.00526446280991736 0.00218181818181818
19 20 226.800853567103 -94.2095853278736 0 0 0 0 0.0037603305785124 0.00156198347107438
20 21 126.022272213398 -52.3169384036085 0 0 0 0 0.00676859504132231 0.0028099173553719
21 22 66.6940125363721 -27.6599199278753 0 0 0 0 0.0127933884297521 0.00530578512396694
19 23 568.324343854035 -234.199592247542 0 0 0 0 0.00150413223140496 0.000619834710743802
7 24 113.400426783552 -47.1047926639368 0 0 0 0 0.00752066115702479 0.00312396694214876
8 25 226.800853567103 -94.2095853278736 0 0 0 0 0.0037603305785124 0.00156198347107438
25 26 283.611402667148 -117.651982974558 0 0 0 0 0.00300826446280992 0.00124793388429752
26 27 189.196774267452 -78.3122179202272 0 0 0 0 0.00451239669421488 0.00186776859504132
27 28 378.393548534903 -156.624435840454 0 0 0 0 0.00225619834710744 0.000933884297520661
28 29 189.196774267452 -78.3122179202272 0 0 0 0 0.00451239669421488 0.00186776859504132
29 30 189.196774267452 -78.3122179202272 0 0 0 0 0.00451239669421488 0.00186776859504132
30 31 378.393548534903 -156.624435840454 0 0 0 0 0.00225619834710744 0.000933884297520661
31 32 568.324343854035 -234.199592247542 0 0 0 0 0.00150413223140496 0.000619834710743802
32 33 568.324343854035 -234.199592247542 0 0 0 0 0.00150413223140496 0.000619834710743802
33 34 126.022272213398 -52.3169384036085 0 0 0 0 0.00676859504132231 0.0028099173553719
34 35 162.108672562649 -67.184755975729 0 0 0 0 0.00526446280991736 0.00218181818181818
35 36 568.324343854035 -234.199592247542 0 0 0 0 0.00150413223140496 0.000619834710743802
26 37 283.611402667148 -117.651982974558 0 0 0 0 0.00300826446280992 0.00124793388429752
27 38 103.004094948431 -42.7641751482507 0 0 0 0 0.00828099173553719 0.00343801652892562
29 39 189.196774267452 -78.3122179202272 0 0 0 0 0.00451239669421488 0.00186776859504132
32 40 226.800853567103 -94.2095853278736 0 0 0 0 0.0037603305785124 0.00156198347107438
40 41 103.004094948431 -42.7641751482507 0 0 0 0 0.00828099173553719 0.00343801652892562
41 42 378.393548534903 -156.624435840454 0 0 0 0 0.00225619834710744 0.000933884297520661
41 43 226.800853567103 -94.2095853278736 0 0 0 0 0.0037603305785124 0.00156198347107438
34 44 103.004094948431 -42.7641751482507 0 0 0 0 0.00828099173553719 0.00343801652892562
44 45 113.312534372253 -47.0166168965003 0 0 0 0 0.00752892561983471 0.00312396694214876
45 46 113.312534372253 -47.0166168965003 0 0 0 0 0.00752892561983471 0.00312396694214876
46 47 189.196774267452 -78.3122179202272 0 0 0 0 0.00451239669421488 0.00186776859504132
35 48 162.108672562649 -67.184755975729 0 0 0 0 0.00526446280991736 0.00218181818181818
48 49 568.324343854035 -234.199592247542 0 0 0 0 0.00150413223140496 0.000619834710743802
49 50 283.611402667148 -117.651982974558 0 0 0 0 0.00300826446280992 0.00124793388429752
50 51 226.800853567103 -94.2095853278736 0 0 0 0 0.0037603305785124 0.00156198347107438
48 52 75.5612141105262 -31.3639885802843 0 0 0 0 0.0112892561983471 0.00468595041322314
52 53 226.800853567103 -94.2095853278736 0 0 0 0 0.0037603305785124 0.00156198347107438
53 54 189.196774267452 -78.3122179202272 0 0 0 0 0.00451239669421488 0.00186776859504132
52 55 189.196774267452 -78.3122179202272 0 0 0 0 0.00451239669421488 0.00186776859504132
49 56 189.196774267452 -78.3122179202272 0 0 0 0 0.00451239669421488 0.00186776859504132
9 57 378.393548534903 -156.624435840454 0 0 0 0 0.00225619834710744 0.000933884297520661
57 58 126.022272213398 -52.3169384036085 0 0 0 0 0.00676859504132231 0.0028099173553719
58 59 568.324343854035 -234.199592247542 0 0 0 0 0.00150413223140496 0.000619834710743802
58 60 189.196774267452 -78.3122179202272 0 0 0 0 0.00451239669421488 0.00186776859504132
60 61 141.805701333574 -58.8259914872792 0 0 0 0 0.00601652892561983 0.00249586776859504
61 62 103.076866834604 -42.6915167029549 0 0 0 0 0.00828099173553719 0.0034297520661157
60 63 568.324343854035 -234.199592247542 0 0 0 0 0.00150413223140496 0.000619834710743802
63 64 141.805701333574 -58.8259914872792 0 0 0 0 0.00601652892561983 0.00249586776859504
64 65 568.324343854035 -234.199592247542 0 0 0 0 0.00150413223140496 0.000619834710743802
65 66 568.324343854035 -234.199592247542 0 0 0 0 0.00150413223140496 0.000619834710743802
64 67 226.800853567103 -94.2095853278736 0 0 0 0 0.0037603305785124 0.00156198347107438
67 68 113.400426783552 -47.1047926639368 0 0 0 0 0.00752066115702479 0.00312396694214876
68 69 94.5371342223825 -39.2173276581861 0 0 0 0 0.00902479338842975 0.00374380165289256
69 70 226.800853567103 -94.2095853278736 0 0 0 0 0.0037603305785124 0.00156198347107438
70 71 189.196774267452 -78.3122179202272 0 0 0 0 0.00451239669421488 0.00186776859504132
67 72 568.324343854035 -234.199592247542 0 0 0 0 0.00150413223140496 0.000619834710743802
68 73 87.1999352379306 -36.1614596299189 0 0 0 0 0.00978512396694215 0.00405785123966942
73 74 378.393548534903 -156.624435840454 0 0 0 0 0.00225619834710744 0.000933884297520661
73 75 103.004094948431 -42.7641751482507 0 0 0 0 0.00828099173553719 0.00343801652892562
70 76 189.196774267452 -78.3122179202272 0 0 0 0 0.00451239669421488 0.00186776859504132
65 77 1141.03626943005 -463.937823834197 0 0 0 0 0.000752066115702479 0.000305785123966942
10 78 162.108672562649 -67.184755975729 0 0 0 0 0.00526446280991736 0.00218181818181818
67 79 189.196774267452 -78.3122179202272 0 0 0 0 0.00451239669421488 0.00186776859504132
12 80 141.805701333574 -58.8259914872792 0 0 0 0 0.00601652892561983 0.00249586776859504
80 81 283.611402667148 -117.651982974558 0 0 0 0 0.00300826446280992 0.00124793388429752
81 82 1141.03626943005 -463.937823834197 0 0 0 0 0.000752066115702479 0.000305785123966942
81 83 94.5371342223825 -39.2173276581861 0 0 0 0 0.00902479338842975 0.00374380165289256
83 84 103.004094948431 -42.7641751482507 0 0 0 0 0.00828099173553719 0.00343801652892562
13 85 126.022272213398 -52.3169384036085 0 0 0 0 0.00676859504132231 0.0028099173553719
