4 0.1 0.0056 -0.056 -0.0672 -0.0448 -0.0571314 -0.05998797 -0.05427483 1
6 0.1 0.003528 -0.03528 -0.042336 -0.028224 -0.0359928 -0.03779244 -0.03419316 1
8 0.1 0.003528 -0.03528 -0.042336 -0.028224 -0.0359928 -0.03779244 -0.03419316 1
11 0.1 0.0056 -0.056 -0.0672 -0.0448 -0.0571314 -0.05998797 -0.05427483 1
14 0.1 0.003528 -0.03528 -0.042336 -0.028224 -0.0359928 -0.03779244 -0.03419316 1
15 0.1 0.003528 -0.03528 -0.042336 -0.028224 -0.0359928 -0.03779244 -0.03419316 1
16 0.1 0.003528 -0.03528 -0.042336 -0.028224 -0.0359928 -0.03779244 -0.03419316 1
17 0.1 0.0112 -0.112 -0.1344 -0.0896 -0.1142629 -0.119976045 -0.108549755 1
18 0.1 0.0056 -0.056 -0.0672 -0.0448 -0.0571314 -0.05998797 -0.05427483 1
19 0.1 0.0056 -0.056 -0.0672 -0.0448 -0.0571314 -0.05998797 -0.05427483 1
20 0.1 0.003528 -0.03528 -0.042336 -0.028224 -0.0359928 -0.03779244 -0.03419316 1
21 0.1 0.003528 -0.03528 -0.042336 -0.028224 -0.0359928 -0.03779244 -0.03419316 1
22 0.1 0.003528 -0.03528 -0.042336 -0.028224 -0.0359928 -0.03779244 -0.03419316 1
23 0.1 0.0056 -0.056 -0.0672 -0.0448 -0.0571314 -0.05998797 -0.05427483 1
24 0.1 0.003528 -0.03528 -0.042336 -0.028224 -0.0359928 -0.03779244 -0.03419316 1
25 0.1 0.003528 -0.03528 -0.042336 -0.028224 -0.0359928 -0.03779244 -0.03419316 1
26 0.1 0.0056 -0.056 -0.0672 -0.0448 -0.0571314 -0.05998797 -0.05427483 1
28 0.1 0.0056 -0.056 -0.0672 -0.0448 -0.0571314 -0.05998797 -0.05427483 1
30 0.1 0.003528 -0.03528 -0.042336 -0.028224 -0.0359928 -0.03779244 -0.03419316 1
31 0.1 0.003528 -0.03528 -0.042336 -0.028224 -0.0359928 -0.03779244 -0.03419316 1
33 0.1 0.0014 -0.014 -0.0168 -0.0112 -0.0142829 -0.014997045 -0.013568755 1
36 0.1 0.003528 -0.03528 -0.042336 -0.028224 -0.0359928 -0.03779244 -0.03419316 1
37 0.1 0.0056 -0.056 -0.0672 -0.0448 -0.0571314 -0.05998797 -0.05427483 1
38 0.1 0.0056 -0.056 -0.0672 -0.0448 -0.0571314 -0.05998797 -0.05427483 1
39 0.1 0.0056 -0.056 -0.0672 -0.0448 -0.0571314 -0.05998797 -0.05427483 1
40 0.1 0.003528 -0.03528 -0.042336 -0.028224 -0.0359928 -0.03779244 -0.03419316 1
42 0.1 0.003528 -0.03528 -0.042336 -0.028224 -0.0359928 -0.03779244 -0.03419316 1
43 0.1 0.003528 -0.03528 -0.042336 -0.028224 -0.0359928 -0.03779244 -0.03419316 1
44 0.1 0.003528 -0.03528 -0.042336 -0.028224 -0.0359928 -0.03779244 -0.03419316 1
45 0.1 0.003528 -0.03528 -0.042336 -0.028224 -0.0359928 -0.03779244 -0.03419316 1
46 0.1 0.003528 -0.03528 -0.042336 -0.028224 -0.0359928 -0.03779244 -0.03419316 1
47 0.1 0.0014 -0.014 -0.0168 -0.0112 -0.0142829 -0.014997045 -0.013568755 1
50 0.1 0.003628 -0.03628 -0.043536 -0.029024 -0.037013 -0.03886365 -0.03516235 1
51 0.1 0.0056 -0.056 -0.0672 -0.0448 -0.0571314 -0.05998797 -0.05427483 1
53 0.1 0.003528 -0.03528 -0.042336 -0.028224 -0.0359928 -0.03779244 -0.03419316 1
54 0.1 0.0056 -0.056 -0.0672 -0.0448 -0.0571314 -0.05998797 -0.05427483 1
55 0.1 0.0056 -0.056 -0.0672 -0.0448 -0.0571314 -0.05998797 -0.05427483 1
56 0.1 0.0014 -0.014 -0.0168 -0.0112 -0.0142829 -0.014997045 -0.013568755 1
57 0.1 0.0056 -0.056 -0.0672 -0.0448 -0.0571314 -0.05998797 -0.05427483 1
59 0.1 0.0056 -0.056 -0.0672 -0.0448 -0.0571314 -0.05998797 -0.05427483 1
61 0.1 0.0056 -0.056 -0.0672 -0.0448 -0.0571314 -0.05998797 -0.05427483 1
62 0.1 0.0056 -0.056 -0.0672 -0.0448 -0.0571314 -0.05998797 -0.05427483 1
63 0.1 0.0014 -0.014 -0.0168 -0.0112 -0.0142829 -0.014997045 -0.013568755 1
66 0.1 0.0056 -0.056 -0.0672 -0.0448 -0.0571314 -0.05998797 -0.05427483 1
69 0.1 0.0056 -0.056 -0.0672 -0.0448 -0.0571314 -0.05998797 -0.05427483 1
71 0.1 0.003528 -0.03528 -0.042336 -0.028224 -0.0359928 -0.03779244 -0.03419316 1
72 0.1 0.0056 -0.056 -0.0672 -0.0448 -0.0571314 -0.05998797 -0.05427483 1
74 0.1 0.0056 -0.056 -0.0672 -0.0448 -0.0571314 -0.05998797 -0.05427483 1
75 0.1 0.003528 -0.03528 -0.042336 -0.028224 -0.0359928 -0.03779244 -0.03419316 1
76 0.1 0.0056 -0.056 -0.0672 -0.0448 -0.0571314 -0.05998797 -0.05427483 1
77 0.1 0.0014 -0.014 -0.0168 -0.0112 -0.0142829 -0.014997045 -0.013568755 1
78 0.1 0.0056 -0.056 -0.0672 -0.0448 -0.0571314 -0.05998797 -0.05427483 1
79 0.1 0.003528 -0.03528 -0.042336 -0.028224 -0.0359928 -0.03779244 -0.03419316 1
80 0.1 0.0056 -0.056 -0.0672 -0.0448 -0.0571314 -0.05998797 -0.05427483 1
82 0.1 0.0056 -0.056 -0.0672 -0.0448 -0.0571314 -0.05998797 -0.05427483 1
83 0.1 0.003528 -0.03528 -0.042336 -0.028224 -0.0359928 -0.03779244 -0.03419316 1
84 0.1 0.0014 -0.014 -0.0168 -0.0112 -0.0142829 -0.014997045 -0.013568755 1
85 0.1 0.003528 -0.03528 -0.042336 -0.028224 -0.0359928 -0.03779244 -0.03419316 1
1 0.1 -0.251428 2.51428 2.011424 3.017136 2.5650783 2.436824385 2.693332215 1
1 0.1 0.02 8.88178419700125e-16 0 10 0.187812259968704 -10 10 0
