1.04 0 4.2366375150482 1.11849627524813
1.01000000000027 -0.0207373536604841 -0.03 -0.887549841792876
0.985000000001076 -0.104512527331396 -0.00999999999999995 -0.219049013502044
0.98077962805798 -0.128061184368139 -0 -0
0.976498679454403 -0.149162985016157 -0.13 -0.04
0.980000000001587 -0.151391949503259 -0.75 -0.0112859874655287
0.984201657223681 -0.132669417262713 -0 -0
1.00500000000172 -0.0781543020670377 3 0.400996012034789
0.980000000001745 -0.167284075949704 -1.21 -0.237116248392479
0.986242027233623 -0.199834224954841 -0.05 -0.02
0.973962299877009 -0.177905749683069 -0 -0
1.01500000000129 -0.182757109117748 -0.67 1.04630884111426
0.978887415422635 -0.171103669492193 -0.18 -0.023
0.970176849404815 -0.163193618350199 -0.105 -0.053
0.988031614251915 -0.125492135700301 -0.22 -0.05
1.01336862713464 -0.154617589670622 -0.43 -0.03
1.01745426968197 -0.0941761011477693 -0.42 -0.08
1.00065923281176 -0.204720819534912 -0.272 -0.098
0.970157847282671 -0.23084608114516 -0.033 -0.006
0.963790166078026 -0.23464745419326 -0.023 -0.01
1.00849825681937 -0.225653712613966 -0 -0
1.00974398750792 -0.224699084366145 -0 -0
1.00832989399895 -0.22583787868014 -0.063 -0.021
0.999233038669962 -0.231991259814859 -0 -0
0.982520776936724 -0.317182632466486 -0.063 -0.032
0.95881825080476 -0.226565682771836 -0 -0
0.98154110130235 -0.200950584184602 -0.093 -0.005
0.99667798702284 -0.182938575717331 -0.046 -0.023
1.01021986716763 -0.170549699144622 -0.17 -0.026
0.96266134796077 -0.326719448659703 -0.036 -0.018
0.93593245045598 -0.338311214634291 -0.058 -0.029
0.949874717824797 -0.32310121853494 -0.016 -0.008
0.947580648449922 -0.323793599257922 -0.038 -0.019
0.959200035172664 -0.246946010509063 -0 -0
0.966211937221426 -0.242708829011205 -0.06 -0.03
0.975828096685406 -0.237972435511768 -0 -0
0.984886491012918 -0.234675579381965 -0 -0
1.01281248844604 -0.222261101930515 -0.14 -0.07
0.982823076232272 -0.235462936190148 -0 -0
0.972810690223218 -0.238381232493291 -0 -0
0.996216751833541 -0.245684415509554 -0.063 -0.03
0.966525945573422 -0.271098326601465 -0.071 -0.044
1.0095637891532 -0.198171496767795 -0.02 -0.01
1.01679860329126 -0.206934338657575 -0.12 -0.018
1.03600497002803 -0.161793679463208 -0 -0
1.05979746436263 -0.194012020173174 -0 -0
1.0332513718941 -0.21836844082059 -0.297 -0.116
1.02735055440125 -0.220097477137725 -0 -0
1.03624558296624 -0.225777223683244 -0.18 -0.085
1.02333610636492 -0.234095988591858 -0.21 -0.105
1.05226209009818 -0.218749063939996 -0.18 -0.053
0.980368498860323 -0.200670277404627 -0.049 -0.022
0.970945515106894 -0.213848047595914 -0.2 -0.1
0.996318796975228 -0.204372056043926 -0.041 -0.014
1.03078604389874 -0.188515229209425 -0.068 -0.034
0.968368536488357 -0.280388351634608 -0.076 -0.022
0.964826005695356 -0.289440119761801 -0.067 -0.02
