@startuml

:convert to UTF-8;
note left
    some characters
    were misencoded
end note

:tokenisation;

:clean;
note right
    e.g. removing HTML
end note

:lower case;

:POS-tagging;

:stopwording;

:removing
    - punctuations
    - numbers
    - whitespaces
    - quotes
    - emails
    - links;

:keeping
    - nouns
    - adjectives
    - verbs
    - adverbs;

:lemmatisation;

@enduml