measure,min,max,mean,median,standard deviation,variance
Accuracy,0.9775030401297122,0.9999746655857317,0.9995206339854559,0.9997466558573166,0.0007815718780767506,6.108546006004191e-07
F Measure,0.0,0.0,0.0,0.0,0.0,0.0
Precision,0.0,1.0,0.0002547554347826087,0.0,0.01595970439013322,0.0002547121642204376
Recall,0.0,1.0,0.14724864130434784,0.0,0.3543686537466861,0.1255771427582387
