measure,min,max,mean,median,standard deviation,variance
Accuracy,0.9777310498581273,1.0,0.9996819558594645,0.9998986623429267,0.0007573605310719516,5.735949740255886e-07
F Measure,0.0,2.0,0.2944972826086957,0.0,0.7087373074933722,0.5023085710329548
Precision,1.0,1.0,1.0,1.0,0.0,0.0
Recall,0.0,1.0,0.14724864130434784,0.0,0.3543686537466861,0.1255771427582387
