measure,min,max,mean,median,standard deviation,variance
Accuracy,0.9774777057154439,0.9999746655857317,0.9994411003610429,0.9996706526145116,0.0007623202107447646,5.811321037099423e-07
F Measure,0.0,0.0,0.0,0.0,0.0,0.0
Precision,0.0,1.0,0.0014436141304347825,0.0,0.03796909969457213,0.0014416525316163574
Recall,0.0,1.0,0.14724864130434784,0.0,0.3543686537466861,0.1255771427582387
