measure,min,max,mean,median,standard deviation,variance
Accuracy,0.9774777057154439,1.0,0.9995653435470493,0.9998226591001216,0.0008085137035263477,6.536944087898909e-07
F Measure,0.0,2.0,0.2944972826086957,0.0,0.7087373074933722,0.5023085710329548
Precision,0.0,1.0,0.16355298913043478,0.0,0.3698851537988931,0.13681502700083079
Recall,0.0,1.0,0.14724864130434784,0.0,0.3543686537466861,0.1255771427582387
