<?xml version="1.0" encoding="UTF-8" standalone="no"?>
<svg
   xmlns:dc="http://purl.org/dc/elements/1.1/"
   xmlns:cc="http://creativecommons.org/ns#"
   xmlns:rdf="http://www.w3.org/1999/02/22-rdf-syntax-ns#"
   xmlns:svg="http://www.w3.org/2000/svg"
   xmlns="http://www.w3.org/2000/svg"
   id="svg8"
   version="1.1"
   viewBox="0 0 113.58997 39.288555"
   height="39.288555mm"
   width="113.58997mm">
  <defs
     id="defs2" />
  <metadata
     id="metadata5">
    <rdf:RDF>
      <cc:Work
         rdf:about="">
        <dc:format>image/svg+xml</dc:format>
        <dc:type
           rdf:resource="http://purl.org/dc/dcmitype/StillImage" />
        <dc:title></dc:title>
      </cc:Work>
    </rdf:RDF>
  </metadata>
  <g
     transform="translate(-23.519494,-63.9408)"
     id="layer1"
     style="fill:#ffcc00">
    <path
       id="path10"
       transform="scale(0.26458333)"
       d="M 303.55078,241.66602 A 214.65741,74.246218 0 0 0 88.892578,315.91211 214.65741,74.246218 0 0 0 303.55078,390.1582 214.65741,74.246218 0 0 0 518.20898,315.91211 214.65741,74.246218 0 0 0 303.55078,241.66602 Z m 0,9.43359 a 187.38329,64.812581 0 0 1 187.38281,64.8125 187.38329,64.812581 0 0 1 -187.38281,64.8125 187.38329,64.812581 0 0 1 -187.38281,-64.8125 187.38329,64.812581 0 0 1 187.38281,-64.8125 z"
       style="opacity:0.82599996;fill:#ffcc00;fill-opacity:1;fill-rule:nonzero;stroke:none;stroke-width:1.99999988;stroke-miterlimit:4;stroke-dasharray:none;stroke-opacity:1" />
    <path
       id="path15"
       transform="scale(0.26458333)"
       d="m 303.55078,255.05078 c -16.25866,0.0186 -32.17886,2.07929 -47.8041,3.63379 l -66.59562,8.85527 c 15.49621,-1.7903 98.06204,-7.00716 114.39971,-7.02948 16.45287,0.015 91.3808,4.47965 106.98144,6.28749 l -58.58885,-7.8627 c -15.73369,-1.56451 -32.02163,-3.87714 -48.39258,-3.88437 z m 131.82498,102.53086 c -92.621,16.21047 -115.36844,13.96224 -131.82499,13.98476 -16.33341,-0.0135 -29.70368,2.44345 -114.39971,-13.98476 l 66.34308,16.86172 c 15.63088,1.54063 31.80351,2.32478 48.05664,2.33008 16.3752,-0.0174 32.66322,-0.82531 48.39258,-2.40039 z"
       style="opacity:0.82599996;fill:#ffcc00;fill-opacity:1;fill-rule:nonzero;stroke:none;stroke-width:1.63945508;stroke-miterlimit:4;stroke-dasharray:none;stroke-opacity:1" />
    <path
       id="path23"
       d="m 60.803801,75.166056 c -13.869705,1.7e-5 -25.113274,3.889005 -25.113194,8.686292 -7.8e-5,4.797286 11.24349,8.686274 25.113194,8.686291 V 91.43483 c -12.107214,-4.6e-5 -21.922022,-3.39481 -21.922176,-7.582482 1.54e-4,-4.187672 13.022211,-4.276071 25.129425,-4.276117 z"
       style="opacity:1;fill:#ffcc00;fill-opacity:1;fill-rule:nonzero;stroke:none;stroke-width:0.23398475;stroke-miterlimit:4;stroke-dasharray:none;stroke-opacity:1" />
    <g
       style="display:inline;fill:#ffcc00"
       id="g44">
      <path
         id="path28"
         d="M 121.8749,82.78347 A 10.891243,8.9535294 0 0 1 110.98366,91.737 10.891243,8.9535294 0 0 1 100.09241,82.78347 10.891243,8.9535294 0 0 1 110.98366,73.829941 10.891243,8.9535294 0 0 1 121.8749,82.78347 Z"
         style="display:inline;opacity:1;fill:#ffcc00;fill-opacity:1;fill-rule:nonzero;stroke:none;stroke-width:0.52916664;stroke-miterlimit:4;stroke-dasharray:none;stroke-opacity:1" />
      <path
         id="ellipse30"
         d="m 120.00401,82.78347 a 9.0203562,7.4155011 0 0 1 -9.02035,7.415501 9.0203562,7.4155011 0 0 1 -9.02036,-7.415501 9.0203562,7.4155011 0 0 1 9.02036,-7.415501 9.0203562,7.4155011 0 0 1 9.02035,7.415501 z"
         style="display:inline;opacity:0.82599996;fill:#ffcc00;fill-opacity:1;fill-rule:nonzero;stroke:none;stroke-width:0.43826693;stroke-miterlimit:4;stroke-dasharray:none;stroke-opacity:1" />
      <path
         id="rect32"
         d="m 100.02562,82.716652 h 1.87089 v 9.020351 h -1.87089 z"
         style="display:inline;opacity:1;fill:#ffcc00;fill-opacity:1;fill-rule:nonzero;stroke:none;stroke-width:0.51817948;stroke-miterlimit:4;stroke-dasharray:none;stroke-opacity:1" />
    </g>
    <path
       id="rect52"
       d="m 58.064304,84.119827 h 2.739513 v 7.61718 h -2.739513 z"
       style="opacity:1;fill:#ffcc00;fill-opacity:1;fill-rule:nonzero;stroke:none;stroke-width:0.52916664;stroke-miterlimit:4;stroke-dasharray:none;stroke-opacity:1" />
    <g
       id="text56"
       style="font-style:normal;font-weight:normal;font-size:10.58333302px;line-height:1.25;font-family:sans-serif;letter-spacing:0px;word-spacing:0px;fill:#ffcc00;fill-opacity:1;stroke:none;stroke-width:0.26458332"
       aria-label="zmitry">
      <path
         id="path22"
         style="font-style:normal;font-variant:normal;font-weight:normal;font-stretch:normal;font-size:8.46666622px;font-family:Bebit-Gradient;-inkscape-font-specification:Bebit-Gradient;fill:#ffcc00;stroke-width:0.26458332"
         d="m 64.464587,91.599703 h 4.4196 v 0.2032 h -4.512733 z m 0.127,-0.296334 h 4.2926 v 0.2032 H 64.50692 Z m 0.127,-0.287866 h 4.1656 v 0.194733 H 64.63392 Z m 0.135467,-0.296334 h 4.030133 v 0.186267 h -4.1148 z m 0.127,-0.287866 h 3.903133 v 0.1778 h -3.979333 z m 0.135466,-0.296334 h 3.767667 v 0.169334 H 65.04032 Z m 0.127,-0.287866 h 3.640667 v 0.160866 H 65.16732 Z m 0.127,-0.296334 h 3.513667 v 0.1524 h -3.5814 z m -0.651933,-2.345266 h 3.496733 l -0.04233,0.1016 h -3.4544 z m 0,0.296333 h 3.369733 l -0.04233,0.1016 h -3.3274 z m 0,-0.5842 h 3.623733 l -0.04233,0.09313 h -3.5814 z m 0,-0.296333 h 3.7592 l -0.04233,0.08467 h -3.716866 z m 0,-0.287867 h 3.8862 l -0.03387,0.0762 h -3.852333 z m 0.7874,2.921 h 1.820333 l -0.06773,0.1524 h -1.820333 z m -0.7874,-3.217333 h 4.0132 l -0.03387,0.06773 h -3.979333 z m 0.9144,2.929466 h 1.820333 l -0.05927,0.143934 h -1.828799 z m 0.127,-0.296333 h 1.8288 l -0.05927,0.135467 h -1.8288 z m -1.0414,-2.921 h 4.1402 l -0.0254,0.05927 h -4.1148 z m 1.1684,2.633134 h 1.8288 l -0.05927,0.126999 h -1.820333 z m 0.127,-0.296334 h 1.8288 l -0.0508,0.118534 h -1.8288 z m 0.135467,-0.287866 h 1.811866 l -0.04233,0.110066 h -1.820333 z" />
      <path
         id="path24"
         style="font-style:normal;font-variant:normal;font-weight:normal;font-stretch:normal;font-size:8.46666622px;font-family:Bebit-Gradient;-inkscape-font-specification:Bebit-Gradient;fill:#ffcc00;stroke-width:0.26458332"
         d="m 69.638381,89.847103 h 6.6548 v 0.160866 h -6.6548 z m 0,-0.296334 h 6.6548 v 0.1524 h -6.6548 z m 0,-0.296333 h 6.6548 v 0.1524 h -6.6548 z m 0,-0.287867 h 6.6548 v 0.143934 h -6.6548 z m 0,-0.296333 h 6.6548 v 0.135467 h -6.6548 z m 0,-0.287866 h 6.6548 v 0.126999 h -6.6548 z m 0,-0.296334 h 6.6548 v 0.118534 h -6.6548 z m 0,-0.287866 h 6.6548 v 0.110066 h -6.6548 z m 0,3.801533 h 2.2098 v 0.2032 h -2.2098 z m 0,-0.296334 h 2.2098 v 0.2032 h -2.2098 z m 4.445,0.296334 h 2.2098 v 0.2032 h -2.2098 z m 0,-0.296334 h 2.2098 v 0.2032 h -2.2098 z m -4.445,-0.287866 h 2.2098 v 0.194733 h -2.2098 z m 4.445,0 h 2.2098 v 0.194733 h -2.2098 z m -4.445,-0.296334 h 2.2098 v 0.186267 h -2.2098 z m 4.445,0 h 2.2098 v 0.186267 h -2.2098 z m -4.445,-0.287866 h 2.2098 v 0.1778 h -2.2098 z m 4.445,0 h 2.2098 v 0.1778 h -2.2098 z m -4.445,-0.296334 h 2.2098 v 0.169334 h -2.2098 z m 4.445,0 h 2.2098 v 0.169334 h -2.2098 z m -1.989666,1.464734 h 1.744133 v 0.2032 h -1.744133 z m 0,-0.296334 h 1.744133 v 0.2032 h -1.744133 z m 0,-0.287866 h 1.744133 v 0.194733 h -1.744133 z m 0,-0.296334 h 1.744133 v 0.186267 h -1.744133 z m -2.455334,-3.217333 h 3.056467 l 0.1524,0.1016 h -3.208867 z m 3.589867,0 h 3.064933 v 0.1016 h -3.217333 z m -1.134533,2.929467 h 1.744133 v 0.1778 h -1.744133 z m 0,-0.296334 h 1.744133 v 0.169334 h -1.744133 z m 1.583266,-2.929466 h 2.6162 v 0.1016 h -2.7686 z m -4.0386,0 h 2.607734 l 0.1524,0.1016 h -2.760134 z m 4.4704,-0.287867 h 2.1844 v 0.09313 h -2.328333 z m -4.4704,0 h 2.175934 l 0.135466,0.09313 h -2.3114 z m 4.910667,-0.296333 h 1.744133 v 0.08467 h -1.871133 z m -4.910667,0 h 1.7272 l 0.127,0.08467 h -1.8542 z m 5.350934,-0.287867 h 1.303866 v 0.0762 h -1.4224 z m -5.350934,0 h 1.2954 l 0.110067,0.0762 h -1.405467 z m 5.799667,-0.296333 h 0.855133 v 0.06773 h -0.956733 z m -5.799667,0 h 0.846667 l 0.1016,0.06773 h -0.948267 z m 6.231467,-0.287867 h 0.423333 v 0.05927 h -0.516467 z m -6.231467,0 h 0.414867 l 0.09313,0.05927 h -0.508 z m 6.6548,-0.2794 v 0.03387 h -0.0508 z m -6.6548,0 0.0508,0.03387 h -0.0508 z" />
      <path
         id="path26"
         style="font-style:normal;font-variant:normal;font-weight:normal;font-stretch:normal;font-size:8.46666622px;font-family:Bebit-Gradient;-inkscape-font-specification:Bebit-Gradient;fill:#ffcc00;stroke-width:0.26458332"
         d="m 77.195542,91.599703 h 2.2098 v 0.2032 h -2.2098 z m 0,-0.296334 h 2.2098 v 0.2032 h -2.2098 z m 0,-0.287866 h 2.2098 v 0.194733 h -2.2098 z m 0,-0.296334 h 2.2098 v 0.186267 h -2.2098 z m 0,-0.287866 h 2.2098 v 0.1778 h -2.2098 z m 0,-0.296334 h 2.2098 v 0.169334 h -2.2098 z m 0,-0.287866 h 2.2098 v 0.160866 h -2.2098 z m 0,-0.296334 h 2.2098 v 0.1524 h -2.2098 z m 0,-0.296333 h 2.2098 v 0.1524 h -2.2098 z m 0,-0.287867 h 2.2098 v 0.143934 h -2.2098 z m 0,-0.296333 h 2.2098 v 0.135467 h -2.2098 z m 0,-0.287866 h 2.2098 v 0.126999 h -2.2098 z m 0,-0.296334 h 2.2098 v 0.118534 h -2.2098 z m 0,-0.287866 h 2.2098 v 0.110066 h -2.2098 z m 0,-0.592667 h 2.2098 v 0.1016 h -2.2098 z m 0,0.296333 h 2.2098 v 0.1016 h -2.2098 z m 0,-0.5842 h 2.2098 v 0.09313 h -2.2098 z m 0,-0.296333 h 2.2098 v 0.08467 h -2.2098 z m 0,-0.287867 h 2.2098 v 0.0762 h -2.2098 z m 0,-0.296333 h 2.2098 v 0.06773 h -2.2098 z m 0,-0.287867 h 2.2098 v 0.05927 h -2.2098 z" />
      <path
         id="path29"
         style="font-style:normal;font-variant:normal;font-weight:normal;font-stretch:normal;font-size:8.46666622px;font-family:Bebit-Gradient;-inkscape-font-specification:Bebit-Gradient;fill:#ffcc00;stroke-width:0.26458332"
         d="m 80.151997,87.501836 h 4.927599 v 0.1016 h -4.927599 z m 0,-0.296333 h 4.927599 v 0.1016 h -4.927599 z m 0,-0.287867 h 4.927599 v 0.09313 h -4.927599 z m 1.380066,4.682067 h 2.175933 v 0.2032 h -2.175933 z m 0,-0.296334 h 2.175933 v 0.2032 h -2.175933 z m 0,-0.287866 h 2.175933 v 0.194733 h -2.175933 z m -1.380066,-4.3942 h 4.927599 v 0.08467 h -4.927599 z m 1.380066,4.097866 h 2.175933 v 0.186267 h -2.175933 z m 0,-0.287866 h 2.175933 v 0.1778 h -2.175933 z m -1.380066,-4.097867 h 4.927599 v 0.0762 h -4.927599 z m 1.380066,3.801533 h 2.175933 v 0.169334 h -2.175933 z m 0,-0.287866 h 2.175933 v 0.160866 h -2.175933 z m -1.380066,-3.81 h 4.927599 v 0.06773 h -4.927599 z m 1.380066,3.513666 h 2.175933 v 0.1524 h -2.175933 z m 0,-0.296333 h 2.175933 v 0.1524 h -2.175933 z m 0,-0.287867 h 2.175933 v 0.143934 h -2.175933 z m 0,-0.296333 h 2.175933 v 0.135467 h -2.175933 z m -1.380066,-2.921 h 4.927599 v 0.05927 h -4.927599 z m 1.380066,2.633134 h 2.175933 v 0.126999 h -2.175933 z m 0,-0.296334 h 2.175933 v 0.118534 h -2.175933 z m 0,-0.287866 h 2.175933 v 0.110066 h -2.175933 z" />
      <path
         id="path31"
         style="font-style:normal;font-variant:normal;font-weight:normal;font-stretch:normal;font-size:8.46666622px;font-family:Bebit-Gradient;-inkscape-font-specification:Bebit-Gradient;fill:#ffcc00;stroke-width:0.26458332"
         d="m 85.827573,89.847103 h 3.920066 l 0.09313,0.160866 h -4.0132 z m 4.207933,-0.880534 q -0.05927,0.0762 -0.135467,0.143934 h -4.072466 v -0.143934 z m 0.194733,-0.287866 q -0.03387,0.06773 -0.0762,0.127 h -4.326466 v -0.135467 h 4.411133 z m -0.491066,0.575733 q -0.1016,0.08467 -0.220134,0.1524 h -3.691466 v -0.1524 z m -3.9116,0.296333 h 3.7592 l 0.08467,0.1524 h -3.843866 z m 4.5466,-1.168399 q -0.0254,0.06773 -0.0508,0.126999 h -4.4958 V 88.38237 Z m 0.0762,-0.296334 q -0.0085,0.05927 -0.0254,0.118534 h -4.5974 v -0.118534 z m -2.3114,3.513667 h 2.5908 l 0.110066,0.2032 h -2.700866 z m 2.353733,-3.801533 q -0.0085,0.05927 -0.01693,0.110066 h -4.6482 V 87.79817 Z m -2.353733,3.505199 h 2.421466 l 0.118534,0.2032 h -2.54 z m 2.302933,-4.097866 q 0.0085,0.0508 0.01693,0.1016 H 85.82757 v -0.1016 z m -2.302933,3.81 h 2.2606 l 0.110066,0.194733 h -2.370666 z m 2.2098,-4.097867 q 0.01693,0.0508 0.03387,0.09313 h -4.555066 v -0.09313 z m -4.5212,4.682067 h 2.065866 v 0.2032 h -2.065866 z m 0,-0.296334 h 2.065866 v 0.2032 h -2.065866 z m 0,-0.287866 h 2.065866 v 0.194733 h -2.065866 z m 2.3114,-0.296334 h 2.099733 l 0.1016,0.186267 h -2.201333 z m -2.3114,0 h 2.065866 v 0.186267 h -2.065866 z m 4.3688,-4.097866 q 0.0254,0.04233 0.0508,0.08467 h -4.4196 v -0.08467 z m -4.3688,3.81 h 2.065866 v 0.1778 h -2.065866 z m 2.3114,0 h 1.938866 l 0.09313,0.1778 h -2.032 z m -2.3114,-0.296334 h 2.065866 v 0.169334 h -2.065866 z m 0,-3.801533 h 4.148666 q 0.03387,0.04233 0.06773,0.0762 h -4.2164 z m 2.3114,3.801533 h 1.769533 l 0.09313,0.169334 H 88.13897 Z m 2.345266,-2.633133 q 0.0085,0.0508 0.0085,0.1016 h -2.599267 v -0.1016 z m -0.745066,-1.397 h -3.9116 v -0.06773 h 3.826933 z m -0.6858,-0.3556 q 0.09313,0.0254 0.1778,0.05927 h -3.4036 v -0.05927 z" />
      <path
         id="path33"
         style="font-style:normal;font-variant:normal;font-weight:normal;font-stretch:normal;font-size:8.46666622px;font-family:Bebit-Gradient;-inkscape-font-specification:Bebit-Gradient;fill:#ffcc00;stroke-width:0.26458332"
         d="m 92.755026,91.599703 h 2.218266 v 0.2032 h -2.218266 z m 0,-0.296334 h 2.218266 v 0.2032 h -2.218266 z m 0,-0.287866 h 2.218266 v 0.194733 h -2.218266 z m 0,-0.296334 h 2.218266 v 0.186267 h -2.218266 z m 0,-0.287866 h 2.218266 v 0.1778 h -2.218266 z m 0,-0.296334 h 2.218266 v 0.169334 h -2.218266 z m -0.719667,-2.633133 h 3.683 l -0.05927,0.1016 h -3.564466 z m 0.169333,0.296334 h 3.335867 l -0.05927,0.110066 h -3.217333 z m 0.550334,2.048933 h 2.218266 v 0.160866 h -2.218266 z m -0.389467,-1.761067 h 3.005667 l -0.06773,0.118534 h -2.8702 z m 0.389467,1.464733 h 2.218266 v 0.1524 h -2.218266 z m 0,-0.296333 h 2.218266 v 0.1524 h -2.218266 z m -0.2286,-0.872066 h 2.675466 l -0.0762,0.126999 h -2.523066 z m 0.2286,0.584199 h 2.218266 v 0.143934 h -2.218266 z m 2.218266,-0.160866 h -2.218266 v -0.0254 l -0.06773,-0.110067 h 2.345267 l -0.05927,0.110067 z m -3.0988,-1.6002 h 1.905 v 0.1016 h -1.8542 z m -0.160866,-0.287867 h 2.065866 v 0.09313 h -2.015066 z m 2.3114,0 h 2.032 l -0.0508,0.09313 h -1.9812 z m -2.480734,-0.296333 h 2.2352 v 0.08467 h -2.1844 z m 2.480734,0.5842 h 1.862666 l -0.05927,0.1016 h -1.8034 z m 0,-0.5842 h 2.2098 l -0.0508,0.08467 h -2.159 z m -2.6416,-0.287867 h 2.396066 v 0.0762 h -2.353733 z m 2.6416,0 h 2.370666 l -0.04233,0.0762 h -2.328333 z m -2.802467,-0.296333 h 2.556933 v 0.06773 h -2.523066 z m 2.802467,0 h 2.548466 l -0.04233,0.06773 h -2.506133 z m 0,-0.287867 h 2.7178 l -0.03387,0.05927 h -2.683933 z m -2.963334,0 h 2.7178 v 0.05927 h -2.683933 z" />
    </g>
  </g>
</svg>
