<?xml version="1.0" encoding="UTF-8" standalone="no"?>
<svg
   xmlns:dc="http://purl.org/dc/elements/1.1/"
   xmlns:cc="http://creativecommons.org/ns#"
   xmlns:rdf="http://www.w3.org/1999/02/22-rdf-syntax-ns#"
   xmlns:svg="http://www.w3.org/2000/svg"
   xmlns="http://www.w3.org/2000/svg"
   xml:space="preserve"
   viewBox="0 0 902.12071 904.0698"
   height="904.06982"
   width="902.12073"
   y="0px"
   x="0px"
   id="Capa_1"
   version="1.1"><metadata
   id="metadata47"><rdf:RDF><cc:Work
       rdf:about=""><dc:format>image/svg+xml</dc:format><dc:type
         rdf:resource="http://purl.org/dc/dcmitype/StillImage" /><dc:title></dc:title></cc:Work></rdf:RDF></metadata><defs
   id="defs45" />
<g
   transform="translate(615.2619,369.25888)"
   style="display:none;fill:#28b197;fill-opacity:1"
   id="g10">
	<g
   style="fill:#28b197;fill-opacity:1"
   id="g8">
		<polygon
   style="fill:#28b197;fill-opacity:1"
   id="polygon2"
   points="0,189.946 241.897,306.471 484.006,189.845 484.006,179.186 241.897,62.561 0,179.083 " />
		<path
   style="fill:#28b197;fill-opacity:1"
   id="path4"
   d="m 83.808,251.571 v 69.7 l 145.836,70.25 h 24.506 l 145.435,-70.057 c 0.14,-0.307 0.271,-0.613 0.402,-0.922 V 251.57 l -158.09,76.152 z" />
		<polygon
   style="fill:#28b197;fill-opacity:1"
   id="polygon6"
   points="458.506,358.195 458.506,222.599 439.359,232.255 439.359,358.195 426.883,396.203 445.742,421.445 452.123,421.445 470.981,396.203 " />
	</g>
</g>
<g
   transform="translate(615.2619,369.25888)"
   id="g12">
</g>
<g
   transform="translate(615.2619,369.25888)"
   id="g14">
</g>
<g
   transform="translate(615.2619,369.25888)"
   id="g16">
</g>
<g
   transform="translate(615.2619,369.25888)"
   id="g18">
</g>
<g
   transform="translate(615.2619,369.25888)"
   id="g20">
</g>
<g
   transform="translate(615.2619,369.25888)"
   id="g22">
</g>
<g
   transform="translate(615.2619,369.25888)"
   id="g24">
</g>
<g
   transform="translate(615.2619,369.25888)"
   id="g26">
</g>
<g
   transform="translate(615.2619,369.25888)"
   id="g28">
</g>
<g
   transform="translate(615.2619,369.25888)"
   id="g30">
</g>
<g
   transform="translate(615.2619,369.25888)"
   id="g32">
</g>
<g
   transform="translate(615.2619,369.25888)"
   id="g34">
</g>
<g
   transform="translate(615.2619,369.25888)"
   id="g36">
</g>
<g
   transform="translate(615.2619,369.25888)"
   id="g38">
</g>
<g
   transform="translate(615.2619,369.25888)"
   id="g40">
</g>
<rect
   y="0.10174561"
   x="2.0509033"
   height="164.06984"
   width="164.06984"
   id="rect931"
   style="opacity:0.82599996;fill:#28b197;fill-opacity:1;fill-rule:nonzero;stroke:none;stroke-width:2;stroke-miterlimit:4;stroke-dasharray:none;stroke-opacity:1" /><rect
   style="opacity:0.82599996;fill:#28b197;fill-opacity:1;fill-rule:nonzero;stroke:none;stroke-width:2;stroke-miterlimit:4;stroke-dasharray:none;stroke-opacity:1"
   id="rect933"
   width="164.06984"
   height="164.06984"
   x="0"
   y="188.78206" /><rect
   y="374"
   x="2.0509033"
   height="164.06984"
   width="164.06984"
   id="rect935"
   style="opacity:0.82599996;fill:#28b197;fill-opacity:1;fill-rule:nonzero;stroke:none;stroke-width:2;stroke-miterlimit:4;stroke-dasharray:none;stroke-opacity:1" /><rect
   style="opacity:0.82599996;fill:#28b197;fill-opacity:1;fill-rule:nonzero;stroke:none;stroke-width:2;stroke-miterlimit:4;stroke-dasharray:none;stroke-opacity:1"
   id="rect937"
   width="164.06984"
   height="164.06984"
   x="0"
   y="560.15259" /><rect
   y="558.06982"
   x="182.0509"
   height="164.06984"
   width="164.06984"
   id="rect939"
   style="opacity:0.82599996;fill:#28b197;fill-opacity:1;fill-rule:nonzero;stroke:none;stroke-width:2;stroke-miterlimit:4;stroke-dasharray:none;stroke-opacity:1" /><rect
   style="opacity:0.82599996;fill:#28b197;fill-opacity:1;fill-rule:nonzero;stroke:none;stroke-width:2;stroke-miterlimit:4;stroke-dasharray:none;stroke-opacity:1"
   id="rect941"
   width="164.06984"
   height="164.06984"
   x="182.0509"
   y="740" /><rect
   style="opacity:0.82599996;fill:#28b197;fill-opacity:1;fill-rule:nonzero;stroke:none;stroke-width:2;stroke-miterlimit:4;stroke-dasharray:none;stroke-opacity:1"
   id="rect943"
   width="164.06984"
   height="164.06984"
   x="182.0509"
   y="374" /><rect
   y="188.78206"
   x="186.15265"
   height="164.06984"
   width="164.06984"
   id="rect945"
   style="opacity:0.82599996;fill:#28b197;fill-opacity:1;fill-rule:nonzero;stroke:none;stroke-width:2;stroke-miterlimit:4;stroke-dasharray:none;stroke-opacity:1" /><rect
   style="opacity:0.82599996;fill:#28b197;fill-opacity:1;fill-rule:nonzero;stroke:none;stroke-width:2;stroke-miterlimit:4;stroke-dasharray:none;stroke-opacity:1"
   id="rect947"
   width="164.06984"
   height="164.06984"
   x="188.20352"
   y="0.10174561" /><rect
   y="740"
   x="370.0509"
   height="164.06984"
   width="164.06984"
   id="rect949"
   style="opacity:0.82599996;fill:#28b197;fill-opacity:1;fill-rule:nonzero;stroke:none;stroke-width:2;stroke-miterlimit:4;stroke-dasharray:none;stroke-opacity:1" /><rect
   style="opacity:0.82599996;fill:#28b197;fill-opacity:1;fill-rule:nonzero;stroke:none;stroke-width:2;stroke-miterlimit:4;stroke-dasharray:none;stroke-opacity:1"
   id="rect951"
   width="164.06984"
   height="164.06984"
   x="370.0509"
   y="554" /><rect
   y="374"
   x="370.0509"
   height="164.06984"
   width="164.06984"
   id="rect953"
   style="opacity:0.82599996;fill:#28b197;fill-opacity:1;fill-rule:nonzero;stroke:none;stroke-width:2;stroke-miterlimit:4;stroke-dasharray:none;stroke-opacity:1" /><rect
   style="opacity:0.82599996;fill:#28b197;fill-opacity:1;fill-rule:nonzero;stroke:none;stroke-width:2;stroke-miterlimit:4;stroke-dasharray:none;stroke-opacity:1"
   id="rect955"
   width="164.06984"
   height="164.06984"
   x="368.20352"
   y="188.78206" /><rect
   style="opacity:0.82599996;fill:#28b197;fill-opacity:1;fill-rule:nonzero;stroke:none;stroke-width:2;stroke-miterlimit:4;stroke-dasharray:none;stroke-opacity:1"
   id="rect961"
   width="164.06984"
   height="164.06984"
   x="554.0509"
   y="740" /><rect
   y="554"
   x="554.0509"
   height="164.06984"
   width="164.06984"
   id="rect963"
   style="opacity:0.82599996;fill:#28b197;fill-opacity:1;fill-rule:nonzero;stroke:none;stroke-width:2;stroke-miterlimit:4;stroke-dasharray:none;stroke-opacity:1" /><rect
   style="opacity:0.82599996;fill:#28b197;fill-opacity:1;fill-rule:nonzero;stroke:none;stroke-width:2;stroke-miterlimit:4;stroke-dasharray:none;stroke-opacity:1"
   id="rect965"
   width="164.06984"
   height="164.06984"
   x="554.0509"
   y="374" /><rect
   y="740"
   x="738.0509"
   height="164.06984"
   width="164.06984"
   id="rect967"
   style="opacity:0.82599996;fill:#28b197;fill-opacity:1;fill-rule:nonzero;stroke:none;stroke-width:2;stroke-miterlimit:4;stroke-dasharray:none;stroke-opacity:1" /><rect
   style="opacity:0.82599996;fill:#28b197;fill-opacity:1;fill-rule:nonzero;stroke:none;stroke-width:2;stroke-miterlimit:4;stroke-dasharray:none;stroke-opacity:1"
   id="rect969"
   width="164.06984"
   height="164.06984"
   x="738.0509"
   y="554" /><rect
   style="opacity:0.82599996;fill:#28b197;fill-opacity:1;fill-rule:nonzero;stroke:none;stroke-width:2;stroke-miterlimit:4;stroke-dasharray:none;stroke-opacity:1"
   id="rect971"
   width="164.06984"
   height="164.06984"
   x="736.0509"
   y="0" /></svg>