<?xml version="1.0" encoding="UTF-8" standalone="no"?>
<svg
   xmlns:dc="http://purl.org/dc/elements/1.1/"
   xmlns:cc="http://creativecommons.org/ns#"
   xmlns:rdf="http://www.w3.org/1999/02/22-rdf-syntax-ns#"
   xmlns:svg="http://www.w3.org/2000/svg"
   xmlns="http://www.w3.org/2000/svg"
   xml:space="preserve"
   style="enable-background:new 0 0 484.006 484.006;"
   viewBox="0 0 484.006 484.006"
   height="484.006px"
   width="484.006px"
   y="0px"
   x="0px"
   id="Capa_1"
   version="1.1"><metadata
   id="metadata47"><rdf:RDF><cc:Work
       rdf:about=""><dc:format>image/svg+xml</dc:format><dc:type
         rdf:resource="http://purl.org/dc/dcmitype/StillImage" /><dc:title></dc:title></cc:Work></rdf:RDF></metadata><defs
   id="defs45" />
<g
   style="fill:#28b197;fill-opacity:1"
   id="g10">
	<g
   style="fill:#28b197;fill-opacity:1"
   id="g8">
		<polygon
   style="fill:#28b197;fill-opacity:1"
   id="polygon2"
   points="0,179.083 0,189.946 241.897,306.471 484.006,189.845 484.006,179.186 241.897,62.561 " />
		<path
   style="fill:#28b197;fill-opacity:1"
   id="path4"
   d="m 83.808,251.571 v 69.7 l 145.836,70.25 h 24.506 l 145.435,-70.057 c 0.14,-0.307 0.271,-0.613 0.402,-0.922 V 251.57 l -158.09,76.152 z" />
		<polygon
   style="fill:#28b197;fill-opacity:1"
   id="polygon6"
   points="439.359,358.195 426.883,396.203 445.742,421.445 452.123,421.445 470.981,396.203 458.506,358.195 458.506,222.599 439.359,232.255 " />
	</g>
</g>
<g
   id="g12">
</g>
<g
   id="g14">
</g>
<g
   id="g16">
</g>
<g
   id="g18">
</g>
<g
   id="g20">
</g>
<g
   id="g22">
</g>
<g
   id="g24">
</g>
<g
   id="g26">
</g>
<g
   id="g28">
</g>
<g
   id="g30">
</g>
<g
   id="g32">
</g>
<g
   id="g34">
</g>
<g
   id="g36">
</g>
<g
   id="g38">
</g>
<g
   id="g40">
</g>
</svg>