<?xml version="1.0" encoding="UTF-8" standalone="no"?>
<svg
   xmlns:dc="http://purl.org/dc/elements/1.1/"
   xmlns:cc="http://creativecommons.org/ns#"
   xmlns:rdf="http://www.w3.org/1999/02/22-rdf-syntax-ns#"
   xmlns:svg="http://www.w3.org/2000/svg"
   xmlns="http://www.w3.org/2000/svg"
   xml:space="preserve"
   style="enable-background:new 0 0 35.933 35.933;"
   viewBox="0 0 35.933 35.933"
   y="0px"
   x="0px"
   id="Capa_1"
   version="1.1"><metadata
   id="metadata71"><rdf:RDF><cc:Work
       rdf:about=""><dc:format>image/svg+xml</dc:format><dc:type
         rdf:resource="http://purl.org/dc/dcmitype/StillImage" /><dc:title></dc:title></cc:Work></rdf:RDF></metadata><defs
   id="defs69" />
<g
   style="fill:#28b197;fill-opacity:1"
   id="g34">
	<path
   style="fill:#28b197;fill-opacity:1"
   id="path2"
   d="M 29.646,10.461 C 26.506,7.768 22.431,6.13 17.964,6.13 8.043,6.13 0,14.173 0,24.099 c 0,0.266 0.026,2.75 0.038,3.015 v 2.69 H 35.86 V 27.31 l 0.034,-0.196 c 0.011,-0.266 0.039,-2.749 0.039,-3.015 10e-4,-8.808 -6.287,-13.638 -6.287,-13.638 z M 4.37,27.114 C 4.355,26.95 4.376,24.565 4.365,24.401 H 8.05 v -1.19 H 4.624 c 0,-0.014 -0.259,0.002 -0.259,0.002 0.145,-3.085 1.32,-6.163 3.539,-8.59 l 0.093,-0.1 0.166,0.144 2.452,2.454 0.77,-0.772 -2.605,-2.603 c 2.358,-2.156 5.35,-3.393 8.542,-3.535 l 0.185,-10e-4 c 0,0 0.077,-0.003 0.072,0.046 v 3.634 h 0.981 v -3.679 c 0.484,0.02 0.968,0.077 1.445,0.152 2.741,0.362 5.289,1.545 7.352,3.43 l -2.6,2.602 0.723,0.726 2.497,-2.498 0.138,-0.111 0.118,0.156 c 2.159,2.36 3.394,5.35 3.539,8.543 h -3.681 v 1.19 l 3.698,-0.005 c 0,0 0.003,2.561 -0.01,2.709 z M 22.8,18.528 c 0,0 -5.844,1.792 -6.963,2.909 -1.121,1.122 -1.121,2.935 0.002,4.057 1.117,1.121 2.932,1.121 4.054,0 1.118,-1.122 2.907,-6.966 2.907,-6.966 z" />
	<g
   style="fill:#28b197;fill-opacity:1"
   id="g4">
	</g>
	<g
   style="fill:#28b197;fill-opacity:1"
   id="g6">
	</g>
	<g
   style="fill:#28b197;fill-opacity:1"
   id="g8">
	</g>
	<g
   style="fill:#28b197;fill-opacity:1"
   id="g10">
	</g>
	<g
   style="fill:#28b197;fill-opacity:1"
   id="g12">
	</g>
	<g
   style="fill:#28b197;fill-opacity:1"
   id="g14">
	</g>
	<g
   style="fill:#28b197;fill-opacity:1"
   id="g16">
	</g>
	<g
   style="fill:#28b197;fill-opacity:1"
   id="g18">
	</g>
	<g
   style="fill:#28b197;fill-opacity:1"
   id="g20">
	</g>
	<g
   style="fill:#28b197;fill-opacity:1"
   id="g22">
	</g>
	<g
   style="fill:#28b197;fill-opacity:1"
   id="g24">
	</g>
	<g
   style="fill:#28b197;fill-opacity:1"
   id="g26">
	</g>
	<g
   style="fill:#28b197;fill-opacity:1"
   id="g28">
	</g>
	<g
   style="fill:#28b197;fill-opacity:1"
   id="g30">
	</g>
	<g
   style="fill:#28b197;fill-opacity:1"
   id="g32">
	</g>
</g>
<g
   id="g36">
</g>
<g
   id="g38">
</g>
<g
   id="g40">
</g>
<g
   id="g42">
</g>
<g
   id="g44">
</g>
<g
   id="g46">
</g>
<g
   id="g48">
</g>
<g
   id="g50">
</g>
<g
   id="g52">
</g>
<g
   id="g54">
</g>
<g
   id="g56">
</g>
<g
   id="g58">
</g>
<g
   id="g60">
</g>
<g
   id="g62">
</g>
<g
   id="g64">
</g>
</svg>