{
  "version": 3,
  "configurePresets": [
    {
      "name": "ninja/multi",
      "generator": "Ninja Multi-Config",
      "binaryDir": "${sourceParentDir}/${sourceDirName}-build",
      "hidden": true
    },
    {
      "name": "ci",
      "inherits": "ninja/multi",
      "cacheVariables": {
        "MCU": "stm32h7",
        "TARGET_CORE": "cortex-m7",
        "FLOAT_ABI": "hard",
        "FREERTOS_MINIMAL_STACK_SIZE": "1024"
      },
      "condition": {
        "type": "equals",
        "lhs": "$env{CI}",
        "rhs": "true"
      },
      "hidden": true
    },
    {
      "name": "ci/dynamic",
      "inherits": "ci",
      "cacheVariables": {
        "SATOS_DYNAMIC_ALLOCATION": "ON"
      },
      "hidden": true
    },
    {
      "name": "ci/static/build",
      "binaryDir": "${sourceDir}/build-static",
      "inherits": "ci"
    },
    {
      "name": "ci/static/tests",
      "binaryDir": "${sourceDir}/tests-static",
      "inherits": "ci"
    },
    {
      "name": "ci/dynamic/build",
      "binaryDir": "${sourceDir}/build-dynamic",
      "inherits": "ci/dynamic"
    },
    {
      "name": "ci/dynamic/tests",
      "binaryDir": "${sourceDir}/tests-dynamic",
      "inherits": "ci/dynamic"
    }
  ],
  "buildPresets": [
    {
      "name": "ci/build",
      "hidden": true,
      "configuration": "Release",
      "targets": ["satos"]
    },
    {
      "name": "ci/tests",
      "hidden": true,
      "configuration": "Release",
      "targets": ["all"]
    },
    {
      "name": "ci/static/build",
      "configurePreset": "ci/static/build",
      "inherits": "ci/build"
    },
    {
      "name": "ci/static/tests",
      "configurePreset": "ci/static/tests",
      "inherits": "ci/tests"
    },
    {
      "name": "ci/dynamic/build",
      "configurePreset": "ci/dynamic/build",
      "inherits": "ci/build"
    },
    {
      "name": "ci/dynamic/tests",
      "configurePreset": "ci/dynamic/tests",
      "inherits": "ci/tests"
    }
  ]
}
