{
  "version": 3,
  "configurePresets": [
    {
      "name": "ninja/multi",
      "generator": "Ninja Multi-Config",
      "binaryDir": "${sourceParentDir}/${sourceDirName}-build",
      "hidden": true
    },
    {
      "name": "ci",
      "inherits": "ninja/multi",
      "binaryDir": "${sourceDir}/build",
      "cacheVariables": {
        "MCU": "stm32l4"
      },
      "condition": {
        "type": "equals",
        "lhs": "$env{CI}",
        "rhs": "true"
      }
    },
    {
      "name": "ci/coverage",
      "inherits": "ci",
      "cacheVariables": {
        "ENABLE_COVERAGE": "ON"
      }
    }
  ],
  "buildPresets": [
    {
      "name": "ci/tests",
      "configuration": "Release",
      "configurePreset": "ci/coverage",
      "targets": ["tests"]
    },
    {
      "name": "ci/coverage",
      "configuration": "Release",
      "configurePreset": "ci/coverage",
      "targets": ["coverage"]
    },
    {
      "name": "ci/docs",
      "configuration": "Release",
      "configurePreset": "ci",
      "targets": ["docs"]
    }
  ]
}
