(footprint "VMA430" (version 20211014) (generator pcbnew)
  (layer "F.Cu")
  (tedit 0)
  (attr through_hole)
  (fp_text reference "REF**" (at 0 -0.5 unlocked) (layer "F.SilkS")
    (effects (font (size 1 1) (thickness 0.15)))
    (tstamp b4125104-8f19-4fda-be31-07f3a8be5d34)
  )
  (fp_text value "VMA430" (at 0.013199 1.159207 unlocked) (layer "F.Fab")
    (effects (font (size 1 1) (thickness 0.15)))
    (tstamp 53471ac8-6941-485a-8b31-493a7259c8c9)
  )
  (fp_text user "VMA430 GPS" (at 0 -22.86 unlocked) (layer "F.SilkS")
    (effects (font (size 1.5 1.5) (thickness 0.15)))
    (tstamp 0f8e9839-003e-4002-aa6e-c066bcb02c70)
  )
  (fp_text user "VCC" (at 5.08 -5.08 90 unlocked) (layer "F.SilkS")
    (effects (font (size 1 1) (thickness 0.15)))
    (tstamp 4240b30b-e8be-4588-b4ec-37ac95846d5e)
  )
  (fp_text user "RXD" (at -2.54 -5.08 90 unlocked) (layer "F.SilkS")
    (effects (font (size 1 1) (thickness 0.15)))
    (tstamp a0ab4876-c5b9-4dc3-9421-aa12a9c9c15c)
  )
  (fp_text user "TXD" (at 0 -5.08 90 unlocked) (layer "F.SilkS")
    (effects (font (size 1 1) (thickness 0.15)))
    (tstamp dc7bb6a8-e61c-4601-a792-970bc9b2aa73)
  )
  (fp_text user "PPS" (at -5.08 -5.08 90 unlocked) (layer "F.SilkS")
    (effects (font (size 1 1) (thickness 0.15)))
    (tstamp e2e0bbc4-7200-4beb-8480-a3cfbdff2062)
  )
  (fp_text user "GND" (at 2.54 -5.08 90 unlocked) (layer "F.SilkS")
    (effects (font (size 1 1) (thickness 0.15)))
    (tstamp ff92cbee-dce1-49b3-a4f7-de5713ec8627)
  )
  (fp_text user "${REFERENCE}" (at 0 2.5 unlocked) (layer "F.Fab")
    (effects (font (size 1 1) (thickness 0.15)))
    (tstamp 89c3fe60-0357-4670-9f78-711edd61ae37)
  )
  (fp_line (start -13 0.5) (end 13 0.5) (layer "F.SilkS") (width 0.12) (tstamp 024d66c7-4bc3-4e89-a451-1fe688f27b71))
  (fp_line (start 2 -49.5) (end 2 -39.5) (layer "F.SilkS") (width 0.12) (tstamp 04d22757-0c3b-4b24-a6d0-a64c52e8617c))
  (fp_line (start 2 -39.5) (end -13 -39.5) (layer "F.SilkS") (width 0.12) (tstamp 067ebd7d-3f68-4170-b7b2-23330decd9b2))
  (fp_line (start 13 -49.5) (end 2 -49.5) (layer "F.SilkS") (width 0.12) (tstamp 2efc25d5-c58f-4fc0-b4db-b5e0f284fff6))
  (fp_line (start 13 0.5) (end 13 -39.5) (layer "F.SilkS") (width 0.12) (tstamp 44be9253-8d5f-4c3a-bde1-eea94b029460))
  (fp_line (start -13 -39.5) (end -13 0.5) (layer "F.SilkS") (width 0.12) (tstamp 7e9ae486-07e4-4607-bf2d-9f0b40f9b555))
  (fp_line (start 13 -39.5) (end 13 -49.5) (layer "F.SilkS") (width 0.12) (tstamp 9f187d09-26b7-42b2-b537-59a5940d7e95))
  (fp_circle (center -10 -2.6) (end -8.4 -2.6) (layer "Edge.Cuts") (width 0.12) (fill none) (tstamp 3a845686-dc0f-417a-9a06-c91744e1c615))
  (fp_circle (center 10 -2.6) (end 11.6 -2.6) (layer "Edge.Cuts") (width 0.12) (fill none) (tstamp 87ca0c7c-303b-476e-b092-ea39ba77e171))
  (pad "1" thru_hole oval (at -5.08 -1.5 90) (size 2.5 1.524) (drill 0.85) (layers *.Cu *.Mask) (tstamp f3c6f883-b00a-4e88-ab8f-c8798134d592))
  (pad "2" thru_hole oval (at -2.54 -1.5 90) (size 2.5 1.524) (drill 0.85) (layers *.Cu *.Mask) (tstamp 1d452b85-5688-4743-9c45-f64324c32d17))
  (pad "3" thru_hole oval (at 0 -1.5 90) (size 2.5 1.524) (drill 0.85) (layers *.Cu *.Mask) (tstamp f46c6a94-d70c-48ce-93fd-9fa9b934e048))
  (pad "4" thru_hole oval (at 2.54 -1.5 90) (size 2.5 1.524) (drill 0.85) (layers *.Cu *.Mask) (tstamp 9b5140ae-d24a-403b-9c4b-16af3690416d))
  (pad "5" thru_hole oval (at 5.08 -1.5 90) (size 2.5 1.524) (drill 0.85) (layers *.Cu *.Mask) (tstamp 16820bf8-ab71-489d-9ff0-14647c71d7e9))
)
