(footprint "MB85RC256V" (version 20211014) (generator pcbnew)
  (layer "F.Cu")
  (tedit 0)
  (attr through_hole)
  (fp_text reference "REF**" (at 0 -0.5 unlocked) (layer "F.SilkS")
    (effects (font (size 1 1) (thickness 0.15)))
    (tstamp f419c401-5401-4dc2-ba61-aade9f78f616)
  )
  (fp_text value "MB85RC256V" (at 0 1 unlocked) (layer "F.Fab")
    (effects (font (size 1 1) (thickness 0.15)))
    (tstamp b30a8de3-6926-4d99-bb63-27b815c95ba9)
  )
  (fp_text user "SDA" (at 1.27 -5.715 90 unlocked) (layer "F.SilkS")
    (effects (font (size 1 1) (thickness 0.15)))
    (tstamp 121d0ca4-dd2f-4789-abac-1d28a0a29ee0)
  )
  (fp_text user "VCC" (at -8.89 -5.715 90 unlocked) (layer "F.SilkS")
    (effects (font (size 1 1) (thickness 0.15)))
    (tstamp 3879ebfe-5fb4-4fe1-8785-70bd33312e77)
  )
  (fp_text user "A1" (at 6.35 -5.715 90 unlocked) (layer "F.SilkS")
    (effects (font (size 1 1) (thickness 0.15)))
    (tstamp 432e992d-90da-4f9c-a077-71ef03759142)
  )
  (fp_text user "WP" (at -3.81 -5.715 90 unlocked) (layer "F.SilkS")
    (effects (font (size 1 1) (thickness 0.15)))
    (tstamp 514b1dfe-5551-4213-bc1e-74a5c714778b)
  )
  (fp_text user "A0" (at 8.89 -5.715 90 unlocked) (layer "F.SilkS")
    (effects (font (size 1 1) (thickness 0.15)))
    (tstamp 56fd2d8a-910a-4bed-b429-1bb811ca12c0)
  )
  (fp_text user "MB85RC256V" (at 0 -10.16 unlocked) (layer "F.SilkS")
    (effects (font (size 1 1) (thickness 0.15)))
    (tstamp 69830c1e-8bb0-46e0-913f-7d3fe8c831a7)
  )
  (fp_text user "A2" (at 3.81 -5.715 90 unlocked) (layer "F.SilkS")
    (effects (font (size 1 1) (thickness 0.15)))
    (tstamp a2e16ab3-2507-43b6-b17b-35416f2882ff)
  )
  (fp_text user "SCL" (at -1.27 -5.715 90 unlocked) (layer "F.SilkS")
    (effects (font (size 1 1) (thickness 0.15)))
    (tstamp a67448d6-4c25-4703-aecd-de1b52f12bfc)
  )
  (fp_text user "GND" (at -6.35 -5.715 90 unlocked) (layer "F.SilkS")
    (effects (font (size 1 1) (thickness 0.15)))
    (tstamp d69311dd-6e8a-4070-8b33-723c5b681df2)
  )
  (fp_text user "${REFERENCE}" (at 0 2.5 unlocked) (layer "F.Fab")
    (effects (font (size 1 1) (thickness 0.15)))
    (tstamp 935bb766-8f09-475b-a636-127d91be8191)
  )
  (fp_line (start 10.16 -12.7) (end 10.16 -2.54) (layer "F.SilkS") (width 0.12) (tstamp 2073c924-d11a-45cc-8a0b-2a8712920ede))
  (fp_line (start -7.62 -15.24) (end 7.62 -15.24) (layer "F.SilkS") (width 0.12) (tstamp 2626cc37-6686-4f9e-bccf-13f95889e9d4))
  (fp_line (start -10.16 -2.54) (end -10.16 -12.7) (layer "F.SilkS") (width 0.12) (tstamp a53e19ec-a1af-46d8-b39c-c24d15664ee5))
  (fp_line (start 7.62 0) (end -7.62 0) (layer "F.SilkS") (width 0.12) (tstamp cc679a79-9e1b-432b-84ba-d948a0112a54))
  (fp_arc (start -7.62 0) (mid -9.416051 -0.743949) (end -10.16 -2.54) (layer "F.SilkS") (width 0.12) (tstamp 0e2f1e97-4f3b-4722-b29a-c3ace4fa41dd))
  (fp_arc (start -10.16 -12.7) (mid -9.416051 -14.496051) (end -7.62 -15.24) (layer "F.SilkS") (width 0.12) (tstamp c83d58a7-feea-4d12-a5a6-4944877ba284))
  (fp_arc (start 7.62 -15.24) (mid 9.416051 -14.496051) (end 10.16 -12.7) (layer "F.SilkS") (width 0.12) (tstamp df4957eb-a3c7-4636-b49d-2fea5268f91d))
  (fp_arc (start 10.16 -2.54) (mid 9.416051 -0.743949) (end 7.62 0) (layer "F.SilkS") (width 0.12) (tstamp ea0545d9-16e6-4e38-93ef-2d5d00030f48))
  (fp_circle (center -7.62 -12.7) (end -6.35 -12.7) (layer "Edge.Cuts") (width 0.12) (fill none) (tstamp 0f36ecdd-465e-4bcb-b08e-d341ff1ad0d8))
  (fp_circle (center 7.62 -12.7) (end 8.89 -12.7) (layer "Edge.Cuts") (width 0.12) (fill none) (tstamp 15b3724c-63c6-466d-bace-9b283f7f3bb8))
  (pad "1" thru_hole oval (at -8.89 -2.54) (size 1.524 2.286) (drill 0.762) (layers *.Cu *.Mask) (tstamp fe97e2c4-5c62-4af7-8764-bb5b2c997b24))
  (pad "2" thru_hole oval (at -6.35 -2.54) (size 1.524 2.286) (drill 0.762) (layers *.Cu *.Mask) (tstamp 682c7e72-a96e-4a6a-8b90-9af079953198))
  (pad "3" thru_hole oval (at -3.81 -2.54) (size 1.524 2.286) (drill 0.762) (layers *.Cu *.Mask) (tstamp a785012e-ca7d-4190-87f3-4a71e329f6f8))
  (pad "4" thru_hole oval (at -1.27 -2.54) (size 1.524 2.286) (drill 0.762) (layers *.Cu *.Mask) (tstamp 26e4712f-c646-41c9-97e9-8e22508b9b33))
  (pad "5" thru_hole oval (at 1.27 -2.54) (size 1.524 2.286) (drill 0.762) (layers *.Cu *.Mask) (tstamp 44c54c48-bb37-4f96-bc6f-71b5cf52f637))
  (pad "6" thru_hole oval (at 3.81 -2.54) (size 1.524 2.286) (drill 0.762) (layers *.Cu *.Mask) (tstamp 7d3cdcee-8e07-488f-aa51-89d33ebcef2e))
  (pad "7" thru_hole oval (at 6.35 -2.54) (size 1.524 2.286) (drill 0.762) (layers *.Cu *.Mask) (tstamp ea88eae4-2ea2-48f8-81f8-32599c7e3ecf))
  (pad "8" thru_hole oval (at 8.89 -2.54) (size 1.524 2.286) (drill 0.762) (layers *.Cu *.Mask) (tstamp ff499bba-e6f5-4021-a661-65fce1e72b34))
)
