(footprint "LOGO" (version 20221018) (generator bitmap2component)
  (layer "F.Cu")
  (attr board_only exclude_from_pos_files exclude_from_bom)
  (fp_text reference "G***" (at 0 0) (layer "F.SilkS")
      (effects (font (size 1.5 1.5) (thickness 0.3)))
    (tstamp 8ba79f43-26d2-4f83-8e01-d2d5db919ca6)
  )
  (fp_text value "LOGO" (at 0.75 0) (layer "F.SilkS") hide
      (effects (font (size 1.5 1.5) (thickness 0.3)))
    (tstamp 5b1f9c39-0120-435b-b987-251c0ad04ede)
  )
  (fp_poly
    (pts
      (xy 11.966352 -0.293849)
      (xy 11.974013 -0.156781)
      (xy 11.976876 0.029211)
      (xy 11.975331 0.250703)
      (xy 11.969772 0.494274)
      (xy 11.960589 0.746500)
      (xy 11.948176 0.993960)
      (xy 11.932924 1.223230)
      (xy 11.916684 1.406917)
      (xy 11.902279 1.542081)
      (xy 11.889722 1.651345)
      (xy 11.880583 1.721548)
      (xy 11.876882 1.740687)
      (xy 11.845280 1.743587)
      (xy 11.760610 1.748171)
      (xy 11.632333 1.754013)
      (xy 11.469907 1.760688)
      (xy 11.282792 1.767770)
      (xy 11.242884 1.769210)
      (xy 10.614927 1.791693)
      (xy 10.576090 2.029775)
      (xy 10.497253 2.443447)
      (xy 10.392005 2.888056)
      (xy 10.266078 3.340869)
      (xy 10.163138 3.667304)
      (xy 10.104979 3.843396)
      (xy 10.054345 3.999086)
      (xy 10.014334 4.124653)
      (xy 9.988043 4.210374)
      (xy 9.978571 4.246527)
      (xy 9.978571 4.246540)
      (xy 10.004172 4.269395)
      (xy 10.075475 4.318606)
      (xy 10.184231 4.388857)
      (xy 10.322192 4.474828)
      (xy 10.481110 4.571202)
      (xy 10.495677 4.579916)
      (xy 10.656757 4.676788)
      (xy 10.798505 4.763204)
      (xy 10.912468 4.833915)
      (xy 10.990192 4.883672)
      (xy 11.023223 4.907223)
      (xy 11.023685 4.907824)
      (xy 11.016075 4.944405)
      (xy 10.984264 5.027078)
      (xy 10.932714 5.146324)
      (xy 10.865888 5.292626)
      (xy 10.788248 5.456466)
      (xy 10.704256 5.628326)
      (xy 10.618375 5.798689)
      (xy 10.535068 5.958037)
      (xy 10.506203 6.011540)
      (xy 10.393627 6.212391)
      (xy 10.270789 6.421584)
      (xy 10.142287 6.632225)
      (xy 10.012716 6.837416)
      (xy 9.886673 7.030263)
      (xy 9.768753 7.203869)
      (xy 9.663553 7.351338)
      (xy 9.575669 7.465773)
      (xy 9.509698 7.540279)
      (xy 9.470235 7.567960)
      (xy 9.468841 7.567983)
      (xy 9.430900 7.552530)
      (xy 9.347897 7.510709)
      (xy 9.228977 7.447390)
      (xy 9.083283 7.367446)
      (xy 8.919958 7.275746)
      (xy 8.915025 7.272945)
      (xy 8.398892 6.979875)
      (xy 8.305049 7.082183)
      (xy 8.251778 7.140995)
      (xy 8.166698 7.235778)
      (xy 8.059504 7.355692)
      (xy 7.939895 7.489899)
      (xy 7.874015 7.563983)
      (xy 7.718893 7.731906)
      (xy 7.536951 7.918477)
      (xy 7.349504 8.102383)
      (xy 7.177866 8.262310)
      (xy 7.157333 8.280665)
      (xy 7.019926 8.402938)
      (xy 6.890999 8.517995)
      (xy 6.781391 8.616140)
      (xy 6.701942 8.687675)
      (xy 6.675533 8.711699)
      (xy 6.573224 8.805542)
      (xy 6.866295 9.321675)
      (xy 6.958265 9.485377)
      (xy 7.038621 9.631714)
      (xy 7.102493 9.751544)
      (xy 7.145010 9.835723)
      (xy 7.161301 9.875108)
      (xy 7.161333 9.875491)
      (xy 7.136612 9.913257)
      (xy 7.064661 9.977801)
      (xy 6.952377 10.064527)
      (xy 6.806655 10.168838)
      (xy 6.634392 10.286139)
      (xy 6.442483 10.411833)
      (xy 6.237825 10.541324)
      (xy 6.027313 10.670015)
      (xy 5.817845 10.793312)
      (xy 5.616315 10.906617)
      (xy 5.604890 10.912853)
      (xy 5.451928 10.994112)
      (xy 5.284479 11.079571)
      (xy 5.112062 11.164769)
      (xy 4.944195 11.245242)
      (xy 4.790395 11.316529)
      (xy 4.660179 11.374167)
      (xy 4.563066 11.413693)
      (xy 4.508574 11.430645)
      (xy 4.501174 11.430335)
      (xy 4.479971 11.401289)
      (xy 4.432139 11.326865)
      (xy 4.362928 11.215520)
      (xy 4.277587 11.075705)
      (xy 4.181366 10.915874)
      (xy 4.173266 10.902327)
      (xy 4.076237 10.741974)
      (xy 3.989148 10.601859)
      (xy 3.917317 10.490230)
      (xy 3.866061 10.415336)
      (xy 3.840698 10.385425)
      (xy 3.839889 10.385222)
      (xy 3.803818 10.394666)
      (xy 3.718164 10.420933)
      (xy 3.592649 10.460926)
      (xy 3.436996 10.511547)
      (xy 3.260928 10.569697)
      (xy 3.260654 10.569788)
      (xy 2.816837 10.707175)
      (xy 2.364408 10.828164)
      (xy 1.926090 10.927026)
      (xy 1.623320 10.982707)
      (xy 1.385432 11.021512)
      (xy 1.363360 11.648896)
      (xy 1.356338 11.839809)
      (xy 1.349568 12.007985)
      (xy 1.343479 12.143946)
      (xy 1.338502 12.238217)
      (xy 1.335067 12.281320)
      (xy 1.334605 12.282964)
      (xy 1.302741 12.288894)
      (xy 1.222178 12.299538)
      (xy 1.106449 12.313187)
      (xy 1.015870 12.323175)
      (xy 0.848166 12.337257)
      (xy 0.633846 12.349301)
      (xy 0.386604 12.359076)
      (xy 0.120134 12.366350)
      (xy -0.151868 12.370893)
      (xy -0.415709 12.372473)
      (xy -0.657694 12.370859)
      (xy -0.864129 12.365819)
      (xy -1.016626 12.357504)
      (xy -1.180695 12.343657)
      (xy -1.349808 12.328283)
      (xy -1.495779 12.313977)
      (xy -1.540579 12.309224)
      (xy -1.751724 12.286061)
      (xy -1.752068 11.765752)
      (xy -1.753306 11.582400)
      (xy -1.756500 11.412785)
      (xy -1.761245 11.270385)
      (xy -1.767133 11.168678)
      (xy -1.771197 11.131869)
      (xy -1.789980 11.018295)
      (xy -2.028919 10.981026)
      (xy -2.315784 10.928693)
      (xy -2.641396 10.856550)
      (xy -2.987078 10.769623)
      (xy -3.334157 10.672939)
      (xy -3.663957 10.571523)
      (xy -3.957804 10.470403)
      (xy -4.037137 10.440498)
      (xy -4.242377 10.361190)
      (xy -4.546526 10.865878)
      (xy -4.643863 11.027332)
      (xy -4.731197 11.172077)
      (xy -4.802950 11.290878)
      (xy -4.853547 11.374503)
      (xy -4.877361 11.413641)
      (xy -4.897508 11.422509)
      (xy -4.941751 11.414970)
      (xy -5.016015 11.388591)
      (xy -5.126222 11.340938)
      (xy -5.278297 11.269578)
      (xy -5.478164 11.172076)
      (xy -5.541002 11.140997)
      (xy -5.732280 11.045562)
      (xy -5.911475 10.954995)
      (xy -6.068608 10.874429)
      (xy -6.193698 10.809000)
      (xy -6.276766 10.763842)
      (xy -6.296636 10.752210)
      (xy -6.415316 10.679142)
      (xy -5.999469 10.560087)
      (xy -5.572428 10.432998)
      (xy -5.102356 10.284495)
      (xy -4.603028 10.119363)
      (xy -4.088224 9.942391)
      (xy -3.571719 9.758367)
      (xy -3.067292 9.572078)
      (xy -2.588720 9.388312)
      (xy -2.321656 9.282037)
      (xy -1.906242 9.114245)
      (xy -1.539636 9.171654)
      (xy -1.319994 9.199140)
      (xy -1.053197 9.221517)
      (xy -0.754473 9.238388)
      (xy -0.439050 9.249358)
      (xy -0.122157 9.254030)
      (xy 0.180978 9.252008)
      (xy 0.455127 9.242894)
      (xy 0.658462 9.228866)
      (xy 1.328926 9.138333)
      (xy 2.005371 8.992131)
      (xy 2.676152 8.794089)
      (xy 3.329625 8.548034)
      (xy 3.954147 8.257793)
      (xy 4.445578 7.984019)
      (xy 5.070100 7.570914)
      (xy 5.656304 7.110972)
      (xy 6.201545 6.607511)
      (xy 6.703176 6.063844)
      (xy 7.158552 5.483286)
      (xy 7.565029 4.869153)
      (xy 7.919960 4.224760)
      (xy 8.220700 3.553422)
      (xy 8.418502 3.005353)
      (xy 8.524015 2.679301)
      (xy 9.008537 2.254614)
      (xy 9.344736 1.957589)
      (xy 9.659281 1.674397)
      (xy 9.963552 1.394364)
      (xy 10.268934 1.106821)
      (xy 10.586807 0.801095)
      (xy 10.928555 0.466515)
      (xy 11.156330 0.240988)
      (xy 11.943080 -0.540776)
    )

    (stroke (width 0.000000) (type solid)) (fill solid) (layer "F.SilkS") (tstamp e8b36dc3-44a3-41fb-9e3c-750aa2ab412a))
  (fp_poly
    (pts
      (xy 14.364805 -6.727497)
      (xy 14.506763 -6.701957)
      (xy 14.549932 -6.686663)
      (xy 14.693896 -6.601891)
      (xy 14.827047 -6.483433)
      (xy 14.930222 -6.350249)
      (xy 14.969652 -6.271451)
      (xy 15.004645 -6.132518)
      (xy 15.011145 -5.963200)
      (xy 15.009113 -5.921531)
      (xy 15.001569 -5.836025)
      (xy 14.987276 -5.757269)
      (xy 14.961832 -5.673223)
      (xy 14.920833 -5.571844)
      (xy 14.859877 -5.441090)
      (xy 14.774563 -5.268921)
      (xy 14.759772 -5.239532)
      (xy 14.365251 -4.512930)
      (xy 13.910285 -3.778253)
      (xy 13.396254 -3.036997)
      (xy 12.824537 -2.290660)
      (xy 12.196515 -1.540740)
      (xy 11.513567 -0.788734)
      (xy 10.777073 -0.036140)
      (xy 9.988412 0.715544)
      (xy 9.148965 1.464822)
      (xy 8.260111 2.210196)
      (xy 7.323230 2.950168)
      (xy 6.959975 3.225827)
      (xy 5.610801 4.199991)
      (xy 4.221769 5.127017)
      (xy 2.796714 6.004548)
      (xy 1.339469 6.830224)
      (xy -0.146132 7.601686)
      (xy -0.172044 7.614533)
      (xy -1.311885 8.160099)
      (xy -2.421538 8.652285)
      (xy -3.502571 9.091613)
      (xy -4.556552 9.478605)
      (xy -5.585050 9.813783)
      (xy -6.589631 10.097671)
      (xy -7.571864 10.330791)
      (xy -8.533316 10.513665)
      (xy -9.149631 10.606073)
      (xy -9.381334 10.631581)
      (xy -9.655087 10.652713)
      (xy -9.958646 10.669264)
      (xy -10.279768 10.681029)
      (xy -10.606209 10.687805)
      (xy -10.925726 10.689386)
      (xy -11.226075 10.685568)
      (xy -11.495012 10.676147)
      (xy -11.720294 10.660916)
      (xy -11.816074 10.650639)
      (xy -12.401831 10.554256)
      (xy -12.942057 10.418335)
      (xy -13.441159 10.241023)
      (xy -13.903543 10.020467)
      (xy -14.333615 9.754816)
      (xy -14.735783 9.442215)
      (xy -14.778050 9.405287)
      (xy -15.039075 9.138589)
      (xy -15.272892 8.828431)
      (xy -15.469753 8.490497)
      (xy -15.619909 8.140472)
      (xy -15.675740 7.960960)
      (xy -15.714033 7.764328)
      (xy -15.737687 7.526372)
      (xy -15.746508 7.266643)
      (xy -15.740301 7.004689)
      (xy -15.718870 6.760059)
      (xy -15.689475 6.584606)
      (xy -15.552851 6.089993)
      (xy -15.356544 5.582916)
      (xy -15.101717 5.065454)
      (xy -14.789534 4.539686)
      (xy -14.421158 4.007693)
      (xy -13.997754 3.471554)
      (xy -13.851414 3.300123)
      (xy -13.675843 3.102745)
      (xy -13.506571 2.921162)
      (xy -13.349254 2.760797)
      (xy -13.209548 2.627071)
      (xy -13.093108 2.525405)
      (xy -13.005589 2.461222)
      (xy -12.954068 2.439901)
      (xy -12.880607 2.463141)
      (xy -12.810419 2.518807)
      (xy -12.767089 2.585820)
      (xy -12.762562 2.611053)
      (xy -12.782302 2.647746)
      (xy -12.837375 2.723365)
      (xy -12.921562 2.830068)
      (xy -13.028643 2.960012)
      (xy -13.152398 3.105355)
      (xy -13.178103 3.135006)
      (xy -13.483780 3.490608)
      (xy -13.749745 3.809408)
      (xy -13.981003 4.098363)
      (xy -14.182556 4.364427)
      (xy -14.359407 4.614555)
      (xy -14.516559 4.855704)
      (xy -14.659016 5.094827)
      (xy -14.791780 5.338881)
      (xy -14.860689 5.474138)
      (xy -15.031663 5.841017)
      (xy -15.160909 6.175812)
      (xy -15.251611 6.489995)
      (xy -15.306954 6.795033)
      (xy -15.330122 7.102398)
      (xy -15.331201 7.168897)
      (xy -15.327900 7.391480)
      (xy -15.311941 7.575020)
      (xy -15.279161 7.742456)
      (xy -15.225399 7.916726)
      (xy -15.168199 8.067226)
      (xy -15.013905 8.371761)
      (xy -14.803260 8.661695)
      (xy -14.541528 8.933278)
      (xy -14.233971 9.182761)
      (xy -13.885852 9.406394)
      (xy -13.502434 9.600426)
      (xy -13.088979 9.761109)
      (xy -12.650751 9.884693)
      (xy -12.601805 9.895741)
      (xy -12.326177 9.952132)
      (xy -12.070855 9.993988)
      (xy -11.818101 10.023061)
      (xy -11.550178 10.041104)
      (xy -11.249349 10.049872)
      (xy -11.026478 10.051427)
      (xy -10.716541 10.048694)
      (xy -10.435493 10.039180)
      (xy -10.166597 10.021382)
      (xy -9.893118 9.993795)
      (xy -9.598321 9.954915)
      (xy -9.265468 9.903239)
      (xy -9.133990 9.881363)
      (xy -8.322194 9.722056)
      (xy -7.477609 9.513157)
      (xy -6.603486 9.256213)
      (xy -5.703072 8.952773)
      (xy -4.779619 8.604383)
      (xy -3.836373 8.212592)
      (xy -2.876585 7.778948)
      (xy -1.903503 7.304997)
      (xy -0.920377 6.792288)
      (xy 0.069545 6.242369)
      (xy 1.063013 5.656787)
      (xy 2.056778 5.037090)
      (xy 3.047591 4.384826)
      (xy 4.032204 3.701541)
      (xy 4.410591 3.429334)
      (xy 5.317913 2.753110)
      (xy 6.193438 2.066558)
      (xy 7.035020 1.371952)
      (xy 7.840515 0.671563)
      (xy 8.607776 -0.032335)
      (xy 9.334659 -0.737470)
      (xy 10.019017 -1.441568)
      (xy 10.658705 -2.142358)
      (xy 11.251577 -2.837566)
      (xy 11.795489 -3.524920)
      (xy 12.288293 -4.202147)
      (xy 12.727846 -4.866974)
      (xy 13.112001 -5.517128)
      (xy 13.422826 -6.117331)
      (xy 13.510582 -6.294052)
      (xy 13.584190 -6.423703)
      (xy 13.653032 -6.517178)
      (xy 13.726490 -6.585374)
      (xy 13.813947 -6.639187)
      (xy 13.910316 -6.683456)
      (xy 14.040091 -6.718114)
      (xy 14.200417 -6.732838)
    )

    (stroke (width 0.000000) (type solid)) (fill solid) (layer "F.SilkS") (tstamp 8fffa6d1-648b-49ea-aa08-ebd189a175c3))
  (fp_poly
    (pts
      (xy 0.319346 -11.949257)
      (xy 0.635133 -11.936504)
      (xy 0.894660 -11.918418)
      (xy 1.335749 -11.878907)
      (xy 1.356052 -11.455567)
      (xy 1.363874 -11.276107)
      (xy 1.370297 -11.097572)
      (xy 1.374674 -10.940246)
      (xy 1.376353 -10.824417)
      (xy 1.376355 -10.821457)
      (xy 1.376355 -10.610687)
      (xy 1.665702 -10.559256)
      (xy 2.423077 -10.397009)
      (xy 3.173092 -10.182240)
      (xy 3.314932 -10.135257)
      (xy 3.850800 -9.953703)
      (xy 3.921906 -10.067800)
      (xy 3.963109 -10.135075)
      (xy 4.028567 -10.243301)
      (xy 4.110557 -10.379653)
      (xy 4.201358 -10.531308)
      (xy 4.240902 -10.597553)
      (xy 4.335999 -10.755707)
      (xy 4.405946 -10.867201)
      (xy 4.456905 -10.939537)
      (xy 4.495037 -10.980219)
      (xy 4.526505 -10.996747)
      (xy 4.557469 -10.996626)
      (xy 4.566995 -10.994604)
      (xy 4.639230 -10.969012)
      (xy 4.756459 -10.917666)
      (xy 4.909143 -10.845476)
      (xy 5.087747 -10.757353)
      (xy 5.282732 -10.658210)
      (xy 5.484561 -10.552958)
      (xy 5.683698 -10.446507)
      (xy 5.870606 -10.343769)
      (xy 6.035746 -10.249655)
      (xy 6.167381 -10.170458)
      (xy 6.352064 -10.052827)
      (xy 6.534548 -9.933065)
      (xy 6.707295 -9.816477)
      (xy 6.862767 -9.708368)
      (xy 6.993428 -9.614043)
      (xy 7.091739 -9.538808)
      (xy 7.150164 -9.487968)
      (xy 7.163300 -9.469481)
      (xy 7.148855 -9.435130)
      (xy 7.108606 -9.354948)
      (xy 7.047189 -9.237760)
      (xy 6.969236 -9.092394)
      (xy 6.879380 -8.927676)
      (xy 6.869049 -8.908902)
      (xy 6.574798 -8.374619)
      (xy 6.892510 -8.102812)
      (xy 7.083529 -7.933408)
      (xy 7.290802 -7.739207)
      (xy 7.505289 -7.529554)
      (xy 7.717948 -7.313799)
      (xy 7.919740 -7.101289)
      (xy 8.101622 -6.901371)
      (xy 8.254554 -6.723393)
      (xy 8.369496 -6.576704)
      (xy 8.372392 -6.572706)
      (xy 8.401024 -6.583494)
      (xy 8.475944 -6.620497)
      (xy 8.588851 -6.679370)
      (xy 8.731443 -6.755770)
      (xy 8.895418 -6.845352)
      (xy 8.932189 -6.865651)
      (xy 9.100578 -6.956854)
      (xy 9.250649 -7.034480)
      (xy 9.373835 -7.094394)
      (xy 9.461565 -7.132464)
      (xy 9.505271 -7.144555)
      (xy 9.508026 -7.143439)
      (xy 9.557385 -7.081820)
      (xy 9.633142 -6.978193)
      (xy 9.727989 -6.843254)
      (xy 9.834616 -6.687698)
      (xy 9.945716 -6.522223)
      (xy 10.053980 -6.357524)
      (xy 10.152101 -6.204299)
      (xy 10.178375 -6.162315)
      (xy 10.243659 -6.052729)
      (xy 10.323955 -5.910752)
      (xy 10.415095 -5.744485)
      (xy 10.512910 -5.562033)
      (xy 10.613233 -5.371495)
      (xy 10.711894 -5.180975)
      (xy 10.804726 -4.998574)
      (xy 10.887561 -4.832394)
      (xy 10.956229 -4.690538)
      (xy 11.006564 -4.581107)
      (xy 11.034396 -4.512203)
      (xy 11.037807 -4.491808)
      (xy 11.008794 -4.473546)
      (xy 10.934469 -4.427975)
      (xy 10.823080 -4.360119)
      (xy 10.682874 -4.275001)
      (xy 10.522100 -4.177643)
      (xy 10.491281 -4.159005)
      (xy 9.956083 -3.835419)
      (xy 10.050004 -3.583411)
      (xy 10.096826 -3.451779)
      (xy 10.153853 -3.282454)
      (xy 10.213699 -3.097782)
      (xy 10.266307 -2.928910)
      (xy 10.388690 -2.526417)
      (xy 10.160853 -2.287654)
      (xy 10.025077 -2.145940)
      (xy 9.874189 -1.989427)
      (xy 9.714080 -1.824130)
      (xy 9.550643 -1.656063)
      (xy 9.389768 -1.491240)
      (xy 9.237349 -1.335675)
      (xy 9.099276 -1.195382)
      (xy 8.981442 -1.076376)
      (xy 8.889739 -0.984670)
      (xy 8.830059 -0.926280)
      (xy 8.808414 -0.907143)
      (xy 8.797709 -0.935208)
      (xy 8.783718 -1.007333)
      (xy 8.774365 -1.071367)
      (xy 8.746024 -1.251304)
      (xy 8.703639 -1.472922)
      (xy 8.651322 -1.718034)
      (xy 8.593182 -1.968451)
      (xy 8.533330 -2.205986)
      (xy 8.475878 -2.412449)
      (xy 8.457984 -2.471182)
      (xy 8.240334 -3.082218)
      (xy 7.973218 -3.690640)
      (xy 7.663816 -4.282935)
      (xy 7.319312 -4.845591)
      (xy 6.946887 -5.365096)
      (xy 6.864701 -5.468810)
      (xy 6.371333 -6.031667)
      (xy 5.840474 -6.546170)
      (xy 5.275424 -7.011400)
      (xy 4.679482 -7.426438)
      (xy 4.055949 -7.790365)
      (xy 3.408122 -8.102263)
      (xy 2.739303 -8.361213)
      (xy 2.052790 -8.566297)
      (xy 1.351883 -8.716595)
      (xy 0.639882 -8.811188)
      (xy -0.079914 -8.849158)
      (xy -0.804206 -8.829587)
      (xy -1.529693 -8.751554)
      (xy -2.253077 -8.614142)
      (xy -2.971058 -8.416432)
      (xy -3.308166 -8.301525)
      (xy -3.986588 -8.022652)
      (xy -4.638751 -7.688608)
      (xy -5.261359 -7.302418)
      (xy -5.851114 -6.867106)
      (xy -6.404720 -6.385698)
      (xy -6.918879 -5.861219)
      (xy -7.390295 -5.296692)
      (xy -7.815669 -4.695143)
      (xy -8.191705 -4.059597)
      (xy -8.413748 -3.617672)
      (xy -8.695049 -2.943717)
      (xy -8.919605 -2.247716)
      (xy -9.087077 -1.534684)
      (xy -9.197125 -0.809639)
      (xy -9.249410 -0.077597)
      (xy -9.243592 0.656424)
      (xy -9.179330 1.387408)
      (xy -9.056286 2.110337)
      (xy -8.874119 2.820195)
      (xy -8.854123 2.885492)
      (xy -8.606315 3.580093)
      (xy -8.302742 4.251396)
      (xy -7.946369 4.895494)
      (xy -7.540162 5.508477)
      (xy -7.087085 6.086435)
      (xy -6.590103 6.625460)
      (xy -6.052183 7.121643)
      (xy -5.476290 7.571074)
      (xy -5.113492 7.816836)
      (xy -5.011819 7.885265)
      (xy -4.937675 7.941586)
      (xy -4.901332 7.977646)
      (xy -4.900742 7.985659)
      (xy -4.951222 8.008764)
      (xy -5.051144 8.048102)
      (xy -5.192097 8.100762)
      (xy -5.365669 8.163833)
      (xy -5.563446 8.234404)
      (xy -5.777018 8.309564)
      (xy -5.997972 8.386403)
      (xy -6.217895 8.462010)
      (xy -6.428377 8.533473)
      (xy -6.621003 8.597882)
      (xy -6.787364 8.652327)
      (xy -6.919046 8.693896)
      (xy -7.007637 8.719678)
      (xy -7.043161 8.727000)
      (xy -7.069353 8.707483)
      (xy -7.133221 8.654421)
      (xy -7.225509 8.575640)
      (xy -7.336963 8.478965)
      (xy -7.350985 8.466709)
      (xy -7.723462 8.125238)
      (xy -8.090380 7.759347)
      (xy -8.429202 7.391749)
      (xy -8.509777 7.298854)
      (xy -8.781792 6.980836)
      (xy -9.309800 7.274570)
      (xy -9.475368 7.365825)
      (xy -9.623061 7.445616)
      (xy -9.743901 7.509224)
      (xy -9.828910 7.551928)
      (xy -9.869111 7.569009)
      (xy -9.870118 7.569127)
      (xy -9.902563 7.544181)
      (xy -9.963220 7.473124)
      (xy -10.047154 7.362901)
      (xy -10.149430 7.220461)
      (xy -10.265110 7.052749)
      (xy -10.389261 6.866713)
      (xy -10.516947 6.669299)
      (xy -10.577108 6.574031)
      (xy -10.657990 6.439507)
      (xy -10.752314 6.273862)
      (xy -10.855169 6.086632)
      (xy -10.961643 5.887354)
      (xy -11.066825 5.685566)
      (xy -11.165804 5.490804)
      (xy -11.253668 5.312607)
      (xy -11.325506 5.160509)
      (xy -11.376407 5.044050)
      (xy -11.401254 4.973645)
      (xy -11.404727 4.941704)
      (xy -11.393674 4.911005)
      (xy -11.360591 4.875385)
      (xy -11.297978 4.828682)
      (xy -11.198331 4.764736)
      (xy -11.054148 4.677385)
      (xy -11.004203 4.647553)
      (xy -10.849920 4.555342)
      (xy -10.705466 4.468646)
      (xy -10.583664 4.395186)
      (xy -10.497338 4.342684)
      (xy -10.474450 4.328556)
      (xy -10.360353 4.257450)
      (xy -10.541907 3.721582)
      (xy -10.760144 2.998274)
      (xy -10.930163 2.263540)
      (xy -10.965222 2.076078)
      (xy -11.015967 1.790457)
      (xy -11.650489 1.767798)
      (xy -12.285011 1.745139)
      (xy -12.321523 1.099355)
      (xy -12.333250 0.897880)
      (xy -12.344711 0.711705)
      (xy -12.355164 0.552091)
      (xy -12.363866 0.430301)
      (xy -12.370076 0.357599)
      (xy -12.370906 0.350317)
      (xy -12.373354 0.284593)
      (xy -12.371975 0.167254)
      (xy -12.367258 0.009098)
      (xy -12.359697 -0.179079)
      (xy -12.349784 -0.386479)
      (xy -12.338009 -0.602304)
      (xy -12.324865 -0.815757)
      (xy -12.310843 -1.016042)
      (xy -12.305564 -1.084239)
      (xy -12.285196 -1.339537)
      (xy -11.666220 -1.350126)
      (xy -11.475671 -1.354254)
      (xy -11.307046 -1.359562)
      (xy -11.170132 -1.365605)
      (xy -11.074716 -1.371940)
      (xy -11.030586 -1.378122)
      (xy -11.028985 -1.379018)
      (xy -11.016545 -1.415375)
      (xy -10.996454 -1.500430)
      (xy -10.971560 -1.621209)
      (xy -10.946566 -1.754388)
      (xy -10.891731 -2.028547)
      (xy -10.821750 -2.330478)
      (xy -10.740707 -2.645723)
      (xy -10.652684 -2.959827)
      (xy -10.561766 -3.258332)
      (xy -10.472035 -3.526782)
      (xy -10.387575 -3.750721)
      (xy -10.372352 -3.787301)
      (xy -10.376820 -3.812128)
      (xy -10.410775 -3.849128)
      (xy -10.479559 -3.902165)
      (xy -10.588515 -3.975104)
      (xy -10.742985 -4.071810)
      (xy -10.884476 -4.157776)
      (xy -11.047244 -4.257096)
      (xy -11.189950 -4.346518)
      (xy -11.304496 -4.420774)
      (xy -11.382783 -4.474593)
      (xy -11.416713 -4.502708)
      (xy -11.417488 -4.504555)
      (xy -11.402768 -4.561898)
      (xy -11.361480 -4.665212)
      (xy -11.297927 -4.806056)
      (xy -11.216415 -4.975989)
      (xy -11.121249 -5.166570)
      (xy -11.016733 -5.369357)
      (xy -10.907173 -5.575910)
      (xy -10.796873 -5.777786)
      (xy -10.690138 -5.966545)
      (xy -10.591272 -6.133745)
      (xy -10.564091 -6.177956)
      (xy -10.489305 -6.295551)
      (xy -10.399515 -6.432473)
      (xy -10.301059 -6.579547)
      (xy -10.200276 -6.727597)
      (xy -10.103503 -6.867448)
      (xy -10.017078 -6.989925)
      (xy -9.947340 -7.085852)
      (xy -9.900626 -7.146056)
      (xy -9.884095 -7.162332)
      (xy -9.852897 -7.148200)
      (xy -9.775834 -7.108298)
      (xy -9.661686 -7.047315)
      (xy -9.519231 -6.969946)
      (xy -9.357250 -6.880879)
      (xy -9.352322 -6.878154)
      (xy -9.188430 -6.787763)
      (xy -9.042494 -6.707778)
      (xy -8.923677 -6.643180)
      (xy -8.841142 -6.598950)
      (xy -8.804055 -6.580072)
      (xy -8.803957 -6.580033)
      (xy -8.770972 -6.596944)
      (xy -8.710966 -6.653205)
      (xy -8.634674 -6.738280)
      (xy -8.601088 -6.779157)
      (xy -8.468275 -6.935992)
      (xy -8.299584 -7.121674)
      (xy -8.106671 -7.324375)
      (xy -7.901192 -7.532269)
      (xy -7.694804 -7.733528)
      (xy -7.499164 -7.916326)
      (xy -7.350985 -8.047535)
      (xy -7.229446 -8.151693)
      (xy -7.124331 -8.241935)
      (xy -7.045125 -8.310109)
      (xy -7.001311 -8.348060)
      (xy -6.996666 -8.352170)
      (xy -7.003177 -8.385384)
      (xy -7.036347 -8.464502)
      (xy -7.092050 -8.580968)
      (xy -7.166158 -8.726224)
      (xy -7.254544 -8.891713)
      (xy -7.274404 -8.928002)
      (xy -7.365839 -9.095865)
      (xy -7.445068 -9.244190)
      (xy -7.507767 -9.364638)
      (xy -7.549612 -9.448873)
      (xy -7.566277 -9.488556)
      (xy -7.566162 -9.490459)
      (xy -7.452197 -9.579300)
      (xy -7.294007 -9.691992)
      (xy -7.101981 -9.821882)
      (xy -6.886513 -9.962314)
      (xy -6.657995 -10.106634)
      (xy -6.426819 -10.248185)
      (xy -6.203378 -10.380314)
      (xy -5.998063 -10.496365)
      (xy -5.979720 -10.506398)
      (xy -5.832241 -10.584732)
      (xy -5.668238 -10.668439)
      (xy -5.498002 -10.752649)
      (xy -5.331826 -10.832493)
      (xy -5.180000 -10.903103)
      (xy -5.052818 -10.959610)
      (xy -4.960570 -10.997144)
      (xy -4.913548 -11.010837)
      (xy -4.913440 -11.010838)
      (xy -4.888716 -10.985206)
      (xy -4.837690 -10.913731)
      (xy -4.765697 -10.804540)
      (xy -4.678074 -10.665761)
      (xy -4.580157 -10.505523)
      (xy -4.563425 -10.477659)
      (xy -4.448313 -10.287725)
      (xy -4.359581 -10.147067)
      (xy -4.293300 -10.050234)
      (xy -4.245541 -9.991773)
      (xy -4.212374 -9.966232)
      (xy -4.194386 -9.965535)
      (xy -3.979509 -10.048903)
      (xy -3.717392 -10.138269)
      (xy -3.422538 -10.229538)
      (xy -3.109448 -10.318612)
      (xy -2.792625 -10.401396)
      (xy -2.486570 -10.473791)
      (xy -2.205785 -10.531703)
      (xy -2.161038 -10.539916)
      (xy -2.018663 -10.566720)
      (xy -1.899929 -10.591374)
      (xy -1.817811 -10.611029)
      (xy -1.785668 -10.622334)
      (xy -1.779543 -10.657834)
      (xy -1.773200 -10.746095)
      (xy -1.767084 -10.877322)
      (xy -1.761638 -11.041717)
      (xy -1.757308 -11.229484)
      (xy -1.756791 -11.258519)
      (xy -1.746218 -11.876444)
      (xy -1.303220 -11.917179)
      (xy -1.032114 -11.936340)
      (xy -0.716537 -11.949138)
      (xy -0.374256 -11.955564)
      (xy -0.023039 -11.955607)
    )

    (stroke (width 0.000000) (type solid)) (fill solid) (layer "F.SilkS") (tstamp 07ff334c-935c-405f-bf68-6c0fa2de5ac8))
  (fp_poly
    (pts
      (xy -5.050333 -2.472935)
      (xy -4.715319 -2.446463)
      (xy -4.380687 -2.398858)
      (xy -4.020590 -2.327108)
      (xy -3.949200 -2.310966)
      (xy -3.659852 -2.244505)
      (xy -3.659852 -1.700947)
      (xy -3.660738 -1.524401)
      (xy -3.663195 -1.371804)
      (xy -3.666922 -1.253201)
      (xy -3.671620 -1.178638)
      (xy -3.676114 -1.157389)
      (xy -3.711225 -1.168319)
      (xy -3.787534 -1.196955)
      (xy -3.887260 -1.236590)
      (xy -4.193598 -1.345008)
      (xy -4.515966 -1.430224)
      (xy -4.839401 -1.489822)
      (xy -5.148945 -1.521387)
      (xy -5.429636 -1.522501)
      (xy -5.571240 -1.508548)
      (xy -5.806354 -1.458066)
      (xy -5.985478 -1.382439)
      (xy -6.110583 -1.280065)
      (xy -6.183643 -1.149341)
      (xy -6.206649 -0.992368)
      (xy -6.201104 -0.889206)
      (xy -6.181000 -0.802712)
      (xy -6.140405 -0.729412)
      (xy -6.073387 -0.665831)
      (xy -5.974015 -0.608494)
      (xy -5.836356 -0.553928)
      (xy -5.654478 -0.498658)
      (xy -5.422449 -0.439209)
      (xy -5.156084 -0.377042)
      (xy -4.848755 -0.305379)
      (xy -4.594870 -0.241302)
      (xy -4.386252 -0.181581)
      (xy -4.214724 -0.122985)
      (xy -4.072111 -0.062284)
      (xy -3.950237 0.003752)
      (xy -3.840924 0.078354)
      (xy -3.735998 0.164753)
      (xy -3.698127 0.198994)
      (xy -3.547963 0.377993)
      (xy -3.435471 0.596340)
      (xy -3.360427 0.843607)
      (xy -3.322604 1.109367)
      (xy -3.321777 1.383191)
      (xy -3.357720 1.654652)
      (xy -3.430208 1.913321)
      (xy -3.539015 2.148772)
      (xy -3.683915 2.350575)
      (xy -3.746059 2.414092)
      (xy -3.906156 2.548280)
      (xy -4.073318 2.652797)
      (xy -4.267298 2.738391)
      (xy -4.457512 2.801190)
      (xy -4.567911 2.832202)
      (xy -4.668037 2.854941)
      (xy -4.771754 2.870949)
      (xy -4.892925 2.881770)
      (xy -5.045414 2.888944)
      (xy -5.243082 2.894015)
      (xy -5.302094 2.895152)
      (xy -5.499191 2.896870)
      (xy -5.689032 2.895052)
      (xy -5.856856 2.890091)
      (xy -5.987905 2.882383)
      (xy -6.052833 2.875092)
      (xy -6.379636 2.816989)
      (xy -6.670721 2.753433)
      (xy -6.952929 2.678363)
      (xy -7.045760 2.650914)
      (xy -7.381790 2.549384)
      (xy -7.382028 1.978116)
      (xy -7.382266 1.406849)
      (xy -7.163766 1.516884)
      (xy -6.845893 1.659874)
      (xy -6.519909 1.774891)
      (xy -6.194572 1.860700)
      (xy -5.878638 1.916067)
      (xy -5.580867 1.939757)
      (xy -5.310014 1.930537)
      (xy -5.074839 1.887172)
      (xy -4.928119 1.831978)
      (xy -4.772137 1.727089)
      (xy -4.667029 1.596780)
      (xy -4.612533 1.451183)
      (xy -4.608390 1.300431)
      (xy -4.654338 1.154656)
      (xy -4.750117 1.023990)
      (xy -4.895466 0.918565)
      (xy -4.952311 0.891853)
      (xy -5.020419 0.868775)
      (xy -5.137443 0.834825)
      (xy -5.291352 0.793256)
      (xy -5.470117 0.747319)
      (xy -5.656129 0.701606)
      (xy -5.945144 0.629862)
      (xy -6.181987 0.565261)
      (xy -6.376155 0.504424)
      (xy -6.537147 0.443969)
      (xy -6.674461 0.380516)
      (xy -6.797593 0.310686)
      (xy -6.850505 0.276550)
      (xy -7.067091 0.096842)
      (xy -7.232481 -0.118726)
      (xy -7.346587 -0.369934)
      (xy -7.409325 -0.656562)
      (xy -7.420607 -0.978391)
      (xy -7.408110 -1.141749)
      (xy -7.347050 -1.436263)
      (xy -7.233111 -1.702020)
      (xy -7.069895 -1.933845)
      (xy -6.861003 -2.126565)
      (xy -6.623607 -2.268680)
      (xy -6.443352 -2.345961)
      (xy -6.266183 -2.403227)
      (xy -6.078228 -2.442911)
      (xy -5.865617 -2.467447)
      (xy -5.614477 -2.479268)
      (xy -5.411576 -2.481283)
    )

    (stroke (width 0.000000) (type solid)) (fill solid) (layer "F.SilkS") (tstamp 92d0c30e-5ccb-41aa-a42a-72e8ad18523d))
  (fp_poly
    (pts
      (xy 0.797660 -2.407881)
      (xy 1.748463 0.164594)
      (xy 1.890391 0.548593)
      (xy 2.026232 0.916123)
      (xy 2.154402 1.262902)
      (xy 2.273320 1.584649)
      (xy 2.381404 1.877084)
      (xy 2.477071 2.135926)
      (xy 2.558740 2.356895)
      (xy 2.624829 2.535711)
      (xy 2.673754 2.668091)
      (xy 2.703935 2.749757)
      (xy 2.713694 2.776170)
      (xy 2.705461 2.789587)
      (xy 2.665497 2.799759)
      (xy 2.587684 2.807050)
      (xy 2.465908 2.811823)
      (xy 2.294052 2.814442)
      (xy 2.066000 2.815270)
      (xy 2.056099 2.815271)
      (xy 1.384075 2.815271)
      (xy 1.219809 2.345653)
      (xy 1.055542 1.876035)
      (xy -0.008077 1.884261)
      (xy -1.071696 1.892488)
      (xy -1.231845 2.353837)
      (xy -1.391995 2.815187)
      (xy -2.056712 2.815229)
      (xy -2.253016 2.814028)
      (xy -2.426334 2.810647)
      (xy -2.567582 2.805455)
      (xy -2.667675 2.798821)
      (xy -2.717529 2.791116)
      (xy -2.721429 2.788182)
      (xy -2.710792 2.755458)
      (xy -2.679923 2.668340)
      (xy -2.630378 2.531076)
      (xy -2.563719 2.347918)
      (xy -2.481503 2.123113)
      (xy -2.385289 1.860912)
      (xy -2.276637 1.565563)
      (xy -2.157106 1.241317)
      (xy -2.028254 0.892421)
      (xy -2.019235 0.868042)
      (xy -0.712585 0.868042)
      (xy -0.704002 0.881050)
      (xy -0.664136 0.891021)
      (xy -0.587042 0.898283)
      (xy -0.466778 0.903164)
      (xy -0.297399 0.905993)
      (xy -0.072963 0.907097)
      (xy -0.004798 0.907143)
      (xy 0.716555 0.907143)
      (xy 0.372267 -0.101663)
      (xy 0.290253 -0.340718)
      (xy 0.213897 -0.560886)
      (xy 0.145694 -0.755159)
      (xy 0.088137 -0.916528)
      (xy 0.043720 -1.037985)
      (xy 0.014939 -1.112522)
      (xy 0.005046 -1.133488)
      (xy -0.010120 -1.110581)
      (xy -0.042731 -1.035024)
      (xy -0.090292 -0.913466)
      (xy -0.150311 -0.752558)
      (xy -0.220297 -0.558949)
      (xy -0.297755 -0.339288)
      (xy -0.358452 -0.163783)
      (xy -0.440036 0.074015)
      (xy -0.515412 0.293695)
      (xy -0.582110 0.488056)
      (xy -0.637655 0.649893)
      (xy -0.679578 0.772004)
      (xy -0.705405 0.847187)
      (xy -0.712585 0.868042)
      (xy -2.019235 0.868042)
      (xy -1.891641 0.523127)
      (xy -1.767365 0.187685)
      (xy -1.625337 -0.195536)
      (xy -1.489703 -0.561754)
      (xy -1.362018 -0.906754)
      (xy -1.243838 -1.226320)
      (xy -1.136721 -1.516235)
      (xy -1.042221 -1.772283)
      (xy -0.961896 -1.990248)
      (xy -0.897301 -2.165914)
      (xy -0.849993 -2.295063)
      (xy -0.821527 -2.373481)
      (xy -0.813301 -2.397173)
      (xy -0.783395 -2.400245)
      (xy -0.699182 -2.402976)
      (xy -0.568913 -2.405255)
      (xy -0.400842 -2.406967)
      (xy -0.203220 -2.407998)
      (xy -0.007820 -2.408251)
    )

    (stroke (width 0.000000) (type solid)) (fill solid) (layer "F.SilkS") (tstamp e55259ec-d963-4ebe-b8bb-4887c8a07cb0))
  (fp_poly
    (pts
      (xy 7.038177 -1.908623)
      (xy 7.038177 -1.408625)
      (xy 6.170135 -1.400310)
      (xy 5.302094 -1.391995)
      (xy 5.294013 0.367238)
      (xy 5.285933 2.126471)
      (xy 4.827688 2.470871)
      (xy 4.369444 2.815271)
      (xy 4.171272 2.815271)
      (xy 3.973100 2.815271)
      (xy 3.965060 0.711638)
      (xy 3.957020 -1.391995)
      (xy 3.088978 -1.400310)
      (xy 2.220936 -1.408625)
      (xy 2.220936 -1.908623)
      (xy 2.220936 -2.408621)
      (xy 4.629557 -2.408621)
      (xy 7.038177 -2.408621)
    )

    (stroke (width 0.000000) (type solid)) (fill solid) (layer "F.SilkS") (tstamp 105d2be7-8858-4b67-bb6b-1cabb133dba9))
  (fp_poly
    (pts
      (xy 17.112553 -12.338954)
      (xy 17.141692 -12.250722)
      (xy 17.175702 -12.133879)
      (xy 17.209957 -12.004589)
      (xy 17.239830 -11.879019)
      (xy 17.248221 -11.839778)
      (xy 17.325148 -11.320380)
      (xy 17.348299 -10.773948)
      (xy 17.318089 -10.204709)
      (xy 17.234938 -9.616883)
      (xy 17.099263 -9.014696)
      (xy 16.911481 -8.402371)
      (xy 16.907118 -8.389823)
      (xy 16.772441 -8.003438)
      (xy 16.859850 -7.810155)
      (xy 17.006012 -7.411811)
      (xy 17.094308 -6.994082)
      (xy 17.124581 -6.561747)
      (xy 17.096673 -6.119580)
      (xy 17.010427 -5.672358)
      (xy 16.938421 -5.427030)
      (xy 16.901315 -5.325121)
      (xy 16.852187 -5.204543)
      (xy 16.797172 -5.078613)
      (xy 16.742405 -4.960643)
      (xy 16.694021 -4.863946)
      (xy 16.658155 -4.801838)
      (xy 16.643018 -4.785961)
      (xy 16.621462 -4.811749)
      (xy 16.575826 -4.882566)
      (xy 16.512119 -4.988588)
      (xy 16.436347 -5.119993)
      (xy 16.408656 -5.169150)
      (xy 16.140129 -5.638644)
      (xy 15.891560 -6.052539)
      (xy 15.663263 -6.410392)
      (xy 15.455552 -6.711762)
      (xy 15.268741 -6.956206)
      (xy 15.103145 -7.143285)
      (xy 14.959077 -7.272555)
      (xy 14.874827 -7.326566)
      (xy 14.816455 -7.353463)
      (xy 14.756786 -7.370666)
      (xy 14.681896 -7.379455)
      (xy 14.577859 -7.381106)
      (xy 14.430750 -7.376900)
      (xy 14.358694 -7.373947)
      (xy 14.043843 -7.349970)
      (xy 13.673459 -7.302758)
      (xy 13.249942 -7.232699)
      (xy 12.775690 -7.140181)
      (xy 12.378934 -7.054215)
      (xy 12.193953 -7.013279)
      (xy 12.030796 -6.978492)
      (xy 11.898895 -6.951756)
      (xy 11.807676 -6.934972)
      (xy 11.766571 -6.930043)
      (xy 11.765307 -6.930447)
      (xy 11.768593 -6.965854)
      (xy 11.794544 -7.044060)
      (xy 11.837687 -7.151989)
      (xy 11.892548 -7.276562)
      (xy 11.953654 -7.404704)
      (xy 12.006809 -7.507389)
      (xy 12.226041 -7.864447)
      (xy 12.478882 -8.193163)
      (xy 12.756078 -8.483024)
      (xy 13.048376 -8.723513)
      (xy 13.121126 -8.773631)
      (xy 13.285174 -8.878395)
      (xy 13.426409 -8.957345)
      (xy 13.568557 -9.021827)
      (xy 13.735338 -9.083187)
      (xy 13.841749 -9.118295)
      (xy 14.060714 -9.188796)
      (xy 14.239530 -9.523089)
      (xy 14.549803 -10.055974)
      (xy 14.888390 -10.549431)
      (xy 15.251641 -10.999596)
      (xy 15.635906 -11.402607)
      (xy 16.037535 -11.754599)
      (xy 16.452879 -12.051710)
      (xy 16.831757 -12.267172)
      (xy 16.943755 -12.321634)
      (xy 17.032357 -12.361709)
      (xy 17.084576 -12.381666)
      (xy 17.092914 -12.382405)
    )

    (stroke (width 0.000000) (type solid)) (fill solid) (layer "F.SilkS") (tstamp a0d72386-0510-4816-9cd0-8a9c6144c028))
)
