(kicad_symbol_lib (version 20220914) (generator kicad_symbol_editor)
  (symbol "MAX5490" (pin_names (offset 1.016)) (in_bom yes) (on_board yes)
    (property "Reference" "U" (at 7.62 6.35 0)
      (effects (font (size 1.27 1.27)) (justify left bottom))
    )
    (property "Value" "MAX5490" (at 10.16 6.35 0)
      (effects (font (size 1.27 1.27)) (justify left bottom))
    )
    (property "Footprint" "MAX5490VB10000:21-0051H" (at -1.27 -11.43 0)
      (effects (font (size 1.27 1.27)) (justify bottom) hide)
    )
    (property "Datasheet" "" (at 0 0 0)
      (effects (font (size 1.27 1.27)) hide)
    )
    (property "MF" "Analog Devices" (at 0 -10.16 0)
      (effects (font (size 1.27 1.27)) (justify bottom) hide)
    )
    (property "VENDOR" "MAXIM" (at 0 5.08 0)
      (effects (font (size 1.27 1.27)) (justify bottom) hide)
    )
    (property "Description" "\n9.091k, 90.91k Ohm - 67.2mW Power Per Element Voltage Divider 2 Resistor Network/Array ±35ppm/°C TO-236-3, SC-59, SOT-23-3\n" (at 1.27 8.89 0)
      (effects (font (size 1.27 1.27)) (justify bottom) hide)
    )
    (property "Package" "SOT-23-3 Maxim Integrated" (at 0 -10.16 0)
      (effects (font (size 1.27 1.27)) (justify bottom) hide)
    )
    (property "Price" "None" (at 0 7.62 0)
      (effects (font (size 1.27 1.27)) (justify bottom) hide)
    )
    (property "Check_prices" "https://www.snapeda.com/parts/MAX5490VB10000/Analog+Devices/view-part/?ref=eda" (at 1.27 -12.7 0)
      (effects (font (size 1.27 1.27)) (justify bottom) hide)
    )
    (property "SnapEDA_Link" "https://www.snapeda.com/parts/MAX5490VB10000/Analog+Devices/view-part/?ref=snap" (at 5.08 8.89 0)
      (effects (font (size 1.27 1.27)) (justify bottom) hide)
    )
    (property "MP" "MAX5490VB10000" (at 0 6.35 0)
      (effects (font (size 1.27 1.27)) (justify bottom) hide)
    )
    (property "Availability" "Not in stock" (at -1.27 7.62 0)
      (effects (font (size 1.27 1.27)) (justify bottom) hide)
    )
    (property "MANUFACTURER_PART_NUMBER" "max5490vb10000+" (at 0 -12.7 0)
      (effects (font (size 1.27 1.27)) (justify bottom) hide)
    )
    (symbol "MAX5490_0_1"
      (rectangle (start 19.05 1.27) (end 24.13 -1.27)
        (stroke (width 0) (type default))
        (fill (type none))
      )
      (rectangle (start 26.67 1.27) (end 31.75 -1.27)
        (stroke (width 0) (type default))
        (fill (type none))
      )
    )
    (symbol "MAX5490_1_0"
      (polyline
        (pts
          (xy 19.05 0)
          (xy 17.78 0)
        )
        (stroke (width 0) (type default))
        (fill (type none))
      )
      (polyline
        (pts
          (xy 24.13 0)
          (xy 26.67 0)
        )
        (stroke (width 0) (type default))
        (fill (type none))
      )
      (polyline
        (pts
          (xy 25.4 0)
          (xy 25.4 1.27)
        )
        (stroke (width 0) (type default))
        (fill (type none))
      )
      (polyline
        (pts
          (xy 31.75 0)
          (xy 33.02 0)
        )
        (stroke (width 0) (type default))
        (fill (type none))
      )
      (rectangle (start 13.97 5.08) (end 36.83 -2.54)
        (stroke (width 0.1524) (type default))
        (fill (type none))
      )
      (text "R1" (at 21.59 0 0)
        (effects (font (size 1.27 1.27)))
      )
      (text "R2" (at 29.21 0 0)
        (effects (font (size 1.27 1.27)))
      )
      (pin passive line (at 11.43 0 0) (length 2.54)
        (name "P1" (effects (font (size 1.016 1.016))))
        (number "1" (effects (font (size 1.016 1.016))))
      )
      (pin passive line (at 39.37 0 180) (length 2.54)
        (name "P2" (effects (font (size 1.016 1.016))))
        (number "2" (effects (font (size 1.016 1.016))))
      )
      (pin passive line (at 25.4 7.62 270) (length 2.54)
        (name "P3" (effects (font (size 1.016 1.016))))
        (number "3" (effects (font (size 1.016 1.016))))
      )
    )
  )
)
