(footprint "LOGO" (version 20221018) (generator bitmap2component)
  (layer "F.Cu")
  (attr board_only exclude_from_pos_files exclude_from_bom)
  (fp_text reference "G***" (at 0 0) (layer "F.SilkS")
      (effects (font (size 1.5 1.5) (thickness 0.3)))
    (tstamp 338d5fb4-0e42-4ce8-ab40-881acee282ed)
  )
  (fp_text value "LOGO" (at 0.75 0) (layer "F.SilkS") hide
      (effects (font (size 1.5 1.5) (thickness 0.3)))
    (tstamp 89ce366f-4a9c-42e2-b2b3-1f13d81f041f)
  )
  (fp_poly
    (pts
      (xy -0.507716 11.113105)
      (xy -0.441628 11.156184)
      (xy -0.411515 11.194503)
      (xy -0.347023 11.290317)
      (xy -0.325321 11.343152)
      (xy -0.351551 11.365797)
      (xy -0.430855 11.371038)
      (xy -0.482538 11.371126)
      (xy -0.589204 11.368591)
      (xy -0.648786 11.354527)
      (xy -0.681458 11.319249)
      (xy -0.703199 11.265179)
      (xy -0.732374 11.169958)
      (xy -0.727430 11.121511)
      (xy -0.679181 11.104115)
      (xy -0.607853 11.101987)
    )

    (stroke (width 0.000000) (type solid)) (fill solid) (layer "F.SilkS") (tstamp 2e4b51ca-559c-4351-9c63-7afad8b37103))
  (fp_poly
    (pts
      (xy -2.997000 9.000943)
      (xy -2.968940 9.003063)
      (xy -2.691390 9.025412)
      (xy -2.691381 9.180587)
      (xy -2.691372 9.335762)
      (xy -3.081118 9.335762)
      (xy -3.249344 9.336566)
      (xy -3.363718 9.340545)
      (xy -3.437670 9.350045)
      (xy -3.484627 9.367417)
      (xy -3.518018 9.395007)
      (xy -3.535300 9.415184)
      (xy -3.594203 9.524474)
      (xy -3.588443 9.623808)
      (xy -3.520250 9.710497)
      (xy -3.391851 9.781849)
      (xy -3.205476 9.835175)
      (xy -3.183857 9.839389)
      (xy -2.978449 9.887407)
      (xy -2.828880 9.946463)
      (xy -2.723892 10.022628)
      (xy -2.652222 10.121972)
      (xy -2.649390 10.127502)
      (xy -2.604566 10.272745)
      (xy -2.592815 10.444637)
      (xy -2.614908 10.610803)
      (xy -2.636352 10.675698)
      (xy -2.723092 10.808446)
      (xy -2.854313 10.921520)
      (xy -3.007214 10.995693)
      (xy -3.020448 10.999579)
      (xy -3.120849 11.016064)
      (xy -3.265775 11.026171)
      (xy -3.432751 11.029736)
      (xy -3.599307 11.026600)
      (xy -3.742968 11.016600)
      (xy -3.818410 11.005316)
      (xy -3.879855 10.986310)
      (xy -3.911502 10.949987)
      (xy -3.925593 10.876173)
      (xy -3.929687 10.821911)
      (xy -3.940037 10.659931)
      (xy -3.778297 10.687515)
      (xy -3.657675 10.701957)
      (xy -3.505560 10.711942)
      (xy -3.375299 10.715099)
      (xy -3.242211 10.712026)
      (xy -3.155474 10.699359)
      (xy -3.094299 10.671931)
      (xy -3.047286 10.633540)
      (xy -2.979155 10.531315)
      (xy -2.960638 10.413891)
      (xy -2.993186 10.304393)
      (xy -3.024158 10.264584)
      (xy -3.100497 10.220317)
      (xy -3.230461 10.180537)
      (xy -3.335350 10.159581)
      (xy -3.563105 10.108517)
      (xy -3.731529 10.037996)
      (xy -3.847250 9.941849)
      (xy -3.916895 9.813907)
      (xy -3.947093 9.648001)
      (xy -3.949479 9.588015)
      (xy -3.925315 9.390693)
      (xy -3.846888 9.232906)
      (xy -3.714522 9.114846)
      (xy -3.528537 9.036703)
      (xy -3.289256 8.998672)
    )

    (stroke (width 0.000000) (type solid)) (fill solid) (layer "F.SilkS") (tstamp c0cae3f6-f7b5-4ba1-b86a-c9bf52cb543f))
  (fp_poly
    (pts
      (xy -0.905862 9.492108)
      (xy -0.719488 9.545144)
      (xy -0.585258 9.637434)
      (xy -0.534432 9.703135)
      (xy -0.511331 9.748084)
      (xy -0.494566 9.802962)
      (xy -0.483152 9.878663)
      (xy -0.476105 9.986076)
      (xy -0.472441 10.136094)
      (xy -0.471176 10.339608)
      (xy -0.471119 10.403907)
      (xy -0.470993 11.001060)
      (xy -0.622384 11.001060)
      (xy -0.716991 10.996657)
      (xy -0.761728 10.978377)
      (xy -0.773717 10.938609)
      (xy -0.773774 10.933775)
      (xy -0.774774 10.891906)
      (xy -0.786846 10.873618)
      (xy -0.823598 10.879996)
      (xy -0.898637 10.912124)
      (xy -0.980699 10.950267)
      (xy -1.148780 11.011799)
      (xy -1.305648 11.027297)
      (xy -1.437926 11.010997)
      (xy -1.509562 10.978346)
      (xy -1.593276 10.915443)
      (xy -1.613270 10.896521)
      (xy -1.704054 10.763853)
      (xy -1.744525 10.609875)
      (xy -1.740619 10.549335)
      (xy -1.379337 10.549335)
      (xy -1.353477 10.652933)
      (xy -1.279873 10.714246)
      (xy -1.164485 10.731520)
      (xy -1.013278 10.703000)
      (xy -0.942667 10.677804)
      (xy -0.859230 10.639885)
      (xy -0.819893 10.598136)
      (xy -0.808127 10.527335)
      (xy -0.807417 10.471429)
      (xy -0.807417 10.319171)
      (xy -1.042422 10.335986)
      (xy -1.199840 10.353926)
      (xy -1.301072 10.385236)
      (xy -1.356899 10.436744)
      (xy -1.378101 10.515275)
      (xy -1.379337 10.549335)
      (xy -1.740619 10.549335)
      (xy -1.734408 10.453080)
      (xy -1.673428 10.311958)
      (xy -1.622826 10.252139)
      (xy -1.526811 10.175860)
      (xy -1.419569 10.127292)
      (xy -1.283480 10.101315)
      (xy -1.100924 10.092806)
      (xy -1.074366 10.092715)
      (xy -0.807417 10.092715)
      (xy -0.807417 9.997002)
      (xy -0.833945 9.889560)
      (xy -0.914323 9.816841)
      (xy -1.049744 9.778479)
      (xy -1.241400 9.774107)
      (xy -1.455033 9.797701)
      (xy -1.614834 9.822289)
      (xy -1.614834 9.674699)
      (xy -1.614834 9.527109)
      (xy -1.439000 9.502925)
      (xy -1.145369 9.478109)
    )

    (stroke (width 0.000000) (type solid)) (fill solid) (layer "F.SilkS") (tstamp 27927991-6b20-4a9e-a57a-5aba946e8aac))
  (fp_poly
    (pts
      (xy 0.639206 9.482487)
      (xy 0.857881 9.503974)
      (xy 0.857881 9.655364)
      (xy 0.850842 9.755727)
      (xy 0.828389 9.796679)
      (xy 0.814176 9.797794)
      (xy 0.760815 9.793101)
      (xy 0.660661 9.789042)
      (xy 0.534208 9.786420)
      (xy 0.518625 9.786244)
      (xy 0.352685 9.791849)
      (xy 0.244387 9.814863)
      (xy 0.185607 9.858491)
      (xy 0.168212 9.924503)
      (xy 0.186216 9.988651)
      (xy 0.246584 10.037022)
      (xy 0.358854 10.075278)
      (xy 0.457289 10.096139)
      (xy 0.657601 10.145707)
      (xy 0.798823 10.212972)
      (xy 0.888241 10.304592)
      (xy 0.933138 10.427226)
      (xy 0.941987 10.539223)
      (xy 0.923374 10.711915)
      (xy 0.864400 10.843716)
      (xy 0.760359 10.937895)
      (xy 0.606549 10.997721)
      (xy 0.398266 11.026459)
      (xy 0.235497 11.030061)
      (xy 0.089063 11.027045)
      (xy -0.036745 11.021603)
      (xy -0.123287 11.014668)
      (xy -0.146101 11.010910)
      (xy -0.191020 10.978181)
      (xy -0.188614 10.922296)
      (xy -0.171948 10.828083)
      (xy -0.168671 10.779093)
      (xy -0.165076 10.747081)
      (xy -0.146589 10.727429)
      (xy -0.100899 10.718122)
      (xy -0.015697 10.717145)
      (xy 0.121330 10.722483)
      (xy 0.164603 10.724543)
      (xy 0.316830 10.731184)
      (xy 0.416333 10.731704)
      (xy 0.477579 10.723498)
      (xy 0.515037 10.703956)
      (xy 0.543175 10.670473)
      (xy 0.553882 10.654395)
      (xy 0.587853 10.558233)
      (xy 0.559508 10.478862)
      (xy 0.473318 10.424928)
      (xy 0.429221 10.413448)
      (xy 0.247214 10.376143)
      (xy 0.118026 10.343143)
      (xy 0.027834 10.309459)
      (xy -0.037182 10.270102)
      (xy -0.082805 10.228642)
      (xy -0.160551 10.104371)
      (xy -0.191440 9.956960)
      (xy -0.177219 9.805878)
      (xy -0.119638 9.670593)
      (xy -0.023906 9.572807)
      (xy 0.093439 9.522753)
      (xy 0.256965 9.489311)
      (xy 0.447025 9.475156)
    )

    (stroke (width 0.000000) (type solid)) (fill solid) (layer "F.SilkS") (tstamp 13f83750-aab8-4ccc-a1ef-1aa929709671))
  (fp_poly
    (pts
      (xy 1.547550 9.571258)
      (xy 1.549645 9.802880)
      (xy 1.555844 9.973850)
      (xy 1.566016 10.082099)
      (xy 1.580030 10.125555)
      (xy 1.582533 10.126358)
      (xy 1.659267 10.105196)
      (xy 1.759947 10.051779)
      (xy 1.860722 9.981212)
      (xy 1.937742 9.908597)
      (xy 1.948676 9.894487)
      (xy 1.997831 9.797367)
      (xy 2.034093 9.676413)
      (xy 2.040188 9.641408)
      (xy 2.061331 9.487152)
      (xy 2.224971 9.487152)
      (xy 2.322777 9.489311)
      (xy 2.370890 9.503630)
      (xy 2.386902 9.541879)
      (xy 2.388422 9.596490)
      (xy 2.356244 9.814921)
      (xy 2.260204 10.012647)
      (xy 2.180582 10.112337)
      (xy 2.044947 10.259484)
      (xy 2.132648 10.409136)
      (xy 2.228691 10.545135)
      (xy 2.331518 10.643788)
      (xy 2.428679 10.694108)
      (xy 2.460431 10.698278)
      (xy 2.498312 10.708660)
      (xy 2.517183 10.750524)
      (xy 2.523041 10.839947)
      (xy 2.523179 10.866490)
      (xy 2.521220 10.966016)
      (xy 2.507813 11.015492)
      (xy 2.471669 11.032156)
      (xy 2.413841 11.033385)
      (xy 2.300034 11.017965)
      (xy 2.202951 10.987819)
      (xy 2.090185 10.913335)
      (xy 1.971653 10.792790)
      (xy 1.863241 10.643832)
      (xy 1.812760 10.554363)
      (xy 1.768900 10.468779)
      (xy 1.738890 10.412812)
      (xy 1.732418 10.402270)
      (xy 1.697431 10.402050)
      (xy 1.635626 10.414328)
      (xy 1.592723 10.428062)
      (xy 1.566656 10.452461)
      (xy 1.553232 10.502011)
      (xy 1.548261 10.591198)
      (xy 1.547550 10.718747)
      (xy 1.547550 11.001060)
      (xy 1.379338 11.001060)
      (xy 1.211126 11.001060)
      (xy 1.211126 10.008609)
      (xy 1.211126 9.016159)
      (xy 1.379338 9.016159)
      (xy 1.547550 9.016159)
    )

    (stroke (width 0.000000) (type solid)) (fill solid) (layer "F.SilkS") (tstamp 633f3baa-6094-45e7-80bd-cdcba47fb3c4))
  (fp_poly
    (pts
      (xy 3.574434 9.499609)
      (xy 3.697036 9.538179)
      (xy 3.707679 9.544001)
      (xy 3.788806 9.598078)
      (xy 3.850226 9.659579)
      (xy 3.894870 9.738524)
      (xy 3.925671 9.844935)
      (xy 3.945561 9.988833)
      (xy 3.957470 10.180239)
      (xy 3.964170 10.420729)
      (xy 3.975360 11.001060)
      (xy 3.818040 11.001060)
      (xy 3.717906 10.995846)
      (xy 3.665730 10.975281)
      (xy 3.642766 10.932399)
      (xy 3.620265 10.882443)
      (xy 3.603863 10.875299)
      (xy 3.379483 10.976932)
      (xy 3.179785 11.021481)
      (xy 3.008211 11.008422)
      (xy 2.929279 10.977663)
      (xy 2.786183 10.872580)
      (xy 2.702274 10.736911)
      (xy 2.674573 10.565818)
      (xy 2.674570 10.563709)
      (xy 2.680445 10.523126)
      (xy 3.027815 10.523126)
      (xy 3.055033 10.630935)
      (xy 3.129561 10.701049)
      (xy 3.240709 10.729878)
      (xy 3.377785 10.713835)
      (xy 3.480846 10.675226)
      (xy 3.555255 10.633448)
      (xy 3.589739 10.585402)
      (xy 3.599412 10.504809)
      (xy 3.599735 10.468492)
      (xy 3.599735 10.318453)
      (xy 3.361341 10.338439)
      (xy 3.203846 10.357756)
      (xy 3.102896 10.387864)
      (xy 3.047935 10.434611)
      (xy 3.028405 10.503840)
      (xy 3.027815 10.523126)
      (xy 2.680445 10.523126)
      (xy 2.699550 10.391158)
      (xy 2.775480 10.258868)
      (xy 2.903843 10.165758)
      (xy 3.086123 10.110751)
      (xy 3.322186 10.092768)
      (xy 3.599735 10.092715)
      (xy 3.599735 9.994191)
      (xy 3.576435 9.885143)
      (xy 3.504885 9.811229)
      (xy 3.382611 9.771814)
      (xy 3.207139 9.766264)
      (xy 2.975996 9.793943)
      (xy 2.884835 9.810702)
      (xy 2.827972 9.817855)
      (xy 2.801036 9.798878)
      (xy 2.792862 9.737759)
      (xy 2.792318 9.678016)
      (xy 2.792318 9.527109)
      (xy 2.968941 9.502654)
      (xy 3.196322 9.481060)
      (xy 3.402841 9.480307)
    )

    (stroke (width 0.000000) (type solid)) (fill solid) (layer "F.SilkS") (tstamp 9ca4561b-39ae-4060-89d1-84142df5881f))
  (fp_poly
    (pts
      (xy -2.161523 9.022726)
      (xy -2.001721 9.032980)
      (xy -1.992803 10.017020)
      (xy -1.983884 11.001060)
      (xy -2.152604 11.001060)
      (xy -2.321324 11.001060)
      (xy -2.321324 10.006766)
      (xy -2.321324 9.012472)
    )

    (stroke (width 0.000000) (type solid)) (fill solid) (layer "F.SilkS") (tstamp 52f572c4-bbc6-4b30-ba4b-4813127498b2))
  (fp_poly
    (pts
      (xy -2.894575 8.683455)
      (xy -2.835787 8.692935)
      (xy -2.825960 8.699776)
      (xy -2.841477 8.739682)
      (xy -2.879276 8.810016)
      (xy -2.883677 8.817525)
      (xy -2.931928 8.881256)
      (xy -2.993536 8.909338)
      (xy -3.085531 8.915232)
      (xy -3.173273 8.908563)
      (xy -3.224361 8.891778)
      (xy -3.229668 8.883172)
      (xy -3.216766 8.831091)
      (xy -3.190626 8.765424)
      (xy -3.157551 8.712717)
      (xy -3.106864 8.687357)
      (xy -3.016333 8.679908)
      (xy -2.988772 8.679735)
    )

    (stroke (width 0.000000) (type solid)) (fill solid) (layer "F.SilkS") (tstamp a6524fd2-20c9-4514-a6ec-c150a3b4b906))
  (fp_poly
    (pts
      (xy -5.272489 7.029975)
      (xy -5.056684 7.102509)
      (xy -4.892063 7.217712)
      (xy -4.777650 7.376893)
      (xy -4.712471 7.581360)
      (xy -4.695099 7.805033)
      (xy -4.722396 8.051361)
      (xy -4.798880 8.252519)
      (xy -4.922781 8.406740)
      (xy -5.092328 8.512257)
      (xy -5.305748 8.567303)
      (xy -5.466887 8.575186)
      (xy -5.594281 8.565403)
      (xy -5.715198 8.544661)
      (xy -5.751260 8.534907)
      (xy -5.884331 8.464316)
      (xy -6.010537 8.349637)
      (xy -6.109053 8.212602)
      (xy -6.148953 8.119925)
      (xy -6.181230 7.950150)
      (xy -6.188385 7.761978)
      (xy -5.830973 7.761978)
      (xy -5.816602 7.965807)
      (xy -5.761967 8.116597)
      (xy -5.665519 8.216337)
      (xy -5.525712 8.267018)
      (xy -5.432320 8.274680)
      (xy -5.323491 8.261883)
      (xy -5.230474 8.228650)
      (xy -5.218501 8.221166)
      (xy -5.127705 8.121307)
      (xy -5.070909 7.984378)
      (xy -5.047747 7.827585)
      (xy -5.057851 7.668133)
      (xy -5.100855 7.523228)
      (xy -5.176393 7.410077)
      (xy -5.236753 7.364812)
      (xy -5.330794 7.333849)
      (xy -5.441234 7.321719)
      (xy -5.447759 7.321826)
      (xy -5.609308 7.349550)
      (xy -5.725402 7.424618)
      (xy -5.798130 7.549428)
      (xy -5.829578 7.726377)
      (xy -5.830973 7.761978)
      (xy -6.188385 7.761978)
      (xy -6.188464 7.759908)
      (xy -6.171520 7.576359)
      (xy -6.131262 7.426662)
      (xy -6.126520 7.415766)
      (xy -6.015048 7.247525)
      (xy -5.858358 7.120461)
      (xy -5.668139 7.039857)
      (xy -5.456081 7.010991)
    )

    (stroke (width 0.000000) (type solid)) (fill solid) (layer "F.SilkS") (tstamp 11cb3479-4d3b-484e-8421-010d5c19feec))
  (fp_poly
    (pts
      (xy -2.652513 6.736418)
      (xy -2.630544 6.772031)
      (xy -2.624253 6.853001)
      (xy -2.624106 6.879868)
      (xy -2.624106 7.031258)
      (xy -2.405430 7.031258)
      (xy -2.186755 7.031258)
      (xy -2.186755 7.182649)
      (xy -2.186755 7.334040)
      (xy -2.405430 7.334040)
      (xy -2.624106 7.334040)
      (xy -2.624106 7.770207)
      (xy -2.623399 7.949567)
      (xy -2.620126 8.073375)
      (xy -2.612558 8.153359)
      (xy -2.598966 8.201247)
      (xy -2.577622 8.228767)
      (xy -2.554302 8.243732)
      (xy -2.468304 8.264220)
      (xy -2.355263 8.259246)
      (xy -2.352448 8.258780)
      (xy -2.220397 8.236470)
      (xy -2.220397 8.372011)
      (xy -2.229131 8.463397)
      (xy -2.250872 8.523566)
      (xy -2.258626 8.531179)
      (xy -2.330191 8.552912)
      (xy -2.444252 8.565710)
      (xy -2.576578 8.569291)
      (xy -2.702938 8.563375)
      (xy -2.799102 8.547678)
      (xy -2.825297 8.537766)
      (xy -2.885896 8.497529)
      (xy -2.930210 8.443975)
      (xy -2.960683 8.366832)
      (xy -2.979760 8.255829)
      (xy -2.989885 8.100694)
      (xy -2.993503 7.891155)
      (xy -2.993676 7.830265)
      (xy -2.994172 7.334040)
      (xy -3.095099 7.334040)
      (xy -3.166801 7.325444)
      (xy -3.193176 7.286621)
      (xy -3.196026 7.240551)
      (xy -3.171343 7.168830)
      (xy -3.106696 7.072749)
      (xy -3.016190 6.966836)
      (xy -2.913931 6.865620)
      (xy -2.814024 6.783631)
      (xy -2.730573 6.735398)
      (xy -2.698896 6.728477)
    )

    (stroke (width 0.000000) (type solid)) (fill solid) (layer "F.SilkS") (tstamp c7496ecc-da95-42f3-a232-5e50a4c36f19))
  (fp_poly
    (pts
      (xy -1.106021 7.044465)
      (xy -0.940979 7.134459)
      (xy -0.815698 7.274332)
      (xy -0.735703 7.459653)
      (xy -0.706523 7.685995)
      (xy -0.706490 7.694413)
      (xy -0.706490 7.905960)
      (xy -1.194304 7.905960)
      (xy -1.384393 7.906384)
      (xy -1.517379 7.908624)
      (xy -1.603440 7.914128)
      (xy -1.652757 7.924349)
      (xy -1.675509 7.940735)
      (xy -1.681877 7.964737)
      (xy -1.682119 7.975457)
      (xy -1.652565 8.096675)
      (xy -1.568917 8.188373)
      (xy -1.438699 8.248065)
      (xy -1.269434 8.273263)
      (xy -1.068645 8.261478)
      (xy -0.912995 8.229796)
      (xy -0.797853 8.205017)
      (xy -0.733877 8.212015)
      (xy -0.708809 8.260104)
      (xy -0.710389 8.358599)
      (xy -0.712530 8.382109)
      (xy -0.724308 8.449875)
      (xy -0.755007 8.489575)
      (xy -0.822656 8.516454)
      (xy -0.891523 8.533473)
      (xy -1.047507 8.558226)
      (xy -1.228128 8.569824)
      (xy -1.408818 8.568204)
      (xy -1.565005 8.553307)
      (xy -1.645317 8.535358)
      (xy -1.786474 8.459685)
      (xy -1.910593 8.338092)
      (xy -1.997349 8.191865)
      (xy -2.011419 8.151966)
      (xy -2.041626 7.995004)
      (xy -2.051854 7.810965)
      (xy -2.042873 7.625051)
      (xy -2.041839 7.618920)
      (xy -1.715761 7.618920)
      (xy -1.684495 7.626434)
      (xy -1.600190 7.632396)
      (xy -1.477088 7.636046)
      (xy -1.379337 7.636821)
      (xy -1.237088 7.633894)
      (xy -1.124952 7.625985)
      (xy -1.056898 7.614398)
      (xy -1.042914 7.605369)
      (xy -1.062432 7.520572)
      (xy -1.108862 7.423633)
      (xy -1.164013 7.351523)
      (xy -1.170395 7.346262)
      (xy -1.253680 7.313752)
      (xy -1.369247 7.302689)
      (xy -1.485344 7.313865)
      (xy -1.552609 7.336748)
      (xy -1.604341 7.387375)
      (xy -1.660025 7.472417)
      (xy -1.702599 7.562365)
      (xy -1.715761 7.618920)
      (xy -2.041839 7.618920)
      (xy -2.015453 7.462464)
      (xy -1.987823 7.380598)
      (xy -1.879470 7.220799)
      (xy -1.721943 7.101553)
      (xy -1.533276 7.031829)
      (xy -1.305295 7.008779)
    )

    (stroke (width 0.000000) (type solid)) (fill solid) (layer "F.SilkS") (tstamp b4f2dbab-c5e8-42ec-9b93-51d209fb2352))
  (fp_poly
    (pts
      (xy 0.506375 7.031552)
      (xy 0.740133 7.070980)
      (xy 0.740133 7.217147)
      (xy 0.740133 7.363313)
      (xy 0.438894 7.343797)
      (xy 0.285186 7.336218)
      (xy 0.181165 7.338482)
      (xy 0.109731 7.352275)
      (xy 0.053782 7.379283)
      (xy 0.049196 7.382240)
      (xy -0.052269 7.485806)
      (xy -0.111591 7.624477)
      (xy -0.129830 7.781779)
      (xy -0.108050 7.941236)
      (xy -0.047309 8.086371)
      (xy 0.051330 8.200711)
      (xy 0.104171 8.235786)
      (xy 0.181004 8.255854)
      (xy 0.300136 8.264618)
      (xy 0.437617 8.262552)
      (xy 0.569501 8.250127)
      (xy 0.671839 8.227817)
      (xy 0.681259 8.224397)
      (xy 0.717433 8.219277)
      (xy 0.734906 8.250297)
      (xy 0.740031 8.331543)
      (xy 0.740133 8.354952)
      (xy 0.736687 8.450030)
      (xy 0.716285 8.500403)
      (xy 0.663826 8.528626)
      (xy 0.613974 8.543397)
      (xy 0.451085 8.571621)
      (xy 0.266923 8.577380)
      (xy 0.088131 8.561748)
      (xy -0.058648 8.525801)
      (xy -0.084106 8.515222)
      (xy -0.255045 8.406122)
      (xy -0.376468 8.257515)
      (xy -0.450456 8.065523)
      (xy -0.479091 7.826266)
      (xy -0.479592 7.778442)
      (xy -0.452555 7.535260)
      (xy -0.375298 7.335603)
      (xy -0.250663 7.181624)
      (xy -0.081491 7.075476)
      (xy 0.129376 7.019311)
      (xy 0.379097 7.015281)
    )

    (stroke (width 0.000000) (type solid)) (fill solid) (layer "F.SilkS") (tstamp f23fc6ea-0daa-40dc-82e4-17152ba6ad88))
  (fp_poly
    (pts
      (xy 5.349139 7.117631)
      (xy 5.349139 7.674998)
      (xy 5.424835 7.652074)
      (xy 5.606254 7.568879)
      (xy 5.736197 7.443239)
      (xy 5.817339 7.272045)
      (xy 5.840292 7.169359)
      (xy 5.862375 7.031258)
      (xy 6.026287 7.031258)
      (xy 6.124212 7.033507)
      (xy 6.172447 7.047796)
      (xy 6.188582 7.085440)
      (xy 6.190199 7.136693)
      (xy 6.157243 7.347107)
      (xy 6.061103 7.548597)
      (xy 5.979361 7.655864)
      (xy 5.847652 7.805494)
      (xy 5.934796 7.954194)
      (xy 6.031643 8.090993)
      (xy 6.135372 8.189432)
      (xy 6.233674 8.238731)
      (xy 6.263864 8.242384)
      (xy 6.302657 8.251163)
      (xy 6.319454 8.288711)
      (xy 6.319974 8.371842)
      (xy 6.318201 8.402186)
      (xy 6.308104 8.499754)
      (xy 6.287356 8.548262)
      (xy 6.245602 8.565933)
      (xy 6.223841 8.568225)
      (xy 6.127550 8.562713)
      (xy 6.041961 8.544496)
      (xy 5.922662 8.481060)
      (xy 5.798842 8.370074)
      (xy 5.686905 8.227934)
      (xy 5.632735 8.135427)
      (xy 5.570763 8.023737)
      (xy 5.520804 7.964196)
      (xy 5.470204 7.946354)
      (xy 5.416123 7.956519)
      (xy 5.383194 7.973726)
      (xy 5.363181 8.009168)
      (xy 5.352957 8.077070)
      (xy 5.349399 8.191660)
      (xy 5.349139 8.261472)
      (xy 5.349139 8.545166)
      (xy 5.180928 8.545166)
      (xy 5.012716 8.545166)
      (xy 5.012716 7.552715)
      (xy 5.012716 6.560265)
      (xy 5.180928 6.560265)
      (xy 5.349139 6.560265)
    )

    (stroke (width 0.000000) (type solid)) (fill solid) (layer "F.SilkS") (tstamp ef8bda07-6be1-4611-b38a-c631e352009f))
  (fp_poly
    (pts
      (xy 7.291509 7.029378)
      (xy 7.483194 7.085499)
      (xy 7.624177 7.184185)
      (xy 7.686349 7.266755)
      (xy 7.711817 7.317738)
      (xy 7.730640 7.377403)
      (xy 7.744125 7.457153)
      (xy 7.753578 7.568393)
      (xy 7.760304 7.722526)
      (xy 7.765611 7.930956)
      (xy 7.766309 7.964835)
      (xy 7.778049 8.545166)
      (xy 7.606508 8.545166)
      (xy 7.505366 8.542472)
      (xy 7.454445 8.528986)
      (xy 7.436732 8.496603)
      (xy 7.434967 8.463428)
      (xy 7.434967 8.381690)
      (xy 7.288869 8.463346)
      (xy 7.099696 8.542406)
      (xy 6.919164 8.566944)
      (xy 6.759306 8.535702)
      (xy 6.729148 8.521760)
      (xy 6.589204 8.417269)
      (xy 6.501027 8.284616)
      (xy 6.464252 8.136917)
      (xy 6.471362 8.062309)
      (xy 6.835998 8.062309)
      (xy 6.849868 8.173803)
      (xy 6.912886 8.244924)
      (xy 7.018679 8.273307)
      (xy 7.160873 8.256586)
      (xy 7.266075 8.221910)
      (xy 7.350514 8.183270)
      (xy 7.389638 8.140418)
      (xy 7.400801 8.067453)
      (xy 7.401325 8.020056)
      (xy 7.401325 7.872318)
      (xy 7.207881 7.872814)
      (xy 7.035394 7.885296)
      (xy 6.919884 7.923844)
      (xy 6.855042 7.991672)
      (xy 6.835998 8.062309)
      (xy 6.471362 8.062309)
      (xy 6.478511 7.987285)
      (xy 6.543437 7.848835)
      (xy 6.658662 7.734682)
      (xy 6.752628 7.682949)
      (xy 6.843587 7.659383)
      (xy 6.977367 7.643019)
      (xy 7.129641 7.636822)
      (xy 7.131105 7.636821)
      (xy 7.401325 7.636821)
      (xy 7.401325 7.538297)
      (xy 7.371709 7.422705)
      (xy 7.286588 7.341930)
      (xy 7.211267 7.312951)
      (xy 7.127447 7.305504)
      (xy 7.002135 7.309443)
      (xy 6.859791 7.322836)
      (xy 6.724876 7.343751)
      (xy 6.671009 7.355625)
      (xy 6.623834 7.361910)
      (xy 6.601257 7.339062)
      (xy 6.594316 7.271552)
      (xy 6.593908 7.222000)
      (xy 6.593908 7.069023)
      (xy 6.753709 7.044281)
      (xy 7.048542 7.015685)
    )

    (stroke (width 0.000000) (type solid)) (fill solid) (layer "F.SilkS") (tstamp 5fed08b4-f660-4eab-b6f2-c44504c8f358))
  (fp_poly
    (pts
      (xy -6.942134 6.578682)
      (xy -6.802088 6.605853)
      (xy -6.690575 6.650783)
      (xy -6.594938 6.715978)
      (xy -6.590649 6.719559)
      (xy -6.466803 6.865030)
      (xy -6.389863 7.043319)
      (xy -6.359835 7.239072)
      (xy -6.376726 7.436931)
      (xy -6.440543 7.621540)
      (xy -6.551294 7.777543)
      (xy -6.590164 7.813543)
      (xy -6.719873 7.897260)
      (xy -6.877918 7.948455)
      (xy -7.078846 7.971102)
      (xy -7.174238 7.973058)
      (xy -7.401324 7.973245)
      (xy -7.401324 8.259205)
      (xy -7.401324 8.545166)
      (xy -7.586865 8.545166)
      (xy -7.772407 8.545166)
      (xy -7.763488 7.561126)
      (xy -7.757466 6.896689)
      (xy -7.401324 6.896689)
      (xy -7.401324 7.266755)
      (xy -7.401324 7.636821)
      (xy -7.151997 7.636821)
      (xy -7.021993 7.635037)
      (xy -6.939533 7.625638)
      (xy -6.884894 7.602556)
      (xy -6.838352 7.559723)
      (xy -6.815573 7.533313)
      (xy -6.747991 7.407873)
      (xy -6.725525 7.261324)
      (xy -6.746570 7.115042)
      (xy -6.809520 6.990405)
      (xy -6.860131 6.939812)
      (xy -6.921013 6.918469)
      (xy -7.028687 6.903485)
      (xy -7.157417 6.897759)
      (xy -7.401324 6.896689)
      (xy -7.757466 6.896689)
      (xy -7.754569 6.577086)
      (xy -7.358447 6.567601)
      (xy -7.123368 6.566766)
    )

    (stroke (width 0.000000) (type solid)) (fill solid) (layer "F.SilkS") (tstamp 920950c5-f3dd-4413-8086-4b8a4d0d8f61))
  (fp_poly
    (pts
      (xy -4.070728 7.552715)
      (xy -4.070728 8.545166)
      (xy -4.238940 8.545166)
      (xy -4.407152 8.545166)
      (xy -4.407152 7.552715)
      (xy -4.407152 6.560265)
      (xy -4.238940 6.560265)
      (xy -4.070728 6.560265)
    )

    (stroke (width 0.000000) (type solid)) (fill solid) (layer "F.SilkS") (tstamp b9fb631b-55cd-4466-8910-01ff506973ed))
  (fp_poly
    (pts
      (xy -3.372005 7.796623)
      (xy -3.362951 8.545166)
      (xy -3.549271 8.545166)
      (xy -3.735592 8.545166)
      (xy -3.726537 7.796623)
      (xy -3.717483 7.048080)
      (xy -3.549271 7.048080)
      (xy -3.381059 7.048080)
    )

    (stroke (width 0.000000) (type solid)) (fill solid) (layer "F.SilkS") (tstamp f7476a45-9619-4686-85e8-18b8f75e1694))
  (fp_poly
    (pts
      (xy 1.185894 6.566917)
      (xy 1.362517 6.577086)
      (xy 1.372237 6.871457)
      (xy 1.378388 7.002753)
      (xy 1.386580 7.103877)
      (xy 1.395424 7.159609)
      (xy 1.399140 7.165828)
      (xy 1.438002 7.151896)
      (xy 1.508447 7.118182)
      (xy 1.512045 7.116328)
      (xy 1.692233 7.046731)
      (xy 1.870663 7.019778)
      (xy 2.033786 7.034326)
      (xy 2.168050 7.089234)
      (xy 2.257366 7.179102)
      (xy 2.280044 7.222815)
      (xy 2.296675 7.275682)
      (xy 2.308173 7.348231)
      (xy 2.315454 7.450991)
      (xy 2.319430 7.594492)
      (xy 2.321016 7.789263)
      (xy 2.321199 7.914371)
      (xy 2.321325 8.545166)
      (xy 2.153113 8.545166)
      (xy 1.984901 8.545166)
      (xy 1.984901 7.992469)
      (xy 1.983891 7.779944)
      (xy 1.980282 7.624749)
      (xy 1.973208 7.516954)
      (xy 1.961802 7.446627)
      (xy 1.945196 7.403837)
      (xy 1.932034 7.386906)
      (xy 1.839693 7.341178)
      (xy 1.707134 7.344765)
      (xy 1.539725 7.397489)
      (xy 1.533518 7.400129)
      (xy 1.379338 7.466218)
      (xy 1.379338 8.005692)
      (xy 1.379338 8.545166)
      (xy 1.194305 8.545166)
      (xy 1.009272 8.545166)
      (xy 1.009272 7.550957)
      (xy 1.009272 6.556749)
    )

    (stroke (width 0.000000) (type solid)) (fill solid) (layer "F.SilkS") (tstamp 6cedde7b-90bb-41b0-9ba4-ef485a5d70a2))
  (fp_poly
    (pts
      (xy 3.690616 7.026362)
      (xy 3.823514 7.087400)
      (xy 3.903926 7.175948)
      (xy 3.927223 7.220100)
      (xy 3.944309 7.271992)
      (xy 3.956129 7.342229)
      (xy 3.963628 7.441420)
      (xy 3.967749 7.580169)
      (xy 3.969437 7.769084)
      (xy 3.969676 7.914371)
      (xy 3.969802 8.545166)
      (xy 3.801590 8.545166)
      (xy 3.633378 8.545166)
      (xy 3.633378 7.979974)
      (xy 3.631403 7.740793)
      (xy 3.625293 7.564591)
      (xy 3.614767 7.447171)
      (xy 3.599546 7.384335)
      (xy 3.593007 7.374411)
      (xy 3.518515 7.341657)
      (xy 3.404480 7.338505)
      (xy 3.271158 7.363707)
      (xy 3.170795 7.400419)
      (xy 3.027815 7.465320)
      (xy 3.027815 8.005243)
      (xy 3.027815 8.545166)
      (xy 2.842138 8.545166)
      (xy 2.656461 8.545166)
      (xy 2.665516 7.796623)
      (xy 2.674570 7.048080)
      (xy 2.834371 7.037826)
      (xy 2.930704 7.034230)
      (xy 2.977678 7.045346)
      (xy 2.992922 7.079601)
      (xy 2.994173 7.114205)
      (xy 2.994173 7.200838)
      (xy 3.124221 7.134492)
      (xy 3.333113 7.049490)
      (xy 3.524530 7.013586)
    )

    (stroke (width 0.000000) (type solid)) (fill solid) (layer "F.SilkS") (tstamp 772f3486-b124-4cc8-beca-e7fb103044a4))
  (fp_poly
    (pts
      (xy 4.668525 7.796623)
      (xy 4.677579 8.545166)
      (xy 4.491259 8.545166)
      (xy 4.304938 8.545166)
      (xy 4.313993 7.796623)
      (xy 4.323047 7.048080)
      (xy 4.491259 7.048080)
      (xy 4.659471 7.048080)
    )

    (stroke (width 0.000000) (type solid)) (fill solid) (layer "F.SilkS") (tstamp 18b82c3e-2178-482e-a629-3a2139d12874))
  (fp_poly
    (pts
      (xy -3.557682 6.566917)
      (xy -3.381059 6.577086)
      (xy -3.381059 6.694835)
      (xy -3.381059 6.812583)
      (xy -3.557682 6.822752)
      (xy -3.734304 6.832920)
      (xy -3.734304 6.694835)
      (xy -3.734304 6.556749)
    )

    (stroke (width 0.000000) (type solid)) (fill solid) (layer "F.SilkS") (tstamp 29157d61-f579-4777-ab3b-1d5ed6b46015))
  (fp_poly
    (pts
      (xy 4.676292 6.694835)
      (xy 4.676292 6.829404)
      (xy 4.491259 6.829404)
      (xy 4.306226 6.829404)
      (xy 4.306226 6.694835)
      (xy 4.306226 6.560265)
      (xy 4.491259 6.560265)
      (xy 4.676292 6.560265)
    )

    (stroke (width 0.000000) (type solid)) (fill solid) (layer "F.SilkS") (tstamp f1b95297-bc85-4f19-bf20-8613df197425))
  (fp_poly
    (pts
      (xy 0.289073 -11.295704)
      (xy 0.493389 -11.292202)
      (xy 0.664977 -11.286745)
      (xy 0.789554 -11.279334)
      (xy 0.824239 -11.275662)
      (xy 0.992451 -11.253377)
      (xy 1.009272 -10.853498)
      (xy 1.026093 -10.453620)
      (xy 1.420759 -10.374138)
      (xy 1.624292 -10.328587)
      (xy 1.849321 -10.271007)
      (xy 2.061906 -10.210364)
      (xy 2.167491 -10.176864)
      (xy 2.312950 -10.129175)
      (xy 2.435704 -10.090752)
      (xy 2.521241 -10.066024)
      (xy 2.553465 -10.059073)
      (xy 2.583363 -10.086292)
      (xy 2.638420 -10.160078)
      (xy 2.710338 -10.268622)
      (xy 2.778096 -10.378675)
      (xy 2.859224 -10.507641)
      (xy 2.932609 -10.611690)
      (xy 2.989345 -10.678933)
      (xy 3.017543 -10.698278)
      (xy 3.084879 -10.681021)
      (xy 3.198739 -10.633025)
      (xy 3.349059 -10.559953)
      (xy 3.525774 -10.467465)
      (xy 3.718821 -10.361225)
      (xy 3.918135 -10.246893)
      (xy 4.113653 -10.130134)
      (xy 4.295310 -10.016607)
      (xy 4.453043 -9.911977)
      (xy 4.576786 -9.821903)
      (xy 4.580634 -9.818882)
      (xy 4.703651 -9.721971)
      (xy 4.522121 -9.394297)
      (xy 4.448980 -9.259422)
      (xy 4.389912 -9.145077)
      (xy 4.351637 -9.064628)
      (xy 4.340471 -9.032980)
      (xy 4.364722 -8.997066)
      (xy 4.429106 -8.932141)
      (xy 4.520887 -8.850809)
      (xy 4.544131 -8.831437)
      (xy 4.703509 -8.690935)
      (xy 4.887385 -8.513919)
      (xy 5.079148 -8.317141)
      (xy 5.262186 -8.117353)
      (xy 5.333340 -8.035549)
      (xy 5.466888 -7.879177)
      (xy 5.795468 -8.064163)
      (xy 5.931430 -8.136986)
      (xy 6.048792 -8.192967)
      (xy 6.133798 -8.225974)
      (xy 6.170417 -8.231354)
      (xy 6.216318 -8.190969)
      (xy 6.287300 -8.100443)
      (xy 6.377704 -7.969488)
      (xy 6.481870 -7.807815)
      (xy 6.594139 -7.625135)
      (xy 6.708851 -7.431160)
      (xy 6.820346 -7.235600)
      (xy 6.922966 -7.048167)
      (xy 7.011051 -6.878572)
      (xy 7.078940 -6.736527)
      (xy 7.120975 -6.631742)
      (xy 7.132186 -6.581036)
      (xy 7.104518 -6.543085)
      (xy 7.028830 -6.481089)
      (xy 6.916098 -6.403361)
      (xy 6.812583 -6.338990)
      (xy 6.684034 -6.260135)
      (xy 6.580185 -6.192355)
      (xy 6.512801 -6.143598)
      (xy 6.492981 -6.123049)
      (xy 6.502874 -6.082574)
      (xy 6.529665 -5.992450)
      (xy 6.569022 -5.866876)
      (xy 6.607204 -5.748717)
      (xy 6.665960 -5.556408)
      (xy 6.725527 -5.340336)
      (xy 6.776180 -5.136492)
      (xy 6.792457 -5.063179)
      (xy 6.824204 -4.913317)
      (xy 6.852210 -4.782024)
      (xy 6.872625 -4.687309)
      (xy 6.879815 -4.654699)
      (xy 6.891166 -4.623476)
      (xy 6.916388 -4.602236)
      (xy 6.967423 -4.588467)
      (xy 7.056215 -4.579659)
      (xy 7.194707 -4.573302)
      (xy 7.280656 -4.570437)
      (xy 7.434939 -4.563933)
      (xy 7.563390 -4.555492)
      (xy 7.651748 -4.546253)
      (xy 7.685251 -4.538149)
      (xy 7.702061 -4.488055)
      (xy 7.715909 -4.381571)
      (xy 7.726792 -4.229525)
      (xy 7.734704 -4.042748)
      (xy 7.739640 -3.832069)
      (xy 7.741596 -3.608316)
      (xy 7.740567 -3.382319)
      (xy 7.736549 -3.164908)
      (xy 7.729535 -2.966912)
      (xy 7.719523 -2.799161)
      (xy 7.706506 -2.672482)
      (xy 7.690481 -2.597707)
      (xy 7.686106 -2.588556)
      (xy 7.646556 -2.575957)
      (xy 7.553978 -2.565726)
      (xy 7.422618 -2.558983)
      (xy 7.282232 -2.556821)
      (xy 7.116699 -2.556209)
      (xy 7.006499 -2.552863)
      (xy 6.939680 -2.544518)
      (xy 6.904292 -2.528909)
      (xy 6.888383 -2.503771)
      (xy 6.882803 -2.481126)
      (xy 6.779889 -2.008336)
      (xy 6.672108 -1.591766)
      (xy 6.605477 -1.370608)
      (xy 6.560613 -1.223693)
      (xy 6.527077 -1.100104)
      (xy 6.508405 -1.013874)
      (xy 6.507083 -0.980029)
      (xy 6.542057 -0.952188)
      (xy 6.622477 -0.899678)
      (xy 6.735168 -0.830858)
      (xy 6.827647 -0.776619)
      (xy 6.955001 -0.701604)
      (xy 7.059239 -0.637357)
      (xy 7.127294 -0.592101)
      (xy 7.146511 -0.575959)
      (xy 7.141685 -0.528877)
      (xy 7.105512 -0.434009)
      (xy 7.042975 -0.300202)
      (xy 6.959059 -0.136301)
      (xy 6.858747 0.048845)
      (xy 6.747023 0.246390)
      (xy 6.628870 0.447488)
      (xy 6.509272 0.643291)
      (xy 6.393213 0.824953)
      (xy 6.285676 0.983627)
      (xy 6.209046 1.088181)
      (xy 6.185189 1.113058)
      (xy 6.155032 1.121492)
      (xy 6.107165 1.109723)
      (xy 6.030178 1.073989)
      (xy 5.912662 1.010531)
      (xy 5.825259 0.961685)
      (xy 5.489258 0.773101)
      (xy 4.910519 1.351841)
      (xy 4.722969 1.540744)
      (xy 4.579741 1.688493)
      (xy 4.476355 1.800257)
      (xy 4.408335 1.881207)
      (xy 4.371200 1.936511)
      (xy 4.360475 1.971339)
      (xy 4.363785 1.982972)
      (xy 4.393074 2.034104)
      (xy 4.445589 2.128631)
      (xy 4.512585 2.250746)
      (xy 4.554451 2.327651)
      (xy 4.713111 2.619938)
      (xy 4.299403 2.894369)
      (xy 4.167065 2.978458)
      (xy 4.008852 3.073165)
      (xy 3.834528 3.173292)
      (xy 3.653853 3.273638)
      (xy 3.476589 3.369004)
      (xy 3.312495 3.454191)
      (xy 3.171334 3.523998)
      (xy 3.062867 3.573227)
      (xy 2.996855 3.596677)
      (xy 2.981731 3.596267)
      (xy 2.961146 3.563656)
      (xy 2.913690 3.485258)
      (xy 2.846679 3.373236)
      (xy 2.776397 3.254901)
      (xy 2.696717 3.124365)
      (xy 2.627532 3.018465)
      (xy 2.576768 2.948861)
      (xy 2.553445 2.926888)
      (xy 2.509550 2.938007)
      (xy 2.421691 2.967200)
      (xy 2.308636 3.008221)
      (xy 2.305284 3.009481)
      (xy 2.180335 3.051359)
      (xy 2.008335 3.102107)
      (xy 1.808098 3.156844)
      (xy 1.598437 3.210689)
      (xy 1.398165 3.258758)
      (xy 1.226096 3.296172)
      (xy 1.136487 3.312760)
      (xy 1.011384 3.333249)
      (xy 1.001917 3.724856)
      (xy 0.992451 4.116464)
      (xy 0.891524 4.143999)
      (xy 0.812066 4.156390)
      (xy 0.678687 4.167172)
      (xy 0.504738 4.176085)
      (xy 0.303567 4.182869)
      (xy 0.088525 4.187262)
      (xy -0.127039 4.189006)
      (xy -0.329773 4.187839)
      (xy -0.506328 4.183501)
      (xy -0.643353 4.175731)
      (xy -0.659674 4.174253)
      (xy -0.791717 4.159144)
      (xy -0.899287 4.142532)
      (xy -0.963547 4.127450)
      (xy -0.970866 4.124136)
      (xy -0.990185 4.077105)
      (xy -1.002918 3.965435)
      (xy -1.008846 3.791468)
      (xy -1.009271 3.717023)
      (xy -1.009271 3.333645)
      (xy -1.135430 3.312433)
      (xy -1.333439 3.273712)
      (xy -1.569617 3.219211)
      (xy -1.818642 3.155430)
      (xy -2.055194 3.088867)
      (xy -2.253951 3.026022)
      (xy -2.261645 3.023370)
      (xy -2.407405 2.974906)
      (xy -2.502690 2.949285)
      (xy -2.559513 2.944396)
      (xy -2.589886 2.958127)
      (xy -2.595111 2.964755)
      (xy -2.624994 3.012295)
      (xy -2.680392 3.102439)
      (xy -2.752098 3.220156)
      (xy -2.798627 3.296954)
      (xy -2.872818 3.419255)
      (xy -2.933371 3.518314)
      (xy -2.972300 3.581112)
      (xy -2.982185 3.596267)
      (xy -3.018025 3.590694)
      (xy -3.102136 3.556257)
      (xy -3.224760 3.498154)
      (xy -3.376142 3.421585)
      (xy -3.546527 3.331747)
      (xy -3.726158 3.233839)
      (xy -3.905279 3.133060)
      (xy -4.074134 3.034608)
      (xy -4.222969 2.943681)
      (xy -4.299403 2.894369)
      (xy -4.713110 2.619938)
      (xy -4.554450 2.327651)
      (xy -4.483075 2.196805)
      (xy -4.421130 2.084416)
      (xy -4.377361 2.006294)
      (xy -4.363784 1.982972)
      (xy -4.362663 1.956668)
      (xy -4.385645 1.912549)
      (xy -4.437209 1.845445)
      (xy -4.521833 1.750187)
      (xy -4.643994 1.621605)
      (xy -4.808172 1.454530)
      (xy -4.910518 1.351841)
      (xy -5.489257 0.773101)
      (xy -5.825258 0.961685)
      (xy -5.970344 1.042246)
      (xy -6.068535 1.092983)
      (xy -6.131241 1.117659)
      (xy -6.169872 1.120032)
      (xy -6.195836 1.103865)
      (xy -6.209045 1.088181)
      (xy -6.306161 0.954301)
      (xy -6.415791 0.790347)
      (xy -6.532952 0.605165)
      (xy -6.652659 0.407603)
      (xy -6.769930 0.206507)
      (xy -6.879780 0.010725)
      (xy -6.977226 -0.170898)
      (xy -7.057284 -0.329514)
      (xy -7.114971 -0.456277)
      (xy -7.145302 -0.542339)
      (xy -7.146510 -0.575959)
      (xy -7.112297 -0.602618)
      (xy -7.032566 -0.654142)
      (xy -6.920386 -0.722306)
      (xy -6.827646 -0.776619)
      (xy -6.700029 -0.851949)
      (xy -6.595318 -0.916911)
      (xy -6.526688 -0.963146)
      (xy -6.507082 -0.980029)
      (xy -6.509733 -1.021728)
      (xy -6.530362 -1.113147)
      (xy -6.565433 -1.240252)
      (xy -6.605477 -1.370608)
      (xy -6.715361 -1.749948)
      (xy -6.821417 -2.189657)
      (xy -6.882803 -2.481126)
      (xy -6.892439 -2.513710)
      (xy -6.913750 -2.535286)
      (xy -6.958684 -2.548119)
      (xy -7.039195 -2.554474)
      (xy -7.167231 -2.556616)
      (xy -7.282231 -2.556821)
      (xy -7.436406 -2.559444)
      (xy -7.564687 -2.566568)
      (xy -7.652829 -2.577072)
      (xy -7.686106 -2.588556)
      (xy -7.702867 -2.648999)
      (xy -7.716618 -2.763991)
      (xy -7.727364 -2.922704)
      (xy -7.735110 -3.114308)
      (xy -7.739860 -3.327973)
      (xy -7.741620 -3.552871)
      (xy -7.741456 -3.582914)
      (xy -5.734159 -3.582914)
      (xy -5.733829 -3.323647)
      (xy -5.731005 -3.117796)
      (xy -5.724760 -2.951510)
      (xy -5.714163 -2.810940)
      (xy -5.698286 -2.682235)
      (xy -5.676201 -2.551544)
      (xy -5.659119 -2.464123)
      (xy -5.572835 -2.089393)
      (xy -5.469352 -1.745697)
      (xy -5.339742 -1.407371)
      (xy -5.175078 -1.048752)
      (xy -5.147216 -0.992450)
      (xy -4.837071 -0.443098)
      (xy -4.478773 0.060107)
      (xy -4.074652 0.515501)
      (xy -3.627034 0.921424)
      (xy -3.138247 1.276214)
      (xy -2.610618 1.578211)
      (xy -2.046476 1.825751)
      (xy -1.448147 2.017174)
      (xy -0.817959 2.150819)
      (xy -0.723311 2.165415)
      (xy -0.660208 2.169434)
      (xy -0.541433 2.172204)
      (xy -0.378588 2.173639)
      (xy -0.183274 2.173656)
      (xy 0.032907 2.172170)
      (xy 0.100928 2.171409)
      (xy 0.367498 2.166940)
      (xy 0.580327 2.160125)
      (xy 0.752947 2.149925)
      (xy 0.898890 2.135301)
      (xy 1.031685 2.115215)
      (xy 1.157115 2.090316)
      (xy 1.768443 1.924605)
      (xy 2.350293 1.700206)
      (xy 2.899339 1.419283)
      (xy 3.412257 1.083996)
      (xy 3.885719 0.696510)
      (xy 4.316402 0.258987)
      (xy 4.684933 -0.203881)
      (xy 4.827237 -0.419687)
      (xy 4.978216 -0.677935)
      (xy 5.128248 -0.959676)
      (xy 5.267711 -1.245958)
      (xy 5.386984 -1.517831)
      (xy 5.476445 -1.756346)
      (xy 5.482360 -1.774454)
      (xy 5.566616 -2.052337)
      (xy 5.630850 -2.306925)
      (xy 5.677371 -2.554820)
      (xy 5.708492 -2.812623)
      (xy 5.726524 -3.096936)
      (xy 5.733779 -3.424361)
      (xy 5.734160 -3.582914)
      (xy 5.730585 -3.905076)
      (xy 5.719710 -4.176939)
      (xy 5.699093 -4.415311)
      (xy 5.666296 -4.637001)
      (xy 5.618879 -4.858819)
      (xy 5.554402 -5.097574)
      (xy 5.478412 -5.345089)
      (xy 5.297745 -5.822697)
      (xy 5.063623 -6.299103)
      (xy 4.784806 -6.760941)
      (xy 4.470055 -7.194847)
      (xy 4.128127 -7.587456)
      (xy 3.811564 -7.888302)
      (xy 3.306460 -8.280476)
      (xy 2.775783 -8.610914)
      (xy 2.221255 -8.878970)
      (xy 1.644596 -9.083999)
      (xy 1.047530 -9.225354)
      (xy 0.431777 -9.302390)
      (xy 0.000000 -9.317708)
      (xy -0.627561 -9.285112)
      (xy -1.237616 -9.187755)
      (xy -1.828443 -9.026282)
      (xy -2.398319 -8.801339)
      (xy -2.945523 -8.513572)
      (xy -3.468334 -8.163626)
      (xy -3.811563 -7.888302)
      (xy -4.170165 -7.543113)
      (xy -4.509304 -7.144860)
      (xy -4.820218 -6.706910)
      (xy -5.094150 -6.242625)
      (xy -5.322340 -5.765372)
      (xy -5.478412 -5.345089)
      (xy -5.560629 -5.076123)
      (xy -5.623555 -4.839470)
      (xy -5.669629 -4.618318)
      (xy -5.701292 -4.395861)
      (xy -5.720982 -4.155287)
      (xy -5.731140 -3.879789)
      (xy -5.734159 -3.582914)
      (xy -7.741456 -3.582914)
      (xy -7.740393 -3.778173)
      (xy -7.736184 -3.993047)
      (xy -7.728999 -4.186667)
      (xy -7.718843 -4.348201)
      (xy -7.705718 -4.466821)
      (xy -7.689632 -4.531697)
      (xy -7.685250 -4.538149)
      (xy -7.645508 -4.547129)
      (xy -7.552756 -4.556341)
      (xy -7.421257 -4.564647)
      (xy -7.280656 -4.570437)
      (xy -7.114589 -4.576510)
      (xy -7.003852 -4.583850)
      (xy -6.936503 -4.594967)
      (xy -6.900599 -4.612372)
      (xy -6.884196 -4.638575)
      (xy -6.879815 -4.654699)
      (xy -6.866098 -4.717419)
      (xy -6.842383 -4.827971)
      (xy -6.812522 -4.968344)
      (xy -6.792456 -5.063179)
      (xy -6.748447 -5.251156)
      (xy -6.691439 -5.466475)
      (xy -6.631158 -5.673148)
      (xy -6.607203 -5.748717)
      (xy -6.560835 -5.892621)
      (xy -6.523517 -6.012595)
      (xy -6.499582 -6.094439)
      (xy -6.492980 -6.123049)
      (xy -6.520131 -6.149394)
      (xy -6.593742 -6.201516)
      (xy -6.702051 -6.271466)
      (xy -6.812582 -6.338990)
      (xy -6.946099 -6.423109)
      (xy -7.050898 -6.497802)
      (xy -7.116004 -6.554757)
      (xy -7.132185 -6.581036)
      (xy -7.115092 -6.648744)
      (xy -7.067586 -6.761535)
      (xy -6.995325 -6.909698)
      (xy -6.903971 -7.083523)
      (xy -6.799182 -7.273297)
      (xy -6.686618 -7.469309)
      (xy -6.571937 -7.661849)
      (xy -6.460801 -7.841204)
      (xy -6.358868 -7.997664)
      (xy -6.271798 -8.121517)
      (xy -6.205250 -8.203053)
      (xy -6.170416 -8.231354)
      (xy -6.123927 -8.222821)
      (xy -6.033336 -8.186076)
      (xy -5.912399 -8.127251)
      (xy -5.795467 -8.064163)
      (xy -5.466887 -7.879177)
      (xy -5.333339 -8.035549)
      (xy -5.159050 -8.231537)
      (xy -4.968970 -8.431643)
      (xy -4.779708 -8.619114)
      (xy -4.607877 -8.777199)
      (xy -4.544130 -8.831437)
      (xy -4.447920 -8.914732)
      (xy -4.376225 -8.984471)
      (xy -4.341784 -9.028049)
      (xy -4.340470 -9.032980)
      (xy -4.355992 -9.074463)
      (xy -4.397974 -9.161114)
      (xy -4.459694 -9.279564)
      (xy -4.522121 -9.394297)
      (xy -4.703650 -9.721971)
      (xy -4.580633 -9.818882)
      (xy -4.458361 -9.908299)
      (xy -4.301722 -10.012486)
      (xy -4.120780 -10.125781)
      (xy -3.925601 -10.242522)
      (xy -3.726247 -10.357046)
      (xy -3.532783 -10.463692)
      (xy -3.355274 -10.556798)
      (xy -3.203782 -10.630701)
      (xy -3.088373 -10.679740)
      (xy -3.019110 -10.698252)
      (xy -3.017542 -10.698278)
      (xy -2.981569 -10.670942)
      (xy -2.921498 -10.596860)
      (xy -2.846236 -10.487918)
      (xy -2.778096 -10.378675)
      (xy -2.698991 -10.250079)
      (xy -2.630594 -10.146209)
      (xy -2.580959 -10.078840)
      (xy -2.559555 -10.059073)
      (xy -2.518142 -10.068999)
      (xy -2.426920 -10.095932)
      (xy -2.299912 -10.135608)
      (xy -2.169865 -10.177614)
      (xy -1.974592 -10.236694)
      (xy -1.748165 -10.297747)
      (xy -1.525773 -10.351549)
      (xy -1.417042 -10.374887)
      (xy -1.026092 -10.453620)
      (xy -1.009271 -10.853498)
      (xy -0.992450 -11.253377)
      (xy -0.824238 -11.275662)
      (xy -0.723507 -11.283890)
      (xy -0.569803 -11.290162)
      (xy -0.377409 -11.294480)
      (xy -0.160610 -11.296843)
      (xy 0.066312 -11.297251)
    )

    (stroke (width 0.000000) (type solid)) (fill solid) (layer "F.SilkS") (tstamp b89478d4-247a-40c1-afb8-f67e8fc3cd09))
  (fp_poly
    (pts
      (xy 0.312349 -8.893205)
      (xy 0.574357 -8.883315)
      (xy 0.802810 -8.863703)
      (xy 1.014493 -8.831811)
      (xy 1.226192 -8.785081)
      (xy 1.454694 -8.720955)
      (xy 1.716784 -8.636873)
      (xy 1.731169 -8.632067)
      (xy 2.271043 -8.416630)
      (xy 2.779520 -8.144142)
      (xy 3.253033 -7.818808)
      (xy 3.688021 -7.444834)
      (xy 4.080918 -7.026426)
      (xy 4.428160 -6.567790)
      (xy 4.726184 -6.073133)
      (xy 4.971426 -5.546659)
      (xy 5.160321 -4.992575)
      (xy 5.285518 -4.437543)
      (xy 5.325367 -4.119571)
      (xy 5.345085 -3.765706)
      (xy 5.345161 -3.396435)
      (xy 5.326081 -3.032244)
      (xy 5.288336 -2.693622)
      (xy 5.237534 -2.422252)
      (xy 5.062936 -1.820456)
      (xy 4.833381 -1.257157)
      (xy 4.549296 -0.732975)
      (xy 4.211106 -0.248530)
      (xy 3.819238 0.195557)
      (xy 3.374118 0.598665)
      (xy 2.948147 0.912694)
      (xy 2.443481 1.210502)
      (xy 1.907461 1.449118)
      (xy 1.341816 1.627938)
      (xy 0.748274 1.746362)
      (xy 0.454173 1.781557)
      (xy 0.239809 1.799989)
      (xy 0.064635 1.809268)
      (xy -0.097345 1.809354)
      (xy -0.272131 1.800210)
      (xy -0.485719 1.781797)
      (xy -0.502960 1.780145)
      (xy -1.082783 1.691444)
      (xy -1.644110 1.540821)
      (xy -2.182513 1.331737)
      (xy -2.693564 1.067657)
      (xy -3.172836 0.752045)
      (xy -3.615901 0.388364)
      (xy -4.018332 -0.019922)
      (xy -4.375701 -0.469350)
      (xy -4.683582 -0.956456)
      (xy -4.937545 -1.477777)
      (xy -5.053219 -1.779499)
      (xy -5.153156 -2.087125)
      (xy -5.227501 -2.368716)
      (xy -5.280020 -2.645599)
      (xy -5.314479 -2.939100)
      (xy -5.334642 -3.270549)
      (xy -5.338974 -3.397881)
      (xy -5.344647 -3.639409)
      (xy -5.345482 -3.831385)
      (xy -5.340574 -3.991427)
      (xy -5.329016 -4.137152)
      (xy -5.312861 -4.263122)
      (xy -4.852581 -4.263122)
      (xy -4.851704 -4.229563)
      (xy -4.790138 -4.212201)
      (xy -4.665274 -4.206087)
      (xy -4.581023 -4.205697)
      (xy -4.335786 -4.225428)
      (xy -4.090140 -4.278737)
      (xy -3.956196 -4.324867)
      (xy -3.916988 -4.335102)
      (xy -3.903273 -4.312266)
      (xy -3.909713 -4.241932)
      (xy -3.914386 -4.211859)
      (xy -3.970430 -3.965076)
      (xy -4.062315 -3.682983)
      (xy -4.182945 -3.382073)
      (xy -4.325228 -3.078843)
      (xy -4.482069 -2.789787)
      (xy -4.621536 -2.567549)
      (xy -4.807926 -2.292316)
      (xy -4.620959 -2.356642)
      (xy -4.407170 -2.449980)
      (xy -4.183833 -2.581344)
      (xy -3.970215 -2.736862)
      (xy -3.785582 -2.902666)
      (xy -3.661380 -3.047458)
      (xy -3.600327 -3.126614)
      (xy -3.555291 -3.174224)
      (xy -3.539992 -3.181141)
      (xy -3.534064 -3.134275)
      (xy -3.547922 -3.033512)
      (xy -3.578764 -2.888333)
      (xy -3.623791 -2.708220)
      (xy -3.680200 -2.502656)
      (xy -3.745190 -2.281122)
      (xy -3.815960 -2.053101)
      (xy -3.889708 -1.828074)
      (xy -3.963633 -1.615525)
      (xy -4.034934 -1.424934)
      (xy -4.100810 -1.265785)
      (xy -4.115339 -1.233672)
      (xy -4.172515 -1.107986)
      (xy -4.202884 -1.032318)
      (xy -4.208548 -0.995928)
      (xy -4.191605 -0.988074)
      (xy -4.161907 -0.995523)
      (xy -3.962901 -1.090690)
      (xy -3.762509 -1.247775)
      (xy -3.564506 -1.461613)
      (xy -3.372670 -1.727034)
      (xy -3.190776 -2.038872)
      (xy -3.022601 -2.391958)
      (xy -2.885696 -2.741854)
      (xy -2.830691 -2.895542)
      (xy -2.794662 -2.990638)
      (xy -2.774634 -3.032157)
      (xy -2.767634 -3.025111)
      (xy -2.770688 -2.974514)
      (xy -2.775929 -2.926887)
      (xy -2.793501 -2.788567)
      (xy -2.817874 -2.614557)
      (xy -2.846898 -2.418433)
      (xy -2.878424 -2.213769)
      (xy -2.910303 -2.014138)
      (xy -2.940384 -1.833116)
      (xy -2.966519 -1.684276)
      (xy -2.986557 -1.581192)
      (xy -2.994056 -1.549441)
      (xy -3.012867 -1.456685)
      (xy -3.001265 -1.421028)
      (xy -2.957521 -1.442401)
      (xy -2.879909 -1.520732)
      (xy -2.859514 -1.543985)
      (xy -2.652711 -1.827720)
      (xy -2.470083 -2.171793)
      (xy -2.312999 -2.573240)
      (xy -2.193509 -2.985506)
      (xy -2.157781 -3.125663)
      (xy -2.127846 -3.236768)
      (xy -2.107327 -3.305759)
      (xy -2.100183 -3.321929)
      (xy -2.097853 -3.285492)
      (xy -2.099879 -3.195572)
      (xy -2.105422 -3.065772)
      (xy -2.113643 -2.909691)
      (xy -2.123705 -2.740933)
      (xy -2.134769 -2.573099)
      (xy -2.145997 -2.419789)
      (xy -2.156551 -2.294606)
      (xy -2.165592 -2.211152)
      (xy -2.170188 -2.185952)
      (xy -2.179905 -2.126219)
      (xy -2.159032 -2.114491)
      (xy -2.114706 -2.143064)
      (xy -2.054067 -2.204232)
      (xy -1.984252 -2.290289)
      (xy -1.912401 -2.393530)
      (xy -1.845652 -2.506249)
      (xy -1.812501 -2.572049)
      (xy -1.757057 -2.706769)
      (xy -1.701048 -2.869973)
      (xy -1.650067 -3.041917)
      (xy -1.609709 -3.202858)
      (xy -1.585566 -3.333054)
      (xy -1.581192 -3.388426)
      (xy -1.569876 -3.442273)
      (xy -1.547549 -3.448344)
      (xy -1.534446 -3.407558)
      (xy -1.523850 -3.309011)
      (xy -1.516407 -3.162203)
      (xy -1.512763 -2.976634)
      (xy -1.512540 -2.933312)
      (xy -1.511172 -2.439073)
      (xy -1.407709 -2.556821)
      (xy -1.277653 -2.743790)
      (xy -1.169444 -2.975295)
      (xy -1.090460 -3.230162)
      (xy -1.048085 -3.487214)
      (xy -1.042914 -3.603376)
      (xy -1.037860 -3.695383)
      (xy -1.024910 -3.748494)
      (xy -1.014154 -3.754143)
      (xy -0.991217 -3.715512)
      (xy -0.952918 -3.625102)
      (xy -0.903531 -3.495492)
      (xy -0.847328 -3.339259)
      (xy -0.788580 -3.168983)
      (xy -0.731559 -2.997240)
      (xy -0.680539 -2.836609)
      (xy -0.639790 -2.699668)
      (xy -0.613586 -2.598996)
      (xy -0.605946 -2.552281)
      (xy -0.636528 -2.537975)
      (xy -0.718276 -2.518568)
      (xy -0.835622 -2.497554)
      (xy -0.879289 -2.490895)
      (xy -1.249185 -2.416815)
      (xy -1.578400 -2.310000)
      (xy -1.861338 -2.173229)
      (xy -2.092401 -2.009280)
      (xy -2.265992 -1.820932)
      (xy -2.285205 -1.793052)
      (xy -2.342225 -1.702430)
      (xy -2.379780 -1.634042)
      (xy -2.388609 -1.609750)
      (xy -2.361347 -1.579483)
      (xy -2.292522 -1.534679)
      (xy -2.254039 -1.513907)
      (xy -2.173109 -1.467429)
      (xy -2.125135 -1.429850)
      (xy -2.119470 -1.419611)
      (xy -2.141802 -1.372633)
      (xy -2.200129 -1.293819)
      (xy -2.281449 -1.197448)
      (xy -2.372760 -1.097799)
      (xy -2.461059 -1.009150)
      (xy -2.533343 -0.945779)
      (xy -2.572123 -0.922541)
      (xy -2.659813 -0.927480)
      (xy -2.783921 -0.972022)
      (xy -2.820776 -0.989823)
      (xy -3.004686 -1.060797)
      (xy -3.158186 -1.071853)
      (xy -3.281473 -1.022993)
      (xy -3.315304 -0.993979)
      (xy -3.372640 -0.912411)
      (xy -3.397828 -0.828603)
      (xy -3.397880 -0.825482)
      (xy -3.392030 -0.766323)
      (xy -3.363155 -0.763093)
      (xy -3.330596 -0.781582)
      (xy -3.261776 -0.806730)
      (xy -3.196483 -0.781867)
      (xy -3.123691 -0.757015)
      (xy -3.016257 -0.742076)
      (xy -2.962971 -0.740132)
      (xy -2.850846 -0.730719)
      (xy -2.778873 -0.705835)
      (xy -2.757836 -0.670520)
      (xy -2.770221 -0.650087)
      (xy -2.809784 -0.638592)
      (xy -2.899995 -0.623408)
      (xy -3.024510 -0.607119)
      (xy -3.084782 -0.600391)
      (xy -3.286564 -0.570518)
      (xy -3.428261 -0.526395)
      (xy -3.516589 -0.461819)
      (xy -3.558265 -0.370587)
      (xy -3.560006 -0.246496)
      (xy -3.548393 -0.172216)
      (xy -3.531656 -0.097000)
      (xy -3.517766 -0.081414)
      (xy -3.498982 -0.118639)
      (xy -3.496096 -0.126159)
      (xy -3.441820 -0.189762)
      (xy -3.383923 -0.201854)
      (xy -3.306349 -0.217452)
      (xy -3.201459 -0.257207)
      (xy -3.142332 -0.285960)
      (xy -3.030152 -0.334805)
      (xy -2.922872 -0.364378)
      (xy -2.879823 -0.368568)
      (xy -2.775496 -0.367069)
      (xy -2.855952 -0.309694)
      (xy -2.930916 -0.250507)
      (xy -3.022435 -0.170885)
      (xy -3.053567 -0.142173)
      (xy -3.124718 -0.068693)
      (xy -3.154616 -0.008691)
      (xy -3.154433 0.066532)
      (xy -3.149101 0.103203)
      (xy -3.110900 0.248705)
      (xy -3.053057 0.348589)
      (xy -3.002890 0.385342)
      (xy -2.974183 0.378921)
      (xy -2.979368 0.323543)
      (xy -2.972191 0.239588)
      (xy -2.922596 0.167805)
      (xy -2.849621 0.134748)
      (xy -2.843885 0.134570)
      (xy -2.803083 0.108200)
      (xy -2.743071 0.039878)
      (xy -2.691446 -0.033556)
      (xy -2.583074 -0.180858)
      (xy -2.473339 -0.291792)
      (xy -2.372831 -0.356859)
      (xy -2.316245 -0.370066)
      (xy -2.253842 -0.340481)
      (xy -2.197238 -0.248608)
      (xy -2.193593 -0.240227)
      (xy -2.135696 -0.143369)
      (xy -2.062838 -0.068487)
      (xy -2.047226 -0.058208)
      (xy -1.966799 0.021600)
      (xy -1.944754 0.089503)
      (xy -1.933199 0.185033)
      (xy -1.858248 0.067285)
      (xy -1.808796 -0.039221)
      (xy -1.783881 -0.149273)
      (xy -1.783172 -0.166037)
      (xy -1.790311 -0.231360)
      (xy -1.818632 -0.292639)
      (xy -1.878248 -0.364902)
      (xy -1.979278 -0.463178)
      (xy -1.989634 -0.472783)
      (xy -2.101132 -0.582812)
      (xy -2.160531 -0.659226)
      (xy -2.171206 -0.706489)
      (xy -2.169349 -0.710454)
      (xy -2.126282 -0.773744)
      (xy -2.057870 -0.862686)
      (xy -1.975790 -0.963468)
      (xy -1.891719 -1.062277)
      (xy -1.817332 -1.145302)
      (xy -1.764307 -1.198731)
      (xy -1.746092 -1.211126)
      (xy -1.703552 -1.194683)
      (xy -1.623761 -1.152137)
      (xy -1.548785 -1.107762)
      (xy -1.453864 -1.055187)
      (xy -1.380646 -1.025235)
      (xy -1.350770 -1.022956)
      (xy -1.323023 -1.066534)
      (xy -1.301357 -1.138444)
      (xy -1.241678 -1.277793)
      (xy -1.130333 -1.402682)
      (xy -0.982726 -1.504075)
      (xy -0.814256 -1.572936)
      (xy -0.640325 -1.600230)
      (xy -0.529867 -1.591056)
      (xy -0.469063 -1.570674)
      (xy -0.442855 -1.527334)
      (xy -0.437351 -1.442417)
      (xy -0.442221 -1.357517)
      (xy -0.465256 -1.320469)
      (xy -0.519093 -1.312066)
      (xy -0.523127 -1.312053)
      (xy -0.650781 -1.285128)
      (xy -0.775840 -1.216150)
      (xy -0.855838 -1.136547)
      (xy -0.903708 -1.017481)
      (xy -0.892635 -0.896472)
      (xy -0.829100 -0.787294)
      (xy -0.719584 -0.703718)
      (xy -0.637401 -0.672362)
      (xy -0.554598 -0.644340)
      (xy -0.508223 -0.617535)
      (xy -0.504635 -0.610560)
      (xy -0.530244 -0.564224)
      (xy -0.594102 -0.499875)
      (xy -0.676756 -0.434107)
      (xy -0.758752 -0.383515)
      (xy -0.783794 -0.372427)
      (xy -0.909540 -0.358694)
      (xy -1.035685 -0.407505)
      (xy -1.154042 -0.514670)
      (xy -1.208327 -0.589747)
      (xy -1.307401 -0.745971)
      (xy -1.409875 -0.604510)
      (xy -1.510529 -0.415148)
      (xy -1.547561 -0.220576)
      (xy -1.523200 -0.029395)
      (xy -1.439676 0.149792)
      (xy -1.299217 0.308382)
      (xy -1.145478 0.415702)
      (xy -1.011674 0.480975)
      (xy -0.889440 0.512292)
      (xy -0.758590 0.520120)
      (xy -0.632342 0.516770)
      (xy -0.520980 0.506726)
      (xy -0.467235 0.496752)
      (xy -0.416222 0.486249)
      (xy -0.387806 0.501155)
      (xy -0.372175 0.555775)
      (xy -0.360804 0.651934)
      (xy -0.337178 0.767896)
      (xy -0.291954 0.903917)
      (xy -0.232314 1.045522)
      (xy -0.165437 1.178236)
      (xy -0.098503 1.287584)
      (xy -0.038692 1.359092)
      (xy 0.000000 1.379338)
      (xy 0.037331 1.354455)
      (xy 0.089284 1.293845)
      (xy 0.094322 1.286821)
      (xy 0.204342 1.105313)
      (xy 0.292581 0.910303)
      (xy 0.348623 0.726610)
      (xy 0.360805 0.651934)
      (xy 0.373326 0.548796)
      (xy 0.389713 0.498376)
      (xy 0.419777 0.486369)
      (xy 0.467235 0.496752)
      (xy 0.549116 0.510095)
      (xy 0.667762 0.518499)
      (xy 0.758591 0.520120)
      (xy 0.903331 0.510216)
      (xy 1.024937 0.475723)
      (xy 1.145479 0.415702)
      (xy 1.330360 0.280064)
      (xy 1.460109 0.116873)
      (xy 1.532499 -0.065271)
      (xy 1.545298 -0.257765)
      (xy 1.496279 -0.452007)
      (xy 1.409875 -0.604510)
      (xy 1.307402 -0.745971)
      (xy 1.208327 -0.589747)
      (xy 1.097025 -0.454668)
      (xy 0.973795 -0.375824)
      (xy 0.846825 -0.357405)
      (xy 0.783795 -0.372427)
      (xy 0.706651 -0.413743)
      (xy 0.622011 -0.476068)
      (xy 0.549329 -0.542807)
      (xy 0.508060 -0.597366)
      (xy 0.504636 -0.610560)
      (xy 0.533813 -0.634665)
      (xy 0.606780 -0.663412)
      (xy 0.637402 -0.672362)
      (xy 0.770655 -0.734738)
      (xy 0.861693 -0.830718)
      (xy 0.904035 -0.946530)
      (xy 0.891198 -1.068401)
      (xy 0.855839 -1.136547)
      (xy 0.759904 -1.227567)
      (xy 0.632483 -1.291772)
      (xy 0.523128 -1.312053)
      (xy 0.467266 -1.319455)
      (xy 0.442889 -1.354463)
      (xy 0.437360 -1.436285)
      (xy 0.437351 -1.442417)
      (xy 0.443292 -1.529270)
      (xy 0.470376 -1.571548)
      (xy 0.529868 -1.591056)
      (xy 0.698955 -1.596194)
      (xy 0.872760 -1.553793)
      (xy 1.035882 -1.472890)
      (xy 1.172920 -1.362518)
      (xy 1.268473 -1.231714)
      (xy 1.301358 -1.138444)
      (xy 1.324720 -1.062569)
      (xy 1.350771 -1.022956)
      (xy 1.393337 -1.029264)
      (xy 1.472729 -1.064672)
      (xy 1.548785 -1.107762)
      (xy 1.644075 -1.163524)
      (xy 1.717136 -1.201053)
      (xy 1.746093 -1.211126)
      (xy 1.777047 -1.186856)
      (xy 1.837592 -1.123255)
      (xy 1.916051 -1.034134)
      (xy 2.000750 -0.933306)
      (xy 2.080010 -0.834582)
      (xy 2.142155 -0.751775)
      (xy 2.169350 -0.710454)
      (xy 2.164356 -0.666424)
      (xy 2.111047 -0.593783)
      (xy 2.006049 -0.488070)
      (xy 1.989635 -0.472783)
      (xy 1.884789 -0.371727)
      (xy 1.822179 -0.297908)
      (xy 1.791689 -0.236297)
      (xy 1.783204 -0.171865)
      (xy 1.783173 -0.166037)
      (xy 1.801975 -0.060422)
      (xy 1.848081 0.050246)
      (xy 1.858249 0.067285)
      (xy 1.933200 0.185033)
      (xy 1.944755 0.089503)
      (xy 1.988833 -0.010161)
      (xy 2.047227 -0.058208)
      (xy 2.119606 -0.123359)
      (xy 2.183305 -0.218295)
      (xy 2.193594 -0.240227)
      (xy 2.249971 -0.336382)
      (xy 2.311853 -0.369940)
      (xy 2.316245 -0.370066)
      (xy 2.404737 -0.340805)
      (xy 2.509506 -0.259354)
      (xy 2.619964 -0.135211)
      (xy 2.691446 -0.033556)
      (xy 2.756262 0.056560)
      (xy 2.813522 0.117578)
      (xy 2.843886 0.134570)
      (xy 2.917823 0.163754)
      (xy 2.969772 0.233605)
      (xy 2.980695 0.317570)
      (xy 2.979369 0.323543)
      (xy 2.974724 0.380339)
      (xy 3.002891 0.385342)
      (xy 3.070925 0.325843)
      (xy 3.123892 0.211902)
      (xy 3.149102 0.103203)
      (xy 3.157441 0.015353)
      (xy 3.139757 -0.046857)
      (xy 3.084876 -0.112126)
      (xy 3.053568 -0.142173)
      (xy 2.963820 -0.222615)
      (xy 2.879221 -0.292290)
      (xy 2.855953 -0.309694)
      (xy 2.775497 -0.367069)
      (xy 2.879824 -0.368568)
      (xy 2.970758 -0.353496)
      (xy 3.084605 -0.313483)
      (xy 3.142333 -0.285960)
      (xy 3.249285 -0.237318)
      (xy 3.345832 -0.206947)
      (xy 3.383924 -0.201854)
      (xy 3.464392 -0.174530)
      (xy 3.496097 -0.126159)
      (xy 3.515964 -0.083180)
      (xy 3.530028 -0.092212)
      (xy 3.546029 -0.160072)
      (xy 3.548394 -0.172216)
      (xy 3.563688 -0.314577)
      (xy 3.542321 -0.421054)
      (xy 3.477577 -0.497851)
      (xy 3.362738 -0.551170)
      (xy 3.191089 -0.587216)
      (xy 3.084783 -0.600391)
      (xy 2.950509 -0.616359)
      (xy 2.843481 -0.632337)
      (xy 2.780044 -0.645741)
      (xy 2.770222 -0.650087)
      (xy 2.761088 -0.688787)
      (xy 2.808396 -0.719627)
      (xy 2.901363 -0.737570)
      (xy 2.962972 -0.740132)
      (xy 3.075459 -0.748394)
      (xy 3.168605 -0.769305)
      (xy 3.196483 -0.781867)
      (xy 3.265030 -0.806724)
      (xy 3.330596 -0.781582)
      (xy 3.380841 -0.758077)
      (xy 3.396864 -0.786387)
      (xy 3.397881 -0.819041)
      (xy 3.375589 -0.897291)
      (xy 3.321326 -0.980917)
      (xy 3.315382 -0.987538)
      (xy 3.207940 -1.059612)
      (xy 3.071977 -1.073296)
      (xy 2.905466 -1.028602)
      (xy 2.820777 -0.989823)
      (xy 2.689548 -0.935526)
      (xy 2.590838 -0.919776)
      (xy 2.572124 -0.922541)
      (xy 2.523285 -0.953717)
      (xy 2.447531 -1.022141)
      (xy 2.357864 -1.113536)
      (xy 2.267287 -1.213622)
      (xy 2.188803 -1.308122)
      (xy 2.135413 -1.382758)
      (xy 2.119471 -1.419611)
      (xy 2.146708 -1.448929)
      (xy 2.215476 -1.493154)
      (xy 2.254040 -1.513907)
      (xy 2.335004 -1.560720)
      (xy 2.382969 -1.599097)
      (xy 2.388610 -1.609750)
      (xy 2.371351 -1.650799)
      (xy 2.326896 -1.727790)
      (xy 2.285206 -1.793052)
      (xy 2.119742 -1.984894)
      (xy 1.895961 -2.152529)
      (xy 1.619298 -2.293263)
      (xy 1.295188 -2.404400)
      (xy 0.929067 -2.483247)
      (xy 0.876709 -2.491272)
      (xy 0.741852 -2.511826)
      (xy 0.661241 -2.529052)
      (xy 0.622518 -2.549160)
      (xy 0.613323 -2.578361)
      (xy 0.620627 -2.619943)
      (xy 0.646146 -2.715881)
      (xy 0.686525 -2.850149)
      (xy 0.737177 -3.009228)
      (xy 0.793514 -3.179598)
      (xy 0.850950 -3.347739)
      (xy 0.904896 -3.500133)
      (xy 0.950766 -3.623261)
      (xy 0.983972 -3.703602)
      (xy 0.995741 -3.725427)
      (xy 1.021854 -3.752038)
      (xy 1.035618 -3.736619)
      (xy 1.041017 -3.669175)
      (xy 1.041844 -3.609802)
      (xy 1.065752 -3.351765)
      (xy 1.129685 -3.088945)
      (xy 1.226525 -2.841831)
      (xy 1.349152 -2.630912)
      (xy 1.407710 -2.556821)
      (xy 1.511173 -2.439073)
      (xy 1.512540 -2.933312)
      (xy 1.515298 -3.125864)
      (xy 1.521991 -3.281663)
      (xy 1.531974 -3.391210)
      (xy 1.544601 -3.445006)
      (xy 1.547550 -3.448344)
      (xy 1.572910 -3.436870)
      (xy 1.581192 -3.388426)
      (xy 1.592852 -3.286315)
      (xy 1.624101 -3.141552)
      (xy 1.669345 -2.973880)
      (xy 1.722992 -2.803042)
      (xy 1.779446 -2.648782)
      (xy 1.812502 -2.572049)
      (xy 1.873119 -2.457372)
      (xy 1.942924 -2.347764)
      (xy 2.014778 -2.250930)
      (xy 2.081542 -2.174575)
      (xy 2.136078 -2.126406)
      (xy 2.171246 -2.114126)
      (xy 2.179910 -2.145443)
      (xy 2.170189 -2.185952)
      (xy 2.162552 -2.235649)
      (xy 2.152867 -2.335760)
      (xy 2.141972 -2.472681)
      (xy 2.130707 -2.632811)
      (xy 2.119908 -2.802549)
      (xy 2.110415 -2.968294)
      (xy 2.103066 -3.116443)
      (xy 2.098698 -3.233396)
      (xy 2.098150 -3.305550)
      (xy 2.100184 -3.321929)
      (xy 2.110815 -3.294971)
      (xy 2.133695 -3.215686)
      (xy 2.165202 -3.097135)
      (xy 2.193510 -2.985506)
      (xy 2.326183 -2.534469)
      (xy 2.485645 -2.138113)
      (xy 2.670526 -1.799401)
      (xy 2.859515 -1.543985)
      (xy 2.944646 -1.453854)
      (xy 2.995561 -1.420919)
      (xy 3.013545 -1.445222)
      (xy 2.999885 -1.526804)
      (xy 2.993969 -1.548258)
      (xy 2.978035 -1.619874)
      (xy 2.954902 -1.744682)
      (xy 2.926700 -1.909239)
      (xy 2.895555 -2.100104)
      (xy 2.863596 -2.303832)
      (xy 2.832952 -2.506981)
      (xy 2.805749 -2.696108)
      (xy 2.784116 -2.857771)
      (xy 2.775733 -2.926887)
      (xy 2.768248 -3.000648)
      (xy 2.769022 -3.033864)
      (xy 2.781037 -3.021515)
      (xy 2.807281 -2.958577)
      (xy 2.850736 -2.840028)
      (xy 2.885697 -2.741854)
      (xy 3.038243 -2.355967)
      (xy 3.207918 -2.006664)
      (xy 3.390944 -1.699111)
      (xy 3.583546 -1.438478)
      (xy 3.781946 -1.229931)
      (xy 3.982370 -1.078638)
      (xy 4.161908 -0.995523)
      (xy 4.196006 -0.987858)
      (xy 4.209240 -0.999821)
      (xy 4.199509 -1.042154)
      (xy 4.164715 -1.125596)
      (xy 4.115340 -1.233672)
      (xy 4.051163 -1.383968)
      (xy 3.980896 -1.567955)
      (xy 3.907340 -1.776152)
      (xy 3.833296 -1.999076)
      (xy 3.761566 -2.227245)
      (xy 3.694951 -2.451176)
      (xy 3.636252 -2.661388)
      (xy 3.588271 -2.848399)
      (xy 3.553809 -3.002726)
      (xy 3.535667 -3.114887)
      (xy 3.536647 -3.175401)
      (xy 3.539993 -3.181141)
      (xy 3.565786 -3.164655)
      (xy 3.616701 -3.106595)
      (xy 3.661381 -3.047458)
      (xy 3.804079 -2.884155)
      (xy 3.992886 -2.718810)
      (xy 4.208537 -2.565292)
      (xy 4.431764 -2.437470)
      (xy 4.620960 -2.356642)
      (xy 4.807927 -2.292316)
      (xy 4.621536 -2.567549)
      (xy 4.457346 -2.832955)
      (xy 4.298226 -3.132002)
      (xy 4.156656 -3.439079)
      (xy 4.045118 -3.728575)
      (xy 4.023719 -3.794147)
      (xy 3.977685 -3.950743)
      (xy 3.940008 -4.096592)
      (xy 3.913489 -4.218643)
      (xy 3.900930 -4.303846)
      (xy 3.905135 -4.339151)
      (xy 3.906628 -4.339433)
      (xy 3.942742 -4.329914)
      (xy 4.024995 -4.305407)
      (xy 4.132600 -4.272149)
      (xy 4.270101 -4.239431)
      (xy 4.431272 -4.216533)
      (xy 4.594800 -4.204844)
      (xy 4.739369 -4.205754)
      (xy 4.843662 -4.220653)
      (xy 4.856567 -4.224949)
      (xy 4.864227 -4.248914)
      (xy 4.819234 -4.297511)
      (xy 4.718569 -4.373756)
      (xy 4.682696 -4.398623)
      (xy 4.317856 -4.678104)
      (xy 4.014892 -4.975982)
      (xy 3.769878 -5.296605)
      (xy 3.601938 -5.595056)
      (xy 3.498086 -5.834337)
      (xy 3.423032 -6.066983)
      (xy 3.371133 -6.315549)
      (xy 3.336743 -6.602590)
      (xy 3.330450 -6.679950)
      (xy 3.314404 -6.845066)
      (xy 3.293234 -6.996993)
      (xy 3.270032 -7.116034)
      (xy 3.253323 -7.171484)
      (xy 3.138742 -7.363222)
      (xy 2.976274 -7.520964)
      (xy 2.780192 -7.635138)
      (xy 2.564769 -7.696170)
      (xy 2.459798 -7.703777)
      (xy 2.236843 -7.684523)
      (xy 2.050358 -7.621206)
      (xy 1.880669 -7.506843)
      (xy 1.863755 -7.492233)
      (xy 1.715484 -7.339415)
      (xy 1.622556 -7.182580)
      (xy 1.575908 -7.001563)
      (xy 1.565819 -6.829404)
      (xy 1.577346 -6.636116)
      (xy 1.618639 -6.482460)
      (xy 1.699473 -6.343824)
      (xy 1.809108 -6.216756)
      (xy 1.928683 -6.091923)
      (xy 1.803390 -5.931104)
      (xy 1.565521 -5.679941)
      (xy 1.281584 -5.477682)
      (xy 1.127107 -5.397194)
      (xy 1.014655 -5.346417)
      (xy 0.928641 -5.310828)
      (xy 0.884457 -5.296708)
      (xy 0.881867 -5.297118)
      (xy 0.871353 -5.332598)
      (xy 0.853001 -5.416589)
      (xy 0.830673 -5.531343)
      (xy 0.829385 -5.538309)
      (xy 0.786735 -5.769669)
      (xy 0.586811 -5.867378)
      (xy 0.386888 -5.965087)
      (xy 0.555100 -6.016853)
      (xy 0.651742 -6.047234)
      (xy 0.717514 -6.069117)
      (xy 0.733929 -6.075545)
      (xy 0.724565 -6.105924)
      (xy 0.689573 -6.178094)
      (xy 0.644189 -6.262494)
      (xy 0.546702 -6.469981)
      (xy 0.479753 -6.681271)
      (xy 0.443825 -6.885530)
      (xy 0.439402 -7.071923)
      (xy 0.466965 -7.229617)
      (xy 0.526999 -7.347777)
      (xy 0.593299 -7.403763)
      (xy 0.650575 -7.446055)
      (xy 0.730734 -7.519168)
      (xy 0.820115 -7.608736)
      (xy 0.905056 -7.700395)
      (xy 0.971898 -7.779780)
      (xy 1.006981 -7.832527)
      (xy 1.009272 -7.841186)
      (xy 0.980266 -7.862895)
      (xy 0.910307 -7.883696)
      (xy 0.908454 -7.884071)
      (xy 0.830287 -7.920685)
      (xy 0.716512 -8.003706)
      (xy 0.574374 -8.127670)
      (xy 0.529978 -8.169452)
      (xy 0.410680 -8.280410)
      (xy 0.301321 -8.376756)
      (xy 0.215352 -8.446947)
      (xy 0.171581 -8.476979)
      (xy 0.036188 -8.515341)
      (xy -0.129029 -8.513173)
      (xy -0.301514 -8.472178)
      (xy -0.389580 -8.434576)
      (xy -0.515412 -8.380872)
      (xy -0.624620 -8.362689)
      (xy -0.710962 -8.367248)
      (xy -0.891641 -8.358269)
      (xy -1.053680 -8.286942)
      (xy -1.200978 -8.151372)
      (xy -1.230120 -8.114933)
      (xy -1.293387 -8.027305)
      (xy -1.335367 -7.960021)
      (xy -1.345695 -7.934530)
      (xy -1.315134 -7.922958)
      (xy -1.234806 -7.920031)
      (xy -1.121741 -7.926315)
      (xy -1.115452 -7.926889)
      (xy -0.909909 -7.930514)
      (xy -0.744166 -7.901375)
      (xy -0.627316 -7.841467)
      (xy -0.599843 -7.813834)
      (xy -0.573601 -7.775259)
      (xy -0.599043 -7.776957)
      (xy -0.622384 -7.785986)
      (xy -0.695315 -7.804983)
      (xy -0.803076 -7.821989)
      (xy -0.857880 -7.827777)
      (xy -0.952270 -7.834042)
      (xy -0.988283 -7.829510)
      (xy -0.974266 -7.812080)
      (xy -0.958808 -7.802379)
      (xy -0.775248 -7.656553)
      (xy -0.641855 -7.466984)
      (xy -0.558606 -7.233468)
      (xy -0.525480 -6.955803)
      (xy -0.542456 -6.633784)
      (xy -0.609511 -6.267210)
      (xy -0.726624 -5.855876)
      (xy -0.744760 -5.801365)
      (xy -0.799215 -5.642628)
      (xy -0.847870 -5.505433)
      (xy -0.885823 -5.403283)
      (xy -0.908172 -5.349683)
      (xy -0.909720 -5.346913)
      (xy -0.941933 -5.332269)
      (xy -1.009764 -5.347379)
      (xy -1.123195 -5.394740)
      (xy -1.148788 -5.406676)
      (xy -1.441987 -5.581290)
      (xy -1.698786 -5.808737)
      (xy -1.803389 -5.931104)
      (xy -1.928682 -6.091923)
      (xy -1.809107 -6.216756)
      (xy -1.686084 -6.362290)
      (xy -1.611076 -6.501505)
      (xy -1.574307 -6.659014)
      (xy -1.565818 -6.829404)
      (xy -1.582486 -7.043532)
      (xy -1.638318 -7.217648)
      (xy -1.742379 -7.371918)
      (xy -1.863755 -7.492233)
      (xy -2.032843 -7.612121)
      (xy -2.216746 -7.680260)
      (xy -2.435139 -7.703633)
      (xy -2.459797 -7.703777)
      (xy -2.679407 -7.671340)
      (xy -2.886455 -7.581214)
      (xy -3.066668 -7.442971)
      (xy -3.205774 -7.266187)
      (xy -3.253323 -7.171484)
      (xy -3.276035 -7.089586)
      (xy -3.299009 -6.960182)
      (xy -3.319154 -6.802971)
      (xy -3.330450 -6.679950)
      (xy -3.361467 -6.380279)
      (xy -3.408635 -6.124512)
      (xy -3.477599 -5.890095)
      (xy -3.574003 -5.654473)
      (xy -3.601937 -5.595056)
      (xy -3.800076 -5.251302)
      (xy -4.052776 -4.934043)
      (xy -4.363962 -4.638934)
      (xy -4.682695 -4.398623)
      (xy -4.795375 -4.317826)
      (xy -4.852581 -4.263122)
      (xy -5.312861 -4.263122)
      (xy -5.309904 -4.286177)
      (xy -5.285518 -4.437543)
      (xy -5.154178 -5.014213)
      (xy -4.963063 -5.567319)
      (xy -4.715739 -6.092653)
      (xy -4.415768 -6.586011)
      (xy -4.066714 -7.043187)
      (xy -3.672143 -7.459973)
      (xy -3.235617 -7.832165)
      (xy -2.760702 -8.155556)
      (xy -2.250959 -8.425941)
      (xy -1.731168 -8.632067)
      (xy -1.466943 -8.717221)
      (xy -1.237152 -8.782290)
      (xy -1.025008 -8.829835)
      (xy -0.813725 -8.862412)
      (xy -0.586518 -8.882581)
      (xy -0.326600 -8.892900)
      (xy -0.017187 -8.895928)
      (xy 0.000000 -8.895934)
    )

    (stroke (width 0.000000) (type solid)) (fill solid) (layer "F.SilkS") (tstamp a3bbc2a6-2f62-458a-bcab-871ed4a31b19))
  (fp_poly
    (pts
      (xy 2.403144 -7.387382)
      (xy 2.521639 -7.334489)
      (xy 2.599629 -7.238073)
      (xy 2.624106 -7.128458)
      (xy 2.632692 -7.059871)
      (xy 2.672604 -7.034324)
      (xy 2.726563 -7.031258)
      (xy 2.840485 -7.001037)
      (xy 2.934019 -6.923097)
      (xy 2.987945 -6.816522)
      (xy 2.994173 -6.765524)
      (xy 2.964250 -6.641597)
      (xy 2.885097 -6.544922)
      (xy 2.772632 -6.491726)
      (xy 2.720193 -6.486252)
      (xy 2.599918 -6.486252)
      (xy 2.579489 -6.221331)
      (xy 2.537486 -5.948038)
      (xy 2.457046 -5.657985)
      (xy 2.347589 -5.381709)
      (xy 2.279289 -5.248212)
      (xy 2.212127 -5.148256)
      (xy 2.110680 -5.020175)
      (xy 1.989748 -4.881861)
      (xy 1.886466 -4.773395)
      (xy 1.739061 -4.630738)
      (xy 1.614493 -4.525347)
      (xy 1.492915 -4.442481)
      (xy 1.354477 -4.367396)
      (xy 1.312053 -4.346746)
      (xy 1.118376 -4.258462)
      (xy 0.947670 -4.193050)
      (xy 0.782691 -4.146831)
      (xy 0.606194 -4.116130)
      (xy 0.400934 -4.097267)
      (xy 0.149667 -4.086566)
      (xy 0.084106 -4.084886)
      (xy -0.178813 -4.081785)
      (xy -0.386270 -4.086661)
      (xy -0.549674 -4.100053)
      (xy -0.672847 -4.120791)
      (xy -1.049875 -4.229616)
      (xy -1.382173 -4.381514)
      (xy -1.681620 -4.583187)
      (xy -1.960093 -4.841337)
      (xy -1.971554 -4.853564)
      (xy -2.176243 -5.110332)
      (xy -2.347078 -5.399585)
      (xy -2.477459 -5.705792)
      (xy -2.560786 -6.013423)
      (xy -2.590460 -6.306948)
      (xy -2.590463 -6.309964)
      (xy -2.590463 -6.486252)
      (xy -2.715465 -6.486252)
      (xy -2.839525 -6.514254)
      (xy -2.930878 -6.587446)
      (xy -2.982642 -6.689602)
      (xy -2.987936 -6.804496)
      (xy -2.939878 -6.915904)
      (xy -2.911595 -6.948681)
      (xy -2.805243 -7.016751)
      (xy -2.726562 -7.031258)
      (xy -2.654265 -7.039404)
      (xy -2.627337 -7.077268)
      (xy -2.624106 -7.128458)
      (xy -2.593416 -7.250379)
      (xy -2.510291 -7.342758)
      (xy -2.403143 -7.387382)
      (xy -2.316711 -7.389383)
      (xy -2.235495 -7.350513)
      (xy -2.192878 -7.317208)
      (xy -2.107271 -7.211552)
      (xy -2.087330 -7.096769)
      (xy -2.133839 -6.977821)
      (xy -2.138199 -6.971459)
      (xy -2.166453 -6.915371)
      (xy -2.153491 -6.896689)
      (xy -2.106456 -6.874755)
      (xy -2.041095 -6.821235)
      (xy -2.033835 -6.814112)
      (xy -1.967527 -6.708538)
      (xy -1.955102 -6.593755)
      (xy -1.990055 -6.486421)
      (xy -2.065883 -6.403192)
      (xy -2.176079 -6.360728)
      (xy -2.211779 -6.358410)
      (xy -2.311390 -6.373580)
      (xy -2.390109 -6.410463)
      (xy -2.394370 -6.414088)
      (xy -2.437548 -6.447673)
      (xy -2.453614 -6.431458)
      (xy -2.455894 -6.370693)
      (xy -2.438662 -6.220317)
      (xy -2.391457 -6.035504)
      (xy -2.321013 -5.838203)
      (xy -2.236135 -5.654298)
      (xy -2.038480 -5.347807)
      (xy -1.792727 -5.087313)
      (xy -1.500786 -4.873794)
      (xy -1.164564 -4.708228)
      (xy -0.785970 -4.591594)
      (xy -0.366913 -4.524869)
      (xy 0.000000 -4.508079)
      (xy 0.450363 -4.533756)
      (xy 0.861805 -4.610132)
      (xy 1.232417 -4.736231)
      (xy 1.560291 -4.911073)
      (xy 1.843518 -5.133681)
      (xy 2.080190 -5.403075)
      (xy 2.236135 -5.654298)
      (xy 2.322791 -5.842586)
      (xy 2.392791 -6.039847)
      (xy 2.439400 -6.224132)
      (xy 2.455894 -6.370693)
      (xy 2.452485 -6.437138)
      (xy 2.433387 -6.445726)
      (xy 2.394371 -6.414088)
      (xy 2.319284 -6.375988)
      (xy 2.219792 -6.358528)
      (xy 2.211780 -6.358410)
      (xy 2.093220 -6.386650)
      (xy 2.007229 -6.460263)
      (xy 1.960312 -6.562593)
      (xy 1.958973 -6.676981)
      (xy 2.009717 -6.786771)
      (xy 2.033835 -6.814112)
      (xy 2.099586 -6.870013)
      (xy 2.149986 -6.896382)
      (xy 2.153491 -6.896689)
      (xy 2.165725 -6.918934)
      (xy 2.138199 -6.971459)
      (xy 2.088126 -7.090490)
      (xy 2.104545 -7.205619)
      (xy 2.186671 -7.311888)
      (xy 2.192879 -7.317208)
      (xy 2.281488 -7.377628)
      (xy 2.361874 -7.392691)
    )

    (stroke (width 0.000000) (type solid)) (fill solid) (layer "F.SilkS") (tstamp 9c03e30a-d268-4a82-8a54-1a9de5c444de))
  (fp_poly
    (pts
      (xy -0.247122 -8.263685)
      (xy -0.143749 -8.250461)
      (xy -0.050864 -8.218842)
      (xy 0.054030 -8.159204)
      (xy 0.148176 -8.094541)
      (xy 0.250981 -8.019397)
      (xy 0.328503 -7.959336)
      (xy 0.367718 -7.924567)
      (xy 0.370067 -7.920630)
      (xy 0.343478 -7.923140)
      (xy 0.279680 -7.944328)
      (xy 0.202624 -7.974826)
      (xy 0.136263 -8.005266)
      (xy 0.106561 -8.023682)
      (xy 0.073260 -8.015490)
      (xy 0.012353 -7.975703)
      (xy 0.007779 -7.972143)
      (xy -0.062802 -7.921398)
      (xy -0.111914 -7.911777)
      (xy -0.169883 -7.941455)
      (xy -0.196544 -7.959855)
      (xy -0.254090 -8.024424)
      (xy -0.263032 -8.116812)
      (xy -0.262904 -8.118100)
      (xy -0.265263 -8.196145)
      (xy -0.303428 -8.236039)
      (xy -0.336423 -8.248471)
      (xy -0.365009 -8.262434)
      (xy -0.328991 -8.267010)
    )

    (stroke (width 0.000000) (type solid)) (fill solid) (layer "F.SilkS") (tstamp 8e31588a-bff5-4802-a02a-03e8b8f3c08c))
)
