M48
; DRILL file {KiCad 7.0.2} date Wed May 15 19:05:43 2024
; FORMAT={-:-/ absolute / metric / decimal}
; #@! TF.CreationDate,2024-05-15T19:05:43+02:00
; #@! TF.GenerationSoftware,Kicad,Pcbnew,7.0.2
; #@! TF.FileFunction,NonPlated,1,2,NPTH
FMAT,2
METRIC
; #@! TA.AperFunction,NonPlated,NPTH,ComponentDrill
T1C3.000
; #@! TA.AperFunction,NonPlated,NPTH,ComponentDrill
T2C3.200
; #@! TA.AperFunction,NonPlated,NPTH,ComponentDrill
T3C6.000
%
G90
G05
T1
X49.45Y-64.25
X49.45Y-86.65
X71.85Y-64.25
X71.85Y-86.65
T2
X99.65Y-28.95
X99.65Y-121.95
X130.15Y-28.95
X130.15Y-121.95
T3
X60.65Y-75.45
T0
M30
