(kicad_sch (version 20230121) (generator eeschema)

  (uuid e9e6d1fc-b0bc-4a5a-9b32-c1ae0c38a5ff)

  (paper "A4")

  (lib_symbols
    (symbol "Device:C_Polarized_Small" (pin_numbers hide) (pin_names (offset 0.254) hide) (in_bom yes) (on_board yes)
      (property "Reference" "C" (at 0.254 1.778 0)
        (effects (font (size 1.27 1.27)) (justify left))
      )
      (property "Value" "C_Polarized_Small" (at 0.254 -2.032 0)
        (effects (font (size 1.27 1.27)) (justify left))
      )
      (property "Footprint" "" (at 0 0 0)
        (effects (font (size 1.27 1.27)) hide)
      )
      (property "Datasheet" "~" (at 0 0 0)
        (effects (font (size 1.27 1.27)) hide)
      )
      (property "ki_keywords" "cap capacitor" (at 0 0 0)
        (effects (font (size 1.27 1.27)) hide)
      )
      (property "ki_description" "Polarized capacitor, small symbol" (at 0 0 0)
        (effects (font (size 1.27 1.27)) hide)
      )
      (property "ki_fp_filters" "CP_*" (at 0 0 0)
        (effects (font (size 1.27 1.27)) hide)
      )
      (symbol "C_Polarized_Small_0_1"
        (rectangle (start -1.524 -0.3048) (end 1.524 -0.6858)
          (stroke (width 0) (type default))
          (fill (type outline))
        )
        (rectangle (start -1.524 0.6858) (end 1.524 0.3048)
          (stroke (width 0) (type default))
          (fill (type none))
        )
        (polyline
          (pts
            (xy -1.27 1.524)
            (xy -0.762 1.524)
          )
          (stroke (width 0) (type default))
          (fill (type none))
        )
        (polyline
          (pts
            (xy -1.016 1.27)
            (xy -1.016 1.778)
          )
          (stroke (width 0) (type default))
          (fill (type none))
        )
      )
      (symbol "C_Polarized_Small_1_1"
        (pin passive line (at 0 2.54 270) (length 1.8542)
          (name "~" (effects (font (size 1.27 1.27))))
          (number "1" (effects (font (size 1.27 1.27))))
        )
        (pin passive line (at 0 -2.54 90) (length 1.8542)
          (name "~" (effects (font (size 1.27 1.27))))
          (number "2" (effects (font (size 1.27 1.27))))
        )
      )
    )
    (symbol "Device:C_Small" (pin_numbers hide) (pin_names (offset 0.254) hide) (in_bom yes) (on_board yes)
      (property "Reference" "C" (at 0.254 1.778 0)
        (effects (font (size 1.27 1.27)) (justify left))
      )
      (property "Value" "C_Small" (at 0.254 -2.032 0)
        (effects (font (size 1.27 1.27)) (justify left))
      )
      (property "Footprint" "" (at 0 0 0)
        (effects (font (size 1.27 1.27)) hide)
      )
      (property "Datasheet" "~" (at 0 0 0)
        (effects (font (size 1.27 1.27)) hide)
      )
      (property "ki_keywords" "capacitor cap" (at 0 0 0)
        (effects (font (size 1.27 1.27)) hide)
      )
      (property "ki_description" "Unpolarized capacitor, small symbol" (at 0 0 0)
        (effects (font (size 1.27 1.27)) hide)
      )
      (property "ki_fp_filters" "C_*" (at 0 0 0)
        (effects (font (size 1.27 1.27)) hide)
      )
      (symbol "C_Small_0_1"
        (polyline
          (pts
            (xy -1.524 -0.508)
            (xy 1.524 -0.508)
          )
          (stroke (width 0.3302) (type default))
          (fill (type none))
        )
        (polyline
          (pts
            (xy -1.524 0.508)
            (xy 1.524 0.508)
          )
          (stroke (width 0.3048) (type default))
          (fill (type none))
        )
      )
      (symbol "C_Small_1_1"
        (pin passive line (at 0 2.54 270) (length 2.032)
          (name "~" (effects (font (size 1.27 1.27))))
          (number "1" (effects (font (size 1.27 1.27))))
        )
        (pin passive line (at 0 -2.54 90) (length 2.032)
          (name "~" (effects (font (size 1.27 1.27))))
          (number "2" (effects (font (size 1.27 1.27))))
        )
      )
    )
    (symbol "Device:D_Schottky_Small" (pin_numbers hide) (pin_names (offset 0.254) hide) (in_bom yes) (on_board yes)
      (property "Reference" "D" (at -1.27 2.032 0)
        (effects (font (size 1.27 1.27)) (justify left))
      )
      (property "Value" "D_Schottky_Small" (at -7.112 -2.032 0)
        (effects (font (size 1.27 1.27)) (justify left))
      )
      (property "Footprint" "" (at 0 0 90)
        (effects (font (size 1.27 1.27)) hide)
      )
      (property "Datasheet" "~" (at 0 0 90)
        (effects (font (size 1.27 1.27)) hide)
      )
      (property "ki_keywords" "diode Schottky" (at 0 0 0)
        (effects (font (size 1.27 1.27)) hide)
      )
      (property "ki_description" "Schottky diode, small symbol" (at 0 0 0)
        (effects (font (size 1.27 1.27)) hide)
      )
      (property "ki_fp_filters" "TO-???* *_Diode_* *SingleDiode* D_*" (at 0 0 0)
        (effects (font (size 1.27 1.27)) hide)
      )
      (symbol "D_Schottky_Small_0_1"
        (polyline
          (pts
            (xy -0.762 0)
            (xy 0.762 0)
          )
          (stroke (width 0) (type default))
          (fill (type none))
        )
        (polyline
          (pts
            (xy 0.762 -1.016)
            (xy -0.762 0)
            (xy 0.762 1.016)
            (xy 0.762 -1.016)
          )
          (stroke (width 0.254) (type default))
          (fill (type none))
        )
        (polyline
          (pts
            (xy -1.27 0.762)
            (xy -1.27 1.016)
            (xy -0.762 1.016)
            (xy -0.762 -1.016)
            (xy -0.254 -1.016)
            (xy -0.254 -0.762)
          )
          (stroke (width 0.254) (type default))
          (fill (type none))
        )
      )
      (symbol "D_Schottky_Small_1_1"
        (pin passive line (at -2.54 0 0) (length 1.778)
          (name "K" (effects (font (size 1.27 1.27))))
          (number "1" (effects (font (size 1.27 1.27))))
        )
        (pin passive line (at 2.54 0 180) (length 1.778)
          (name "A" (effects (font (size 1.27 1.27))))
          (number "2" (effects (font (size 1.27 1.27))))
        )
      )
    )
    (symbol "Device:L" (pin_numbers hide) (pin_names (offset 1.016) hide) (in_bom yes) (on_board yes)
      (property "Reference" "L" (at -1.27 0 90)
        (effects (font (size 1.27 1.27)))
      )
      (property "Value" "L" (at 1.905 0 90)
        (effects (font (size 1.27 1.27)))
      )
      (property "Footprint" "" (at 0 0 0)
        (effects (font (size 1.27 1.27)) hide)
      )
      (property "Datasheet" "~" (at 0 0 0)
        (effects (font (size 1.27 1.27)) hide)
      )
      (property "ki_keywords" "inductor choke coil reactor magnetic" (at 0 0 0)
        (effects (font (size 1.27 1.27)) hide)
      )
      (property "ki_description" "Inductor" (at 0 0 0)
        (effects (font (size 1.27 1.27)) hide)
      )
      (property "ki_fp_filters" "Choke_* *Coil* Inductor_* L_*" (at 0 0 0)
        (effects (font (size 1.27 1.27)) hide)
      )
      (symbol "L_0_1"
        (arc (start 0 -2.54) (mid 0.6323 -1.905) (end 0 -1.27)
          (stroke (width 0) (type default))
          (fill (type none))
        )
        (arc (start 0 -1.27) (mid 0.6323 -0.635) (end 0 0)
          (stroke (width 0) (type default))
          (fill (type none))
        )
        (arc (start 0 0) (mid 0.6323 0.635) (end 0 1.27)
          (stroke (width 0) (type default))
          (fill (type none))
        )
        (arc (start 0 1.27) (mid 0.6323 1.905) (end 0 2.54)
          (stroke (width 0) (type default))
          (fill (type none))
        )
      )
      (symbol "L_1_1"
        (pin passive line (at 0 3.81 270) (length 1.27)
          (name "1" (effects (font (size 1.27 1.27))))
          (number "1" (effects (font (size 1.27 1.27))))
        )
        (pin passive line (at 0 -3.81 90) (length 1.27)
          (name "2" (effects (font (size 1.27 1.27))))
          (number "2" (effects (font (size 1.27 1.27))))
        )
      )
    )
    (symbol "Device:L_Small" (pin_numbers hide) (pin_names (offset 0.254) hide) (in_bom yes) (on_board yes)
      (property "Reference" "L" (at 0.762 1.016 0)
        (effects (font (size 1.27 1.27)) (justify left))
      )
      (property "Value" "L_Small" (at 0.762 -1.016 0)
        (effects (font (size 1.27 1.27)) (justify left))
      )
      (property "Footprint" "" (at 0 0 0)
        (effects (font (size 1.27 1.27)) hide)
      )
      (property "Datasheet" "~" (at 0 0 0)
        (effects (font (size 1.27 1.27)) hide)
      )
      (property "ki_keywords" "inductor choke coil reactor magnetic" (at 0 0 0)
        (effects (font (size 1.27 1.27)) hide)
      )
      (property "ki_description" "Inductor, small symbol" (at 0 0 0)
        (effects (font (size 1.27 1.27)) hide)
      )
      (property "ki_fp_filters" "Choke_* *Coil* Inductor_* L_*" (at 0 0 0)
        (effects (font (size 1.27 1.27)) hide)
      )
      (symbol "L_Small_0_1"
        (arc (start 0 -2.032) (mid 0.5058 -1.524) (end 0 -1.016)
          (stroke (width 0) (type default))
          (fill (type none))
        )
        (arc (start 0 -1.016) (mid 0.5058 -0.508) (end 0 0)
          (stroke (width 0) (type default))
          (fill (type none))
        )
        (arc (start 0 0) (mid 0.5058 0.508) (end 0 1.016)
          (stroke (width 0) (type default))
          (fill (type none))
        )
        (arc (start 0 1.016) (mid 0.5058 1.524) (end 0 2.032)
          (stroke (width 0) (type default))
          (fill (type none))
        )
      )
      (symbol "L_Small_1_1"
        (pin passive line (at 0 2.54 270) (length 0.508)
          (name "~" (effects (font (size 1.27 1.27))))
          (number "1" (effects (font (size 1.27 1.27))))
        )
        (pin passive line (at 0 -2.54 90) (length 0.508)
          (name "~" (effects (font (size 1.27 1.27))))
          (number "2" (effects (font (size 1.27 1.27))))
        )
      )
    )
    (symbol "Device:R_Small" (pin_numbers hide) (pin_names (offset 0.254) hide) (in_bom yes) (on_board yes)
      (property "Reference" "R" (at 0.762 0.508 0)
        (effects (font (size 1.27 1.27)) (justify left))
      )
      (property "Value" "R_Small" (at 0.762 -1.016 0)
        (effects (font (size 1.27 1.27)) (justify left))
      )
      (property "Footprint" "" (at 0 0 0)
        (effects (font (size 1.27 1.27)) hide)
      )
      (property "Datasheet" "~" (at 0 0 0)
        (effects (font (size 1.27 1.27)) hide)
      )
      (property "ki_keywords" "R resistor" (at 0 0 0)
        (effects (font (size 1.27 1.27)) hide)
      )
      (property "ki_description" "Resistor, small symbol" (at 0 0 0)
        (effects (font (size 1.27 1.27)) hide)
      )
      (property "ki_fp_filters" "R_*" (at 0 0 0)
        (effects (font (size 1.27 1.27)) hide)
      )
      (symbol "R_Small_0_1"
        (rectangle (start -0.762 1.778) (end 0.762 -1.778)
          (stroke (width 0.2032) (type default))
          (fill (type none))
        )
      )
      (symbol "R_Small_1_1"
        (pin passive line (at 0 2.54 270) (length 0.762)
          (name "~" (effects (font (size 1.27 1.27))))
          (number "1" (effects (font (size 1.27 1.27))))
        )
        (pin passive line (at 0 -2.54 90) (length 0.762)
          (name "~" (effects (font (size 1.27 1.27))))
          (number "2" (effects (font (size 1.27 1.27))))
        )
      )
    )
    (symbol "Jumper:SolderJumper_2_Open" (pin_names (offset 0) hide) (in_bom yes) (on_board yes)
      (property "Reference" "JP" (at 0 2.032 0)
        (effects (font (size 1.27 1.27)))
      )
      (property "Value" "SolderJumper_2_Open" (at 0 -2.54 0)
        (effects (font (size 1.27 1.27)))
      )
      (property "Footprint" "" (at 0 0 0)
        (effects (font (size 1.27 1.27)) hide)
      )
      (property "Datasheet" "~" (at 0 0 0)
        (effects (font (size 1.27 1.27)) hide)
      )
      (property "ki_keywords" "solder jumper SPST" (at 0 0 0)
        (effects (font (size 1.27 1.27)) hide)
      )
      (property "ki_description" "Solder Jumper, 2-pole, open" (at 0 0 0)
        (effects (font (size 1.27 1.27)) hide)
      )
      (property "ki_fp_filters" "SolderJumper*Open*" (at 0 0 0)
        (effects (font (size 1.27 1.27)) hide)
      )
      (symbol "SolderJumper_2_Open_0_1"
        (arc (start -0.254 1.016) (mid -1.2656 0) (end -0.254 -1.016)
          (stroke (width 0) (type default))
          (fill (type none))
        )
        (arc (start -0.254 1.016) (mid -1.2656 0) (end -0.254 -1.016)
          (stroke (width 0) (type default))
          (fill (type outline))
        )
        (polyline
          (pts
            (xy -0.254 1.016)
            (xy -0.254 -1.016)
          )
          (stroke (width 0) (type default))
          (fill (type none))
        )
        (polyline
          (pts
            (xy 0.254 1.016)
            (xy 0.254 -1.016)
          )
          (stroke (width 0) (type default))
          (fill (type none))
        )
        (arc (start 0.254 -1.016) (mid 1.2656 0) (end 0.254 1.016)
          (stroke (width 0) (type default))
          (fill (type none))
        )
        (arc (start 0.254 -1.016) (mid 1.2656 0) (end 0.254 1.016)
          (stroke (width 0) (type default))
          (fill (type outline))
        )
      )
      (symbol "SolderJumper_2_Open_1_1"
        (pin passive line (at -3.81 0 0) (length 2.54)
          (name "A" (effects (font (size 1.27 1.27))))
          (number "1" (effects (font (size 1.27 1.27))))
        )
        (pin passive line (at 3.81 0 180) (length 2.54)
          (name "B" (effects (font (size 1.27 1.27))))
          (number "2" (effects (font (size 1.27 1.27))))
        )
      )
    )
    (symbol "LT8330ES6TR:LT8330ES6TR" (pin_names (offset 1.016)) (in_bom yes) (on_board yes)
      (property "Reference" "U" (at 28.2956 9.1186 0)
        (effects (font (size 1.27 1.27)) (justify left bottom))
      )
      (property "Value" "LT8330ES6TR" (at 27.6606 6.5786 0)
        (effects (font (size 1.27 1.27)) (justify left bottom))
      )
      (property "Footprint" "LT8330ES6TR:TSOT-23_S6" (at 34.29 0 0)
        (effects (font (size 1.27 1.27)) (justify bottom) hide)
      )
      (property "Datasheet" "" (at 34.29 0 0)
        (effects (font (size 1.27 1.27)) hide)
      )
      (property "MF" "Analog Devices" (at 34.29 0 0)
        (effects (font (size 1.27 1.27)) (justify bottom) hide)
      )
      (property "VENDOR" "Linear Technology" (at 34.29 0 0)
        (effects (font (size 1.27 1.27)) (justify bottom) hide)
      )
      (property "Description" "\nBoost, SEPIC Switching Regulator IC Positive or Negative, Isolation Capable Adjustable 1.6V, -0.8V 1 Output 1A SOT-23-6 Thin, TSOT-23-6\n" (at 0 0 0)
        (effects (font (size 1.27 1.27)) (justify bottom) hide)
      )
      (property "Package" "SOT-23-6 Linear Technology" (at 34.29 0 0)
        (effects (font (size 1.27 1.27)) (justify bottom) hide)
      )
      (property "Price" "None" (at 34.29 0 0)
        (effects (font (size 1.27 1.27)) (justify bottom) hide)
      )
      (property "Check_prices" "https://www.snapeda.com/parts/LT8330ES6%23TR/Analog+Devices/view-part/?ref=eda" (at 0 0 0)
        (effects (font (size 1.27 1.27)) (justify bottom) hide)
      )
      (property "SnapEDA_Link" "https://www.snapeda.com/parts/LT8330ES6%23TR/Analog+Devices/view-part/?ref=snap" (at 0 0 0)
        (effects (font (size 1.27 1.27)) (justify bottom) hide)
      )
      (property "MP" "LT8330ES6#TR" (at 34.29 0 0)
        (effects (font (size 1.27 1.27)) (justify bottom) hide)
      )
      (property "Purchase-URL" "https://www.snapeda.com/api/url_track_click_mouser/?unipart_id=608232&manufacturer=Analog Devices&part_name=LT8330ES6#TR&search_term=lt8330" (at 0 0 0)
        (effects (font (size 1.27 1.27)) (justify bottom) hide)
      )
      (property "Availability" "In Stock" (at 34.29 0 0)
        (effects (font (size 1.27 1.27)) (justify bottom) hide)
      )
      (property "MANUFACTURER_PART_NUMBER" "lt8330es6#tr" (at 34.29 0 0)
        (effects (font (size 1.27 1.27)) (justify bottom) hide)
      )
      (symbol "LT8330ES6TR_0_0"
        (rectangle (start 41.91 2.54) (end 58.42 -7.62)
          (stroke (width 0.1524) (type default))
          (fill (type background))
        )
      )
      (symbol "LT8330ES6TR_1_0"
        (pin output line (at 39.37 0 0) (length 2.54)
          (name "SW" (effects (font (size 1.016 1.016))))
          (number "1" (effects (font (size 1.016 1.016))))
        )
        (pin power_in line (at 39.37 -2.54 0) (length 2.54)
          (name "GND" (effects (font (size 1.016 1.016))))
          (number "2" (effects (font (size 1.016 1.016))))
        )
        (pin output line (at 39.37 -5.08 0) (length 2.54)
          (name "FBX" (effects (font (size 1.016 1.016))))
          (number "3" (effects (font (size 1.016 1.016))))
        )
        (pin passive line (at 60.96 -5.08 180) (length 2.54)
          (name "EN/UVLO" (effects (font (size 1.016 1.016))))
          (number "4" (effects (font (size 1.016 1.016))))
        )
        (pin passive line (at 60.96 -2.54 180) (length 2.54)
          (name "INTVCC" (effects (font (size 1.016 1.016))))
          (number "5" (effects (font (size 1.016 1.016))))
        )
        (pin input line (at 60.96 0 180) (length 2.54)
          (name "VIN" (effects (font (size 1.016 1.016))))
          (number "6" (effects (font (size 1.016 1.016))))
        )
      )
    )
    (symbol "Simulation_SPICE:NPN" (pin_numbers hide) (pin_names (offset 0)) (in_bom yes) (on_board yes)
      (property "Reference" "Q" (at -2.54 7.62 0)
        (effects (font (size 1.27 1.27)))
      )
      (property "Value" "NPN" (at -2.54 5.08 0)
        (effects (font (size 1.27 1.27)))
      )
      (property "Footprint" "" (at 63.5 0 0)
        (effects (font (size 1.27 1.27)) hide)
      )
      (property "Datasheet" "~" (at 63.5 0 0)
        (effects (font (size 1.27 1.27)) hide)
      )
      (property "Sim.Device" "NPN" (at 0 0 0)
        (effects (font (size 1.27 1.27)) hide)
      )
      (property "Sim.Type" "GUMMELPOON" (at 0 0 0)
        (effects (font (size 1.27 1.27)) hide)
      )
      (property "Sim.Pins" "1=C 2=B 3=E" (at 0 0 0)
        (effects (font (size 1.27 1.27)) hide)
      )
      (property "ki_keywords" "simulation" (at 0 0 0)
        (effects (font (size 1.27 1.27)) hide)
      )
      (property "ki_description" "Bipolar transistor symbol for simulation only, substrate tied to the emitter" (at 0 0 0)
        (effects (font (size 1.27 1.27)) hide)
      )
      (symbol "NPN_0_1"
        (polyline
          (pts
            (xy -2.54 0)
            (xy 0.635 0)
          )
          (stroke (width 0.1524) (type default))
          (fill (type none))
        )
        (polyline
          (pts
            (xy 0.635 0.635)
            (xy 2.54 2.54)
          )
          (stroke (width 0) (type default))
          (fill (type none))
        )
        (polyline
          (pts
            (xy 2.794 -1.27)
            (xy 2.794 -1.27)
          )
          (stroke (width 0.1524) (type default))
          (fill (type none))
        )
        (polyline
          (pts
            (xy 2.794 -1.27)
            (xy 2.794 -1.27)
          )
          (stroke (width 0.1524) (type default))
          (fill (type none))
        )
        (polyline
          (pts
            (xy 0.635 -0.635)
            (xy 2.54 -2.54)
            (xy 2.54 -2.54)
          )
          (stroke (width 0) (type default))
          (fill (type none))
        )
        (polyline
          (pts
            (xy 0.635 1.905)
            (xy 0.635 -1.905)
            (xy 0.635 -1.905)
          )
          (stroke (width 0.508) (type default))
          (fill (type none))
        )
        (polyline
          (pts
            (xy 1.27 -1.778)
            (xy 1.778 -1.27)
            (xy 2.286 -2.286)
            (xy 1.27 -1.778)
            (xy 1.27 -1.778)
          )
          (stroke (width 0) (type default))
          (fill (type outline))
        )
        (circle (center 1.27 0) (radius 2.8194)
          (stroke (width 0.254) (type default))
          (fill (type none))
        )
      )
      (symbol "NPN_1_1"
        (pin open_collector line (at 2.54 5.08 270) (length 2.54)
          (name "C" (effects (font (size 1.27 1.27))))
          (number "1" (effects (font (size 1.27 1.27))))
        )
        (pin input line (at -5.08 0 0) (length 2.54)
          (name "B" (effects (font (size 1.27 1.27))))
          (number "2" (effects (font (size 1.27 1.27))))
        )
        (pin open_emitter line (at 2.54 -5.08 90) (length 2.54)
          (name "E" (effects (font (size 1.27 1.27))))
          (number "3" (effects (font (size 1.27 1.27))))
        )
      )
    )
    (symbol "power:GND" (power) (pin_names (offset 0)) (in_bom yes) (on_board yes)
      (property "Reference" "#PWR" (at 0 -6.35 0)
        (effects (font (size 1.27 1.27)) hide)
      )
      (property "Value" "GND" (at 0 -3.81 0)
        (effects (font (size 1.27 1.27)))
      )
      (property "Footprint" "" (at 0 0 0)
        (effects (font (size 1.27 1.27)) hide)
      )
      (property "Datasheet" "" (at 0 0 0)
        (effects (font (size 1.27 1.27)) hide)
      )
      (property "ki_keywords" "global power" (at 0 0 0)
        (effects (font (size 1.27 1.27)) hide)
      )
      (property "ki_description" "Power symbol creates a global label with name \"GND\" , ground" (at 0 0 0)
        (effects (font (size 1.27 1.27)) hide)
      )
      (symbol "GND_0_1"
        (polyline
          (pts
            (xy 0 0)
            (xy 0 -1.27)
            (xy 1.27 -1.27)
            (xy 0 -2.54)
            (xy -1.27 -1.27)
            (xy 0 -1.27)
          )
          (stroke (width 0) (type default))
          (fill (type none))
        )
      )
      (symbol "GND_1_1"
        (pin power_in line (at 0 0 270) (length 0) hide
          (name "GND" (effects (font (size 1.27 1.27))))
          (number "1" (effects (font (size 1.27 1.27))))
        )
      )
    )
  )

  (junction (at 154.305 89.535) (diameter 0) (color 0 0 0 0)
    (uuid 0764acf5-dbdb-4954-800b-dd9cad3dd241)
  )
  (junction (at 131.445 89.535) (diameter 0) (color 0 0 0 0)
    (uuid 1001bd7e-02c7-4579-8d03-b6c7871be164)
  )
  (junction (at 169.545 89.535) (diameter 0) (color 0 0 0 0)
    (uuid 1e60bee8-fd4e-4333-ba2e-8b545ed06e71)
  )
  (junction (at 154.94 115.57) (diameter 0) (color 0 0 0 0)
    (uuid 3fbf6bf9-727c-43c5-83d7-9460464053e1)
  )
  (junction (at 133.985 89.535) (diameter 0) (color 0 0 0 0)
    (uuid 572b25bc-23db-4424-b1af-08e48405cdd7)
  )
  (junction (at 111.76 89.535) (diameter 0) (color 0 0 0 0)
    (uuid 8275d9a4-d543-4076-ab7e-c4adb026c4b9)
  )
  (junction (at 165.1 120.65) (diameter 0) (color 0 0 0 0)
    (uuid 89c5ebee-07ac-4f56-8c7e-9db2701b9294)
  )
  (junction (at 200.025 89.535) (diameter 0) (color 0 0 0 0)
    (uuid 8e40083a-4b29-4e30-a4d9-d79d3ce81232)
  )
  (junction (at 140.97 89.535) (diameter 0) (color 0 0 0 0)
    (uuid 8f6c7066-523e-43b2-9473-b92e7259bd19)
  )
  (junction (at 154.305 95.885) (diameter 0) (color 0 0 0 0)
    (uuid 92498d88-aebe-47b6-8da4-595458eb3bb1)
  )
  (junction (at 102.235 89.535) (diameter 0) (color 0 0 0 0)
    (uuid 9362e273-574a-4ec2-b669-02fd2113ee11)
  )
  (junction (at 109.22 89.535) (diameter 0) (color 0 0 0 0)
    (uuid a49dc263-746d-4ac6-9389-c18dd46823c6)
  )
  (junction (at 95.885 97.79) (diameter 0) (color 0 0 0 0)
    (uuid a4f52633-6707-4557-921e-361f35f68d2f)
  )
  (junction (at 86.36 89.535) (diameter 0) (color 0 0 0 0)
    (uuid a5e59745-fdb2-4d96-9e42-a9125a075ef7)
  )
  (junction (at 116.205 89.535) (diameter 0) (color 0 0 0 0)
    (uuid a9691874-ca4f-4876-91ee-bd138fafd476)
  )
  (junction (at 154.94 118.11) (diameter 0) (color 0 0 0 0)
    (uuid b8161e1c-3b33-476a-aafa-9fc3a7c2d787)
  )
  (junction (at 165.1 115.57) (diameter 0) (color 0 0 0 0)
    (uuid bf65652e-df70-40ec-82d4-97c8d20be2b8)
  )
  (junction (at 158.115 115.57) (diameter 0) (color 0 0 0 0)
    (uuid c677ca80-e501-4cd0-9a76-38d1541ca1a2)
  )
  (junction (at 172.085 115.57) (diameter 0) (color 0 0 0 0)
    (uuid ca0ff17d-f1d2-4852-ad96-bba956f51bee)
  )
  (junction (at 194.31 89.535) (diameter 0) (color 0 0 0 0)
    (uuid d0d97865-a356-433f-88a4-fc62afee4179)
  )
  (junction (at 102.235 97.79) (diameter 0) (color 0 0 0 0)
    (uuid da080418-76fb-4e05-8b38-b777cf00efd7)
  )
  (junction (at 169.545 82.55) (diameter 0) (color 0 0 0 0)
    (uuid ee88147f-e63c-4755-b5a1-9ffde65a8506)
  )
  (junction (at 194.31 94.615) (diameter 0) (color 0 0 0 0)
    (uuid eecff51a-46be-4f89-8f15-f00f3ec2bf6c)
  )
  (junction (at 200.025 82.55) (diameter 0) (color 0 0 0 0)
    (uuid fd3695aa-29d8-4105-add3-8c62c75253b9)
  )
  (junction (at 127 89.535) (diameter 0) (color 0 0 0 0)
    (uuid fec4a621-654b-43b9-b6a7-a4aa36ba1250)
  )

  (wire (pts (xy 127 89.535) (xy 127 92.075))
    (stroke (width 0) (type default))
    (uuid 000e6bb3-e121-4656-90c1-ad45273c0a0a)
  )
  (wire (pts (xy 170.815 115.57) (xy 172.085 115.57))
    (stroke (width 0) (type default))
    (uuid 0294293c-b14f-4fd3-9515-9d4abdfca378)
  )
  (wire (pts (xy 154.94 118.11) (xy 154.94 120.65))
    (stroke (width 0) (type default))
    (uuid 039d756a-50d3-40a0-be57-3ca41920bffe)
  )
  (wire (pts (xy 109.22 89.535) (xy 111.76 89.535))
    (stroke (width 0) (type default))
    (uuid 0c05a548-af18-413e-995b-712d0fc39f0e)
  )
  (wire (pts (xy 146.685 95.885) (xy 154.305 95.885))
    (stroke (width 0) (type default))
    (uuid 0f230dbb-dab9-4cf6-b229-fc12124b8d77)
  )
  (wire (pts (xy 127 89.535) (xy 131.445 89.535))
    (stroke (width 0) (type default))
    (uuid 1026a230-7dd2-40e4-8ed6-89375dfde431)
  )
  (wire (pts (xy 194.31 94.615) (xy 194.31 96.52))
    (stroke (width 0) (type default))
    (uuid 14dedda5-cdaa-4027-8334-9819d02ac96e)
  )
  (wire (pts (xy 165.1 120.65) (xy 165.735 120.65))
    (stroke (width 0) (type default))
    (uuid 16bbc3e5-d1c6-4799-8c8f-5ff9da67ae25)
  )
  (wire (pts (xy 194.31 89.535) (xy 200.025 89.535))
    (stroke (width 0) (type default))
    (uuid 187d3a4d-7368-4426-b391-2aa976ba129d)
  )
  (wire (pts (xy 111.76 97.155) (xy 111.76 99.06))
    (stroke (width 0) (type default))
    (uuid 1981b3c6-55dc-4c48-8eb1-c3e799ed0988)
  )
  (wire (pts (xy 159.385 89.535) (xy 154.305 89.535))
    (stroke (width 0) (type default))
    (uuid 1e784ddb-d724-4e58-be09-1ae2bea39e08)
  )
  (wire (pts (xy 158.115 120.65) (xy 159.385 120.65))
    (stroke (width 0) (type default))
    (uuid 23f7deff-8ecc-431f-86d6-ea19f089e871)
  )
  (wire (pts (xy 131.445 89.535) (xy 131.445 92.075))
    (stroke (width 0) (type default))
    (uuid 29df51d7-f285-42c3-9431-67a6a5ca34ad)
  )
  (wire (pts (xy 165.1 115.57) (xy 165.735 115.57))
    (stroke (width 0) (type default))
    (uuid 2bf71697-343d-458f-90bb-308d14c9488f)
  )
  (wire (pts (xy 133.985 89.535) (xy 135.255 89.535))
    (stroke (width 0) (type default))
    (uuid 3114f9d5-f733-432b-a0b4-d6eacaa014f4)
  )
  (wire (pts (xy 140.97 82.55) (xy 149.225 82.55))
    (stroke (width 0) (type default))
    (uuid 3141327e-a828-4cde-a544-0cf65263b51f)
  )
  (wire (pts (xy 153.67 120.65) (xy 154.94 120.65))
    (stroke (width 0) (type default))
    (uuid 33612fba-3b2f-4c60-b8b9-8fce1ab41d70)
  )
  (wire (pts (xy 172.085 115.57) (xy 173.355 115.57))
    (stroke (width 0) (type default))
    (uuid 33b74ac8-3246-4746-a62c-32d91cdc5619)
  )
  (wire (pts (xy 86.36 97.155) (xy 86.36 99.06))
    (stroke (width 0) (type default))
    (uuid 33e385b4-b5f6-4f14-80e1-3369ed0063c5)
  )
  (wire (pts (xy 102.235 89.535) (xy 109.22 89.535))
    (stroke (width 0) (type default))
    (uuid 34ead6f8-ef59-4298-af43-17b50a762567)
  )
  (wire (pts (xy 145.415 115.57) (xy 146.05 115.57))
    (stroke (width 0) (type default))
    (uuid 35600368-48f8-4c9c-99b9-ccc694a7a75e)
  )
  (wire (pts (xy 172.085 109.855) (xy 172.085 115.57))
    (stroke (width 0) (type default))
    (uuid 37bc1625-94cf-48c2-bb4c-5f9b871dddae)
  )
  (wire (pts (xy 123.825 89.535) (xy 127 89.535))
    (stroke (width 0) (type default))
    (uuid 3938a22a-8749-46a6-9271-bfb755191355)
  )
  (wire (pts (xy 102.235 97.79) (xy 102.235 99.06))
    (stroke (width 0) (type default))
    (uuid 3b093e3a-4e5d-4376-bad2-e43e00e0a7e7)
  )
  (wire (pts (xy 170.815 92.075) (xy 169.545 92.075))
    (stroke (width 0) (type default))
    (uuid 42caf643-b3a6-4848-bf4e-11e6721e0e4e)
  )
  (wire (pts (xy 153.035 89.535) (xy 154.305 89.535))
    (stroke (width 0) (type default))
    (uuid 4a3434ea-fd9d-471c-9267-1891747d6297)
  )
  (wire (pts (xy 127 97.155) (xy 127 99.06))
    (stroke (width 0) (type default))
    (uuid 4bd94aad-b528-4708-a915-324295b66dbb)
  )
  (wire (pts (xy 154.305 82.55) (xy 169.545 82.55))
    (stroke (width 0) (type default))
    (uuid 4c06d73b-f53c-4b8b-a21d-0851deb3c144)
  )
  (wire (pts (xy 170.815 120.65) (xy 172.085 120.65))
    (stroke (width 0) (type default))
    (uuid 4d15d7ce-5896-4876-8181-80f8a5ab3e37)
  )
  (wire (pts (xy 95.885 97.155) (xy 95.885 97.79))
    (stroke (width 0) (type default))
    (uuid 4d44925d-5fea-4a47-9bab-64d9ad64477d)
  )
  (wire (pts (xy 95.885 97.79) (xy 102.235 97.79))
    (stroke (width 0) (type default))
    (uuid 4e194afe-4a50-4731-91cc-6787c3b73f65)
  )
  (wire (pts (xy 200.025 82.55) (xy 201.295 82.55))
    (stroke (width 0) (type default))
    (uuid 4eb94b7f-ee88-4ccf-8b3a-6987261ba382)
  )
  (wire (pts (xy 102.235 104.14) (xy 102.235 105.41))
    (stroke (width 0) (type default))
    (uuid 512aee5f-308c-46b7-a2f7-65d8846d34fb)
  )
  (wire (pts (xy 140.335 89.535) (xy 140.97 89.535))
    (stroke (width 0) (type default))
    (uuid 57144a0f-3169-4968-b414-2d8550bdc362)
  )
  (wire (pts (xy 86.36 89.535) (xy 86.36 92.075))
    (stroke (width 0) (type default))
    (uuid 5789cc4d-1503-4d9d-878d-ae81b0fc022e)
  )
  (wire (pts (xy 164.465 115.57) (xy 165.1 115.57))
    (stroke (width 0) (type default))
    (uuid 5c020194-e8f0-48ed-934b-9dc4b584d4e3)
  )
  (wire (pts (xy 140.97 89.535) (xy 141.605 89.535))
    (stroke (width 0) (type default))
    (uuid 5d85ce3d-a510-4e49-bf3c-506db5c3d5e3)
  )
  (wire (pts (xy 205.74 92.075) (xy 205.74 96.52))
    (stroke (width 0) (type default))
    (uuid 5f245367-f2ba-4c4a-9d80-8f40be1f1063)
  )
  (wire (pts (xy 116.205 89.535) (xy 118.745 89.535))
    (stroke (width 0) (type default))
    (uuid 653f52a8-5a87-4347-b7f8-12cf42c4e4de)
  )
  (wire (pts (xy 192.405 92.075) (xy 205.74 92.075))
    (stroke (width 0) (type default))
    (uuid 69c21615-61b3-4a57-be0b-57b84649878b)
  )
  (wire (pts (xy 164.465 120.65) (xy 165.1 120.65))
    (stroke (width 0) (type default))
    (uuid 6f69df4f-b58a-44c0-a754-1c7e7d74cdd6)
  )
  (wire (pts (xy 146.685 89.535) (xy 147.955 89.535))
    (stroke (width 0) (type default))
    (uuid 74f49728-c2e6-4ebd-8641-c445347f44d0)
  )
  (wire (pts (xy 145.415 120.65) (xy 146.05 120.65))
    (stroke (width 0) (type default))
    (uuid 7e20ecdb-6702-474d-8496-f652e72e3d3d)
  )
  (wire (pts (xy 192.405 89.535) (xy 194.31 89.535))
    (stroke (width 0) (type default))
    (uuid 80acf5df-98cd-48af-b444-e88cac3fc11a)
  )
  (wire (pts (xy 154.305 102.235) (xy 154.305 102.87))
    (stroke (width 0) (type default))
    (uuid 80fc47aa-e60d-4152-8415-102b32e36cc7)
  )
  (wire (pts (xy 153.67 115.57) (xy 154.94 115.57))
    (stroke (width 0) (type default))
    (uuid 82a4b2f3-acad-4bcb-85fb-3ed1179d321b)
  )
  (wire (pts (xy 200.025 96.52) (xy 200.025 89.535))
    (stroke (width 0) (type default))
    (uuid 848370d5-1b25-4465-9d1c-b24dcd3aee96)
  )
  (wire (pts (xy 158.115 115.57) (xy 158.115 120.65))
    (stroke (width 0) (type default))
    (uuid 8537cabb-eb2e-4bfb-a295-fd3bbdced460)
  )
  (wire (pts (xy 111.76 89.535) (xy 111.76 92.075))
    (stroke (width 0) (type default))
    (uuid 8846e1bf-d93c-436c-82a3-05293d134cb3)
  )
  (wire (pts (xy 164.465 89.535) (xy 169.545 89.535))
    (stroke (width 0) (type default))
    (uuid 8ad9b559-533c-4858-b4bf-81b4ea0eb03e)
  )
  (wire (pts (xy 86.36 88.265) (xy 86.36 89.535))
    (stroke (width 0) (type default))
    (uuid 8f5cf04e-1824-41f6-b59c-20b694c8f38b)
  )
  (wire (pts (xy 111.76 89.535) (xy 116.205 89.535))
    (stroke (width 0) (type default))
    (uuid 91914875-0e95-49af-bcd0-6b819a6866fb)
  )
  (wire (pts (xy 131.445 97.155) (xy 131.445 99.06))
    (stroke (width 0) (type default))
    (uuid 92b746e3-c0c0-4c8e-b75a-ed6da34ad053)
  )
  (wire (pts (xy 194.31 94.615) (xy 194.31 89.535))
    (stroke (width 0) (type default))
    (uuid 93e22ca0-ee23-4a69-9dd1-bdb1b671c611)
  )
  (wire (pts (xy 173.355 109.855) (xy 172.085 109.855))
    (stroke (width 0) (type default))
    (uuid 958638a2-e0c1-4851-b272-a04f248c7536)
  )
  (wire (pts (xy 205.74 102.87) (xy 205.74 101.6))
    (stroke (width 0) (type default))
    (uuid 96b8a0a6-51b4-49e3-bac2-739af372b9c4)
  )
  (wire (pts (xy 86.36 89.535) (xy 90.805 89.535))
    (stroke (width 0) (type default))
    (uuid 97ffee3c-c044-45d3-b653-88c6daac2ed7)
  )
  (wire (pts (xy 168.275 94.615) (xy 170.815 94.615))
    (stroke (width 0) (type default))
    (uuid 9c0e8845-63d4-4a3f-a20d-bab14167bbb0)
  )
  (wire (pts (xy 192.405 94.615) (xy 194.31 94.615))
    (stroke (width 0) (type default))
    (uuid 9de3736d-5a26-4d8d-a365-fea121a4560c)
  )
  (wire (pts (xy 133.985 89.535) (xy 133.985 95.885))
    (stroke (width 0) (type default))
    (uuid 9de94d4b-41a3-46b7-9542-6c336ee5ff79)
  )
  (wire (pts (xy 116.205 97.155) (xy 116.205 99.06))
    (stroke (width 0) (type default))
    (uuid a32a6c46-f790-4f46-a552-4d6a1d5db291)
  )
  (wire (pts (xy 177.8 82.55) (xy 169.545 82.55))
    (stroke (width 0) (type default))
    (uuid a3b137b8-6e49-4cdb-93b0-260a6e3dcab7)
  )
  (wire (pts (xy 140.97 82.55) (xy 140.97 89.535))
    (stroke (width 0) (type default))
    (uuid a46eaf44-a449-407f-981b-39384fbf8c88)
  )
  (wire (pts (xy 172.085 120.65) (xy 172.085 115.57))
    (stroke (width 0) (type default))
    (uuid aa1ddcd5-2875-4e7c-bfad-ab7a1d280e4e)
  )
  (wire (pts (xy 178.435 115.57) (xy 179.705 115.57))
    (stroke (width 0) (type default))
    (uuid aa42300f-c587-4273-a6ec-8d0c58aca333)
  )
  (wire (pts (xy 169.545 82.55) (xy 169.545 89.535))
    (stroke (width 0) (type default))
    (uuid b0a7aec4-b14c-4565-b3b0-a03719acc7cc)
  )
  (wire (pts (xy 102.235 90.805) (xy 102.235 89.535))
    (stroke (width 0) (type default))
    (uuid b8db0e4d-248f-41cf-9766-d1794876722f)
  )
  (wire (pts (xy 109.22 88.265) (xy 109.22 89.535))
    (stroke (width 0) (type default))
    (uuid be4b8dea-1a55-450d-9c44-62ccd090c6e1)
  )
  (wire (pts (xy 200.025 102.87) (xy 200.025 101.6))
    (stroke (width 0) (type default))
    (uuid be5feff4-47bf-4702-ab19-e1475ced6251)
  )
  (wire (pts (xy 95.885 104.14) (xy 95.885 105.41))
    (stroke (width 0) (type default))
    (uuid c169710a-0256-4187-b4b6-d904975cceeb)
  )
  (wire (pts (xy 154.305 95.885) (xy 154.305 97.155))
    (stroke (width 0) (type default))
    (uuid c331190d-321f-4def-ab82-3b2094dbd1ce)
  )
  (wire (pts (xy 131.445 89.535) (xy 133.985 89.535))
    (stroke (width 0) (type default))
    (uuid c3507bfd-55ad-4aaa-a4bf-870a6c7bbf68)
  )
  (wire (pts (xy 153.67 118.11) (xy 154.94 118.11))
    (stroke (width 0) (type default))
    (uuid cb25ee64-961b-45d8-a0eb-50de324da5a5)
  )
  (wire (pts (xy 154.305 89.535) (xy 154.305 95.885))
    (stroke (width 0) (type default))
    (uuid cd27f660-3c83-4a84-9ffc-646140c8bc63)
  )
  (wire (pts (xy 154.94 115.57) (xy 158.115 115.57))
    (stroke (width 0) (type default))
    (uuid d12b77ca-15e0-4c85-9802-57a56d5506d2)
  )
  (wire (pts (xy 145.415 118.11) (xy 146.05 118.11))
    (stroke (width 0) (type default))
    (uuid d179308e-6dc5-4c76-87b8-efe3b067f4e8)
  )
  (wire (pts (xy 194.31 101.6) (xy 194.31 102.87))
    (stroke (width 0) (type default))
    (uuid d46911e7-10c9-4303-81be-4338ae7b404e)
  )
  (wire (pts (xy 169.545 89.535) (xy 170.815 89.535))
    (stroke (width 0) (type default))
    (uuid d573d71b-b91a-498d-b37a-e6cf5a5a62ce)
  )
  (wire (pts (xy 100.965 89.535) (xy 102.235 89.535))
    (stroke (width 0) (type default))
    (uuid d78f494d-b565-47b2-b1af-edc0d69d2185)
  )
  (wire (pts (xy 200.025 89.535) (xy 200.025 82.55))
    (stroke (width 0) (type default))
    (uuid d920f503-ceb0-49d9-b7b7-8aedf46d5392)
  )
  (wire (pts (xy 84.455 89.535) (xy 86.36 89.535))
    (stroke (width 0) (type default))
    (uuid da8ab5c3-3bb7-4b54-a81a-38768382c91e)
  )
  (wire (pts (xy 116.205 89.535) (xy 116.205 92.075))
    (stroke (width 0) (type default))
    (uuid dbfb0597-0808-4b3b-9618-51553a412fff)
  )
  (wire (pts (xy 169.545 92.075) (xy 169.545 96.52))
    (stroke (width 0) (type default))
    (uuid dd8a88d2-fd4e-4a3e-91ec-24b3721db1ac)
  )
  (wire (pts (xy 158.115 115.57) (xy 159.385 115.57))
    (stroke (width 0) (type default))
    (uuid df473e8b-53a1-49f1-bac2-d5e1f9272b5e)
  )
  (wire (pts (xy 200.025 82.55) (xy 185.42 82.55))
    (stroke (width 0) (type default))
    (uuid e20111f2-2ff2-4ef8-b3ad-60ac59b6b5e8)
  )
  (wire (pts (xy 179.705 115.57) (xy 179.705 116.84))
    (stroke (width 0) (type default))
    (uuid e27727c6-fa3f-4b3a-935a-507e518b9ce4)
  )
  (wire (pts (xy 141.605 95.885) (xy 133.985 95.885))
    (stroke (width 0) (type default))
    (uuid e99fa6b8-c742-4f0a-8301-cbf9289b3363)
  )
  (wire (pts (xy 154.94 115.57) (xy 154.94 118.11))
    (stroke (width 0) (type default))
    (uuid f10a4b5d-be3b-4f5a-8e3b-2c30f952706c)
  )
  (wire (pts (xy 95.885 97.79) (xy 95.885 99.06))
    (stroke (width 0) (type default))
    (uuid f3e2b757-9aec-488f-84c5-121d46c3b407)
  )
  (wire (pts (xy 133.985 86.36) (xy 133.985 89.535))
    (stroke (width 0) (type default))
    (uuid f7041495-e895-4c11-be11-9839d243e204)
  )
  (wire (pts (xy 102.235 95.885) (xy 102.235 97.79))
    (stroke (width 0) (type default))
    (uuid fad8517c-cc9c-40c9-9d21-ec647bcf7cbc)
  )
  (wire (pts (xy 165.1 115.57) (xy 165.1 120.65))
    (stroke (width 0) (type default))
    (uuid fc86984d-7b61-4e81-a432-b6cce73aaaab)
  )

  (global_label "LT8330_FB_3" (shape input) (at 145.415 120.65 180) (fields_autoplaced)
    (effects (font (size 1.27 1.27)) (justify right))
    (uuid 1984fad7-7ae5-4e23-b7e2-983911232ef6)
    (property "Intersheetrefs" "${INTERSHEET_REFS}" (at 130.1722 120.65 0)
      (effects (font (size 1.27 1.27)) (justify right) hide)
    )
  )
  (global_label "LT8330_FB_3" (shape input) (at 86.36 88.265 90) (fields_autoplaced)
    (effects (font (size 1.27 1.27)) (justify left))
    (uuid 1cef45e6-dcd2-47de-81b3-3de87f6b780d)
    (property "Intersheetrefs" "${INTERSHEET_REFS}" (at 86.36 73.0222 90)
      (effects (font (size 1.27 1.27)) (justify left) hide)
    )
  )
  (global_label "LT8330_FB_2" (shape input) (at 109.22 88.265 90) (fields_autoplaced)
    (effects (font (size 1.27 1.27)) (justify left))
    (uuid 257cc434-64b6-4498-b9d7-cd09571c8eaa)
    (property "Intersheetrefs" "${INTERSHEET_REFS}" (at 109.22 73.0222 90)
      (effects (font (size 1.27 1.27)) (justify left) hide)
    )
  )
  (global_label "LT8330_FB_1" (shape input) (at 133.985 86.36 90) (fields_autoplaced)
    (effects (font (size 1.27 1.27)) (justify left))
    (uuid 44174e62-e516-4f44-86d3-d0b8db1c0e10)
    (property "Intersheetrefs" "${INTERSHEET_REFS}" (at 133.985 71.1172 90)
      (effects (font (size 1.27 1.27)) (justify left) hide)
    )
  )
  (global_label "LT8330_FB" (shape input) (at 168.275 94.615 180) (fields_autoplaced)
    (effects (font (size 1.27 1.27)) (justify right))
    (uuid 4866e7e4-9fc5-4c7f-b007-8c61d64899a9)
    (property "Intersheetrefs" "${INTERSHEET_REFS}" (at 155.2093 94.615 0)
      (effects (font (size 1.27 1.27)) (justify right) hide)
    )
  )
  (global_label "LT8330_FB_2" (shape input) (at 145.415 118.11 180) (fields_autoplaced)
    (effects (font (size 1.27 1.27)) (justify right))
    (uuid 556f8f0c-f188-4fcc-b7e6-776f2731eee3)
    (property "Intersheetrefs" "${INTERSHEET_REFS}" (at 130.1722 118.11 0)
      (effects (font (size 1.27 1.27)) (justify right) hide)
    )
  )
  (global_label "LT8330_FB_1" (shape input) (at 145.415 115.57 180) (fields_autoplaced)
    (effects (font (size 1.27 1.27)) (justify right))
    (uuid a7201401-464f-4f5d-b55a-547e751fa4f7)
    (property "Intersheetrefs" "${INTERSHEET_REFS}" (at 130.1722 115.57 0)
      (effects (font (size 1.27 1.27)) (justify right) hide)
    )
  )
  (global_label "LT8330_FB" (shape input) (at 173.355 109.855 0) (fields_autoplaced)
    (effects (font (size 1.27 1.27)) (justify left))
    (uuid d22803e1-72a4-41da-a83d-5658d595d4be)
    (property "Intersheetrefs" "${INTERSHEET_REFS}" (at 186.4207 109.855 0)
      (effects (font (size 1.27 1.27)) (justify left) hide)
    )
  )

  (hierarchical_label "100V" (shape input) (at 84.455 89.535 180) (fields_autoplaced)
    (effects (font (size 1.27 1.27)) (justify right))
    (uuid 61c7ae2c-b2be-4336-b08f-38b91ceeef0c)
  )
  (hierarchical_label "5V-IN" (shape input) (at 201.295 82.55 0) (fields_autoplaced)
    (effects (font (size 1.27 1.27)) (justify left))
    (uuid 66eaed58-78bd-4449-89db-d8b1b6d89941)
  )

  (symbol (lib_id "Jumper:SolderJumper_2_Open") (at 149.86 118.11 0) (unit 1)
    (in_bom yes) (on_board yes) (dnp no)
    (uuid 019d37f2-c64d-4e4f-b6c3-5c72e5711c8d)
    (property "Reference" "JP?" (at 146.685 128.27 0)
      (effects (font (size 1.27 1.27)))
    )
    (property "Value" "FB_sel" (at 152.4 128.27 0)
      (effects (font (size 1.27 1.27)))
    )
    (property "Footprint" "Jumper:SolderJumper-2_P1.3mm_Open_RoundedPad1.0x1.5mm" (at 149.86 118.11 0)
      (effects (font (size 1.27 1.27)) hide)
    )
    (property "Datasheet" "~" (at 149.86 118.11 0)
      (effects (font (size 1.27 1.27)) hide)
    )
    (pin "1" (uuid 6584de9c-142b-4394-b7ff-4f339396b2de))
    (pin "2" (uuid ca608120-3c6a-42ee-88de-3296657fa0f1))
    (instances
      (project "HV-bias-gen"
        (path "/3d5f2864-1fb5-4f02-896d-2a9dfefaff39"
          (reference "JP?") (unit 1)
        )
        (path "/3d5f2864-1fb5-4f02-896d-2a9dfefaff39/0f524e33-692a-4961-8ad0-e97924f26470"
          (reference "JP6") (unit 1)
        )
      )
    )
  )

  (symbol (lib_id "Device:C_Small") (at 144.145 95.885 270) (unit 1)
    (in_bom yes) (on_board yes) (dnp no)
    (uuid 03def193-7e64-48d0-82a9-1f2c232c1db8)
    (property "Reference" "C?" (at 138.43 94.615 90)
      (effects (font (size 1.27 1.27)) (justify left))
    )
    (property "Value" "1uF" (at 145.415 94.615 90)
      (effects (font (size 1.27 1.27)) (justify left))
    )
    (property "Footprint" "Capacitor_SMD:C_0805_2012Metric_Pad1.18x1.45mm_HandSolder" (at 144.145 95.885 0)
      (effects (font (size 1.27 1.27)) hide)
    )
    (property "Datasheet" "~" (at 144.145 95.885 0)
      (effects (font (size 1.27 1.27)) hide)
    )
    (pin "1" (uuid cbc807e0-1e54-4f6f-9ffd-c34676d64c38))
    (pin "2" (uuid 8f6e0dca-981e-4a7f-bee5-5583e7a59dd2))
    (instances
      (project "HV-bias-gen"
        (path "/3d5f2864-1fb5-4f02-896d-2a9dfefaff39"
          (reference "C?") (unit 1)
        )
        (path "/3d5f2864-1fb5-4f02-896d-2a9dfefaff39/0f524e33-692a-4961-8ad0-e97924f26470"
          (reference "C11") (unit 1)
        )
      )
    )
  )

  (symbol (lib_id "Device:R_Small") (at 102.235 93.345 180) (unit 1)
    (in_bom yes) (on_board yes) (dnp no)
    (uuid 05c0cf9f-1646-4473-90fb-166769deaada)
    (property "Reference" "R?" (at 98.425 94.615 0)
      (effects (font (size 1.27 1.27)))
    )
    (property "Value" "100k" (at 99.695 96.52 0)
      (effects (font (size 1.27 1.27)))
    )
    (property "Footprint" "Resistor_SMD:R_0805_2012Metric_Pad1.20x1.40mm_HandSolder" (at 102.235 93.345 0)
      (effects (font (size 1.27 1.27)) hide)
    )
    (property "Datasheet" "~" (at 102.235 93.345 0)
      (effects (font (size 1.27 1.27)) hide)
    )
    (pin "1" (uuid 1bc99f45-6b52-47be-96c0-1db1203f4215))
    (pin "2" (uuid 442c16bd-e57a-40ef-87b0-14e2a4a4fbf0))
    (instances
      (project "HV-bias-gen"
        (path "/3d5f2864-1fb5-4f02-896d-2a9dfefaff39"
          (reference "R?") (unit 1)
        )
        (path "/3d5f2864-1fb5-4f02-896d-2a9dfefaff39/0f524e33-692a-4961-8ad0-e97924f26470"
          (reference "R1") (unit 1)
        )
      )
    )
  )

  (symbol (lib_id "power:GND") (at 194.31 102.87 0) (unit 1)
    (in_bom yes) (on_board yes) (dnp no)
    (uuid 0f03a5c0-1f27-4024-a3b0-dc9a79b8e968)
    (property "Reference" "#PWR011" (at 194.31 109.22 0)
      (effects (font (size 1.27 1.27)) hide)
    )
    (property "Value" "GND" (at 194.31 106.68 0)
      (effects (font (size 1.27 1.27)))
    )
    (property "Footprint" "" (at 194.31 102.87 0)
      (effects (font (size 1.27 1.27)) hide)
    )
    (property "Datasheet" "" (at 194.31 102.87 0)
      (effects (font (size 1.27 1.27)) hide)
    )
    (pin "1" (uuid 3e9ab700-0505-4127-a185-a83d4557c425))
    (instances
      (project "HV-bias-gen"
        (path "/3d5f2864-1fb5-4f02-896d-2a9dfefaff39"
          (reference "#PWR011") (unit 1)
        )
        (path "/3d5f2864-1fb5-4f02-896d-2a9dfefaff39/fab16f38-0b67-40d9-a884-54f3b083e102"
          (reference "#PWR033") (unit 1)
        )
        (path "/3d5f2864-1fb5-4f02-896d-2a9dfefaff39/0f524e33-692a-4961-8ad0-e97924f26470"
          (reference "#PWR040") (unit 1)
        )
      )
    )
  )

  (symbol (lib_id "Jumper:SolderJumper_2_Open") (at 149.86 115.57 0) (unit 1)
    (in_bom yes) (on_board yes) (dnp no)
    (uuid 13993744-a323-4817-b868-1f69ebc68d87)
    (property "Reference" "JP?" (at 146.685 125.73 0)
      (effects (font (size 1.27 1.27)))
    )
    (property "Value" "FB_sel" (at 152.4 125.73 0)
      (effects (font (size 1.27 1.27)))
    )
    (property "Footprint" "Jumper:SolderJumper-2_P1.3mm_Open_RoundedPad1.0x1.5mm" (at 149.86 115.57 0)
      (effects (font (size 1.27 1.27)) hide)
    )
    (property "Datasheet" "~" (at 149.86 115.57 0)
      (effects (font (size 1.27 1.27)) hide)
    )
    (pin "1" (uuid d9365e4c-3718-4ea6-bdb2-370e9bb4c213))
    (pin "2" (uuid 3d6d7dac-bc68-49bc-8582-1fdb2c2e71e9))
    (instances
      (project "HV-bias-gen"
        (path "/3d5f2864-1fb5-4f02-896d-2a9dfefaff39"
          (reference "JP?") (unit 1)
        )
        (path "/3d5f2864-1fb5-4f02-896d-2a9dfefaff39/0f524e33-692a-4961-8ad0-e97924f26470"
          (reference "JP5") (unit 1)
        )
      )
    )
  )

  (symbol (lib_id "Device:C_Small") (at 151.765 82.55 90) (unit 1)
    (in_bom yes) (on_board yes) (dnp no)
    (uuid 18663d67-9af3-4812-a7cd-d6b01f98e5c5)
    (property "Reference" "C?" (at 149.86 81.28 90)
      (effects (font (size 1.27 1.27)) (justify left))
    )
    (property "Value" "220nF" (at 159.385 81.28 90)
      (effects (font (size 1.27 1.27)) (justify left))
    )
    (property "Footprint" "Capacitor_SMD:C_0805_2012Metric_Pad1.18x1.45mm_HandSolder" (at 151.765 82.55 0)
      (effects (font (size 1.27 1.27)) hide)
    )
    (property "Datasheet" "~" (at 151.765 82.55 0)
      (effects (font (size 1.27 1.27)) hide)
    )
    (pin "1" (uuid d457b648-7c99-4397-b187-401dd66db881))
    (pin "2" (uuid 5e2d91b2-6f8d-42f2-9382-3c27adbeae09))
    (instances
      (project "HV-bias-gen"
        (path "/3d5f2864-1fb5-4f02-896d-2a9dfefaff39"
          (reference "C?") (unit 1)
        )
        (path "/3d5f2864-1fb5-4f02-896d-2a9dfefaff39/0f524e33-692a-4961-8ad0-e97924f26470"
          (reference "C12") (unit 1)
        )
      )
    )
  )

  (symbol (lib_id "power:GND") (at 127 99.06 0) (unit 1)
    (in_bom yes) (on_board yes) (dnp no)
    (uuid 22a6310e-eec1-49df-a876-a6d28daf5eb8)
    (property "Reference" "#PWR011" (at 127 105.41 0)
      (effects (font (size 1.27 1.27)) hide)
    )
    (property "Value" "GND" (at 127 102.87 0)
      (effects (font (size 1.27 1.27)))
    )
    (property "Footprint" "" (at 127 99.06 0)
      (effects (font (size 1.27 1.27)) hide)
    )
    (property "Datasheet" "" (at 127 99.06 0)
      (effects (font (size 1.27 1.27)) hide)
    )
    (pin "1" (uuid dcfe92f7-d8d2-4b08-98b3-eb16e78ce602))
    (instances
      (project "HV-bias-gen"
        (path "/3d5f2864-1fb5-4f02-896d-2a9dfefaff39"
          (reference "#PWR011") (unit 1)
        )
        (path "/3d5f2864-1fb5-4f02-896d-2a9dfefaff39/fab16f38-0b67-40d9-a884-54f3b083e102"
          (reference "#PWR033") (unit 1)
        )
        (path "/3d5f2864-1fb5-4f02-896d-2a9dfefaff39/0f524e33-692a-4961-8ad0-e97924f26470"
          (reference "#PWR046") (unit 1)
        )
      )
    )
  )

  (symbol (lib_id "Device:C_Small") (at 131.445 94.615 0) (unit 1)
    (in_bom yes) (on_board yes) (dnp no)
    (uuid 28d0c20d-3e13-4af8-b9c3-da484bb904d4)
    (property "Reference" "C?" (at 129.54 88.265 90)
      (effects (font (size 1.27 1.27)) (justify left))
    )
    (property "Value" "10uF" (at 129.54 84.455 90)
      (effects (font (size 1.27 1.27)) (justify left))
    )
    (property "Footprint" "Capacitor_SMD:C_1210_3225Metric_Pad1.33x2.70mm_HandSolder" (at 131.445 94.615 0)
      (effects (font (size 1.27 1.27)) hide)
    )
    (property "Datasheet" "~" (at 131.445 94.615 0)
      (effects (font (size 1.27 1.27)) hide)
    )
    (pin "1" (uuid 31fbec0e-8705-4736-b868-d94f88e0cb77))
    (pin "2" (uuid f763e824-33c6-4227-9c5d-3925c7be8448))
    (instances
      (project "HV-bias-gen"
        (path "/3d5f2864-1fb5-4f02-896d-2a9dfefaff39"
          (reference "C?") (unit 1)
        )
        (path "/3d5f2864-1fb5-4f02-896d-2a9dfefaff39/0f524e33-692a-4961-8ad0-e97924f26470"
          (reference "C29") (unit 1)
        )
      )
    )
  )

  (symbol (lib_id "Device:D_Schottky_Small") (at 161.925 89.535 0) (unit 1)
    (in_bom yes) (on_board yes) (dnp no)
    (uuid 2ab53af5-d4d4-4097-bc7f-5ae70916e043)
    (property "Reference" "D?" (at 155.575 86.995 0)
      (effects (font (size 1.27 1.27)))
    )
    (property "Value" "PMEG6010" (at 163.83 86.995 0)
      (effects (font (size 1.27 1.27)))
    )
    (property "Footprint" "Diode_SMD:D_SOD-323_HandSoldering" (at 161.925 89.535 90)
      (effects (font (size 1.27 1.27)) hide)
    )
    (property "Datasheet" "~" (at 161.925 89.535 90)
      (effects (font (size 1.27 1.27)) hide)
    )
    (pin "1" (uuid ceb526c2-5f2f-46d8-a658-e51a1744cc94))
    (pin "2" (uuid a67cbe5c-8712-4dac-859c-3f350deb4e57))
    (instances
      (project "HV-bias-gen"
        (path "/3d5f2864-1fb5-4f02-896d-2a9dfefaff39"
          (reference "D?") (unit 1)
        )
        (path "/3d5f2864-1fb5-4f02-896d-2a9dfefaff39/0f524e33-692a-4961-8ad0-e97924f26470"
          (reference "D4") (unit 1)
        )
      )
    )
  )

  (symbol (lib_id "power:GND") (at 131.445 99.06 0) (unit 1)
    (in_bom yes) (on_board yes) (dnp no)
    (uuid 2e3ea813-a8db-4f3e-83dc-eb4c85a58a62)
    (property "Reference" "#PWR011" (at 131.445 105.41 0)
      (effects (font (size 1.27 1.27)) hide)
    )
    (property "Value" "GND" (at 131.445 102.87 0)
      (effects (font (size 1.27 1.27)))
    )
    (property "Footprint" "" (at 131.445 99.06 0)
      (effects (font (size 1.27 1.27)) hide)
    )
    (property "Datasheet" "" (at 131.445 99.06 0)
      (effects (font (size 1.27 1.27)) hide)
    )
    (pin "1" (uuid 7eb65c82-c47c-42f7-be2d-1a4b1048a3a9))
    (instances
      (project "HV-bias-gen"
        (path "/3d5f2864-1fb5-4f02-896d-2a9dfefaff39"
          (reference "#PWR011") (unit 1)
        )
        (path "/3d5f2864-1fb5-4f02-896d-2a9dfefaff39/fab16f38-0b67-40d9-a884-54f3b083e102"
          (reference "#PWR033") (unit 1)
        )
        (path "/3d5f2864-1fb5-4f02-896d-2a9dfefaff39/0f524e33-692a-4961-8ad0-e97924f26470"
          (reference "#PWR045") (unit 1)
        )
      )
    )
  )

  (symbol (lib_id "power:GND") (at 154.305 102.87 0) (unit 1)
    (in_bom yes) (on_board yes) (dnp no)
    (uuid 31b4b839-3db7-41ca-acd1-f789d51c8705)
    (property "Reference" "#PWR011" (at 154.305 109.22 0)
      (effects (font (size 1.27 1.27)) hide)
    )
    (property "Value" "GND" (at 154.305 106.68 0)
      (effects (font (size 1.27 1.27)))
    )
    (property "Footprint" "" (at 154.305 102.87 0)
      (effects (font (size 1.27 1.27)) hide)
    )
    (property "Datasheet" "" (at 154.305 102.87 0)
      (effects (font (size 1.27 1.27)) hide)
    )
    (pin "1" (uuid 8e8fa005-ad8f-4ef4-a3d6-8ee970e82501))
    (instances
      (project "HV-bias-gen"
        (path "/3d5f2864-1fb5-4f02-896d-2a9dfefaff39"
          (reference "#PWR011") (unit 1)
        )
        (path "/3d5f2864-1fb5-4f02-896d-2a9dfefaff39/fab16f38-0b67-40d9-a884-54f3b083e102"
          (reference "#PWR033") (unit 1)
        )
        (path "/3d5f2864-1fb5-4f02-896d-2a9dfefaff39/0f524e33-692a-4961-8ad0-e97924f26470"
          (reference "#PWR043") (unit 1)
        )
      )
    )
  )

  (symbol (lib_id "Device:C_Polarized_Small") (at 161.925 120.65 90) (mirror x) (unit 1)
    (in_bom yes) (on_board yes) (dnp no)
    (uuid 39725e79-a534-446c-b1cd-cb8525d44447)
    (property "Reference" "C?" (at 160.02 123.825 90)
      (effects (font (size 1.27 1.27)))
    )
    (property "Value" "220nF" (at 161.925 125.73 90)
      (effects (font (size 1.27 1.27)))
    )
    (property "Footprint" "Capacitor_SMD:C_1206_3216Metric_Pad1.33x1.80mm_HandSolder" (at 161.925 120.65 0)
      (effects (font (size 1.27 1.27)) hide)
    )
    (property "Datasheet" "~" (at 161.925 120.65 0)
      (effects (font (size 1.27 1.27)) hide)
    )
    (pin "1" (uuid 89c03748-54d8-4556-845a-186ad47d0c7f))
    (pin "2" (uuid 43811a3f-289a-4929-9533-b23cd82d2247))
    (instances
      (project "HV-bias-gen"
        (path "/3d5f2864-1fb5-4f02-896d-2a9dfefaff39"
          (reference "C?") (unit 1)
        )
        (path "/3d5f2864-1fb5-4f02-896d-2a9dfefaff39/0f524e33-692a-4961-8ad0-e97924f26470"
          (reference "C14") (unit 1)
        )
      )
    )
  )

  (symbol (lib_id "power:GND") (at 111.76 99.06 0) (unit 1)
    (in_bom yes) (on_board yes) (dnp no)
    (uuid 40f6dc8d-5345-4fcd-9a1d-4a6061eef8ae)
    (property "Reference" "#PWR011" (at 111.76 105.41 0)
      (effects (font (size 1.27 1.27)) hide)
    )
    (property "Value" "GND" (at 111.76 102.87 0)
      (effects (font (size 1.27 1.27)))
    )
    (property "Footprint" "" (at 111.76 99.06 0)
      (effects (font (size 1.27 1.27)) hide)
    )
    (property "Datasheet" "" (at 111.76 99.06 0)
      (effects (font (size 1.27 1.27)) hide)
    )
    (pin "1" (uuid d7b554f2-305e-418a-956d-cf8a7864828a))
    (instances
      (project "HV-bias-gen"
        (path "/3d5f2864-1fb5-4f02-896d-2a9dfefaff39"
          (reference "#PWR011") (unit 1)
        )
        (path "/3d5f2864-1fb5-4f02-896d-2a9dfefaff39/fab16f38-0b67-40d9-a884-54f3b083e102"
          (reference "#PWR033") (unit 1)
        )
        (path "/3d5f2864-1fb5-4f02-896d-2a9dfefaff39/0f524e33-692a-4961-8ad0-e97924f26470"
          (reference "#PWR048") (unit 1)
        )
      )
    )
  )

  (symbol (lib_id "power:GND") (at 102.235 105.41 0) (unit 1)
    (in_bom yes) (on_board yes) (dnp no)
    (uuid 41b35844-7357-41cd-b5c7-ebb41e7da73a)
    (property "Reference" "#PWR011" (at 102.235 111.76 0)
      (effects (font (size 1.27 1.27)) hide)
    )
    (property "Value" "GND" (at 102.235 109.22 0)
      (effects (font (size 1.27 1.27)))
    )
    (property "Footprint" "" (at 102.235 105.41 0)
      (effects (font (size 1.27 1.27)) hide)
    )
    (property "Datasheet" "" (at 102.235 105.41 0)
      (effects (font (size 1.27 1.27)) hide)
    )
    (pin "1" (uuid 7af5254b-146a-4b25-b7fa-52a0c520c97c))
    (instances
      (project "HV-bias-gen"
        (path "/3d5f2864-1fb5-4f02-896d-2a9dfefaff39"
          (reference "#PWR011") (unit 1)
        )
        (path "/3d5f2864-1fb5-4f02-896d-2a9dfefaff39/fab16f38-0b67-40d9-a884-54f3b083e102"
          (reference "#PWR033") (unit 1)
        )
        (path "/3d5f2864-1fb5-4f02-896d-2a9dfefaff39/0f524e33-692a-4961-8ad0-e97924f26470"
          (reference "#PWR049") (unit 1)
        )
      )
    )
  )

  (symbol (lib_id "Device:C_Small") (at 200.025 99.06 0) (unit 1)
    (in_bom yes) (on_board yes) (dnp no)
    (uuid 47f20467-4585-4bab-8d8f-0c484c8ab616)
    (property "Reference" "C?" (at 200.66 97.155 0)
      (effects (font (size 1.27 1.27)) (justify left))
    )
    (property "Value" "10uF" (at 200.66 100.965 0)
      (effects (font (size 1.27 1.27)) (justify left))
    )
    (property "Footprint" "Capacitor_SMD:C_0805_2012Metric_Pad1.18x1.45mm_HandSolder" (at 200.025 99.06 0)
      (effects (font (size 1.27 1.27)) hide)
    )
    (property "Datasheet" "~" (at 200.025 99.06 0)
      (effects (font (size 1.27 1.27)) hide)
    )
    (pin "1" (uuid 7cfc6122-6e96-4f19-a1c7-ffbed0fbb55d))
    (pin "2" (uuid fe5e614b-67c4-4cb4-a93e-d043da3dbdcf))
    (instances
      (project "HV-bias-gen"
        (path "/3d5f2864-1fb5-4f02-896d-2a9dfefaff39"
          (reference "C?") (unit 1)
        )
        (path "/3d5f2864-1fb5-4f02-896d-2a9dfefaff39/0f524e33-692a-4961-8ad0-e97924f26470"
          (reference "C17") (unit 1)
        )
      )
    )
  )

  (symbol (lib_id "Device:C_Small") (at 127 94.615 0) (unit 1)
    (in_bom yes) (on_board yes) (dnp no)
    (uuid 5743c5a0-dc4e-4ca3-8142-60e6c3be8c8f)
    (property "Reference" "C?" (at 120.65 94.615 0)
      (effects (font (size 1.27 1.27)) (justify left))
    )
    (property "Value" "10uF" (at 120.65 96.52 0)
      (effects (font (size 1.27 1.27)) (justify left))
    )
    (property "Footprint" "Capacitor_SMD:C_1210_3225Metric_Pad1.33x2.70mm_HandSolder" (at 127 94.615 0)
      (effects (font (size 1.27 1.27)) hide)
    )
    (property "Datasheet" "~" (at 127 94.615 0)
      (effects (font (size 1.27 1.27)) hide)
    )
    (pin "1" (uuid 50d1b400-f134-4274-b397-c3a4f18acdca))
    (pin "2" (uuid 623e947a-14f9-4a23-8852-a33b206baa42))
    (instances
      (project "HV-bias-gen"
        (path "/3d5f2864-1fb5-4f02-896d-2a9dfefaff39"
          (reference "C?") (unit 1)
        )
        (path "/3d5f2864-1fb5-4f02-896d-2a9dfefaff39/0f524e33-692a-4961-8ad0-e97924f26470"
          (reference "C10") (unit 1)
        )
      )
    )
  )

  (symbol (lib_id "Device:C_Polarized_Small") (at 168.275 120.65 90) (mirror x) (unit 1)
    (in_bom yes) (on_board yes) (dnp no)
    (uuid 64ee61e3-c9a5-492b-ba28-88bfdc6634b7)
    (property "Reference" "C?" (at 168.275 123.825 90)
      (effects (font (size 1.27 1.27)))
    )
    (property "Value" "220nF" (at 170.18 125.73 90)
      (effects (font (size 1.27 1.27)))
    )
    (property "Footprint" "Capacitor_SMD:C_1206_3216Metric_Pad1.33x1.80mm_HandSolder" (at 168.275 120.65 0)
      (effects (font (size 1.27 1.27)) hide)
    )
    (property "Datasheet" "~" (at 168.275 120.65 0)
      (effects (font (size 1.27 1.27)) hide)
    )
    (pin "1" (uuid a81ba3ba-9ccd-403d-86d0-552b47275f0d))
    (pin "2" (uuid 532163f7-64a5-4302-a7ee-cb37fc674f99))
    (instances
      (project "HV-bias-gen"
        (path "/3d5f2864-1fb5-4f02-896d-2a9dfefaff39"
          (reference "C?") (unit 1)
        )
        (path "/3d5f2864-1fb5-4f02-896d-2a9dfefaff39/0f524e33-692a-4961-8ad0-e97924f26470"
          (reference "C15") (unit 1)
        )
      )
    )
  )

  (symbol (lib_id "Device:C_Small") (at 95.885 101.6 0) (unit 1)
    (in_bom yes) (on_board yes) (dnp no)
    (uuid 734f27a5-52c0-4470-b3fa-b9f0f7aa9764)
    (property "Reference" "C?" (at 89.535 103.505 0)
      (effects (font (size 1.27 1.27)) (justify left))
    )
    (property "Value" "10uF" (at 89.535 105.41 0)
      (effects (font (size 1.27 1.27)) (justify left))
    )
    (property "Footprint" "Capacitor_SMD:C_1210_3225Metric_Pad1.33x2.70mm_HandSolder" (at 95.885 101.6 0)
      (effects (font (size 1.27 1.27)) hide)
    )
    (property "Datasheet" "~" (at 95.885 101.6 0)
      (effects (font (size 1.27 1.27)) hide)
    )
    (pin "1" (uuid 62a6e3f7-9ce2-45e2-b499-0729afe84150))
    (pin "2" (uuid 606ced86-fe63-45aa-8434-ce1354518364))
    (instances
      (project "HV-bias-gen"
        (path "/3d5f2864-1fb5-4f02-896d-2a9dfefaff39"
          (reference "C?") (unit 1)
        )
        (path "/3d5f2864-1fb5-4f02-896d-2a9dfefaff39/0f524e33-692a-4961-8ad0-e97924f26470"
          (reference "C6") (unit 1)
        )
      )
    )
  )

  (symbol (lib_id "power:GND") (at 95.885 105.41 0) (unit 1)
    (in_bom yes) (on_board yes) (dnp no)
    (uuid 770cc885-b6f4-4463-9a2d-081e73ae08b2)
    (property "Reference" "#PWR011" (at 95.885 111.76 0)
      (effects (font (size 1.27 1.27)) hide)
    )
    (property "Value" "GND" (at 95.885 109.22 0)
      (effects (font (size 1.27 1.27)))
    )
    (property "Footprint" "" (at 95.885 105.41 0)
      (effects (font (size 1.27 1.27)) hide)
    )
    (property "Datasheet" "" (at 95.885 105.41 0)
      (effects (font (size 1.27 1.27)) hide)
    )
    (pin "1" (uuid 816c5454-b62c-4a12-ace9-918ae80a75c2))
    (instances
      (project "HV-bias-gen"
        (path "/3d5f2864-1fb5-4f02-896d-2a9dfefaff39"
          (reference "#PWR011") (unit 1)
        )
        (path "/3d5f2864-1fb5-4f02-896d-2a9dfefaff39/fab16f38-0b67-40d9-a884-54f3b083e102"
          (reference "#PWR033") (unit 1)
        )
        (path "/3d5f2864-1fb5-4f02-896d-2a9dfefaff39/0f524e33-692a-4961-8ad0-e97924f26470"
          (reference "#PWR050") (unit 1)
        )
      )
    )
  )

  (symbol (lib_id "Device:R_Small") (at 168.275 115.57 90) (unit 1)
    (in_bom yes) (on_board yes) (dnp no)
    (uuid 80387f7c-866c-4b8d-a721-7dc0b8d449f2)
    (property "Reference" "R?" (at 168.275 113.03 90)
      (effects (font (size 1.27 1.27)))
    )
    (property "Value" "35k" (at 167.64 117.475 90)
      (effects (font (size 1.27 1.27)))
    )
    (property "Footprint" "Resistor_SMD:R_0805_2012Metric_Pad1.20x1.40mm_HandSolder" (at 168.275 115.57 0)
      (effects (font (size 1.27 1.27)) hide)
    )
    (property "Datasheet" "~" (at 168.275 115.57 0)
      (effects (font (size 1.27 1.27)) hide)
    )
    (pin "1" (uuid 24105bb7-a1d7-4f23-a484-3b1506089733))
    (pin "2" (uuid f511ed57-e138-4d34-9358-9697add52256))
    (instances
      (project "HV-bias-gen"
        (path "/3d5f2864-1fb5-4f02-896d-2a9dfefaff39"
          (reference "R?") (unit 1)
        )
        (path "/3d5f2864-1fb5-4f02-896d-2a9dfefaff39/0f524e33-692a-4961-8ad0-e97924f26470"
          (reference "R4") (unit 1)
        )
      )
    )
  )

  (symbol (lib_id "Device:L") (at 181.61 82.55 90) (unit 1)
    (in_bom yes) (on_board yes) (dnp no)
    (uuid 84481ca9-50d5-469c-8071-5d5a6977d787)
    (property "Reference" "L?" (at 179.07 80.645 90)
      (effects (font (size 1.27 1.27)))
    )
    (property "Value" "10uH" (at 184.15 80.645 90)
      (effects (font (size 1.27 1.27)))
    )
    (property "Footprint" "Inductor_SMD:L_Abracon_ASPI-4030S" (at 181.61 82.55 0)
      (effects (font (size 1.27 1.27)) hide)
    )
    (property "Datasheet" "~" (at 181.61 82.55 0)
      (effects (font (size 1.27 1.27)) hide)
    )
    (pin "1" (uuid 74179f75-ac49-4eae-8ffd-7da4ec66f0f9))
    (pin "2" (uuid e29413f7-b7c5-46d7-90e2-13f62b8023e6))
    (instances
      (project "HV-bias-gen"
        (path "/3d5f2864-1fb5-4f02-896d-2a9dfefaff39"
          (reference "L?") (unit 1)
        )
        (path "/3d5f2864-1fb5-4f02-896d-2a9dfefaff39/0f524e33-692a-4961-8ad0-e97924f26470"
          (reference "L2") (unit 1)
        )
      )
    )
  )

  (symbol (lib_id "Device:C_Small") (at 111.76 94.615 0) (unit 1)
    (in_bom yes) (on_board yes) (dnp no)
    (uuid 8469570c-399e-4509-aca1-91e8d5c39626)
    (property "Reference" "C?" (at 111.76 88.9 90)
      (effects (font (size 1.27 1.27)) (justify left))
    )
    (property "Value" "10uF" (at 111.76 85.09 90)
      (effects (font (size 1.27 1.27)) (justify left))
    )
    (property "Footprint" "Capacitor_SMD:C_1210_3225Metric_Pad1.33x2.70mm_HandSolder" (at 111.76 94.615 0)
      (effects (font (size 1.27 1.27)) hide)
    )
    (property "Datasheet" "~" (at 111.76 94.615 0)
      (effects (font (size 1.27 1.27)) hide)
    )
    (pin "1" (uuid 2d0e5af0-45da-4765-9c0a-987a230f7158))
    (pin "2" (uuid d3296f4c-9b2a-4cdf-8801-c05ffae4ffa3))
    (instances
      (project "HV-bias-gen"
        (path "/3d5f2864-1fb5-4f02-896d-2a9dfefaff39"
          (reference "C?") (unit 1)
        )
        (path "/3d5f2864-1fb5-4f02-896d-2a9dfefaff39/0f524e33-692a-4961-8ad0-e97924f26470"
          (reference "C8") (unit 1)
        )
      )
    )
  )

  (symbol (lib_id "power:GND") (at 200.025 102.87 0) (unit 1)
    (in_bom yes) (on_board yes) (dnp no)
    (uuid 96735d18-a0d8-4d2d-ad09-36934df88c31)
    (property "Reference" "#PWR011" (at 200.025 109.22 0)
      (effects (font (size 1.27 1.27)) hide)
    )
    (property "Value" "GND" (at 200.025 106.68 0)
      (effects (font (size 1.27 1.27)))
    )
    (property "Footprint" "" (at 200.025 102.87 0)
      (effects (font (size 1.27 1.27)) hide)
    )
    (property "Datasheet" "" (at 200.025 102.87 0)
      (effects (font (size 1.27 1.27)) hide)
    )
    (pin "1" (uuid 5e23c2af-0125-461a-a307-44bb7715798b))
    (instances
      (project "HV-bias-gen"
        (path "/3d5f2864-1fb5-4f02-896d-2a9dfefaff39"
          (reference "#PWR011") (unit 1)
        )
        (path "/3d5f2864-1fb5-4f02-896d-2a9dfefaff39/fab16f38-0b67-40d9-a884-54f3b083e102"
          (reference "#PWR033") (unit 1)
        )
        (path "/3d5f2864-1fb5-4f02-896d-2a9dfefaff39/0f524e33-692a-4961-8ad0-e97924f26470"
          (reference "#PWR041") (unit 1)
        )
      )
    )
  )

  (symbol (lib_id "Device:C_Small") (at 194.31 99.06 0) (mirror y) (unit 1)
    (in_bom yes) (on_board yes) (dnp no)
    (uuid 987702c4-2935-4a53-9bdc-6a83d789d194)
    (property "Reference" "C?" (at 197.485 97.155 0)
      (effects (font (size 1.27 1.27)) (justify left))
    )
    (property "Value" "10uF" (at 199.39 100.965 0)
      (effects (font (size 1.27 1.27)) (justify left))
    )
    (property "Footprint" "Capacitor_SMD:C_0805_2012Metric_Pad1.18x1.45mm_HandSolder" (at 194.31 99.06 0)
      (effects (font (size 1.27 1.27)) hide)
    )
    (property "Datasheet" "~" (at 194.31 99.06 0)
      (effects (font (size 1.27 1.27)) hide)
    )
    (pin "1" (uuid 2273abac-7021-4de8-a83b-6b7eb219242b))
    (pin "2" (uuid 0bc1561d-536b-4781-a738-5472f97c945a))
    (instances
      (project "HV-bias-gen"
        (path "/3d5f2864-1fb5-4f02-896d-2a9dfefaff39"
          (reference "C?") (unit 1)
        )
        (path "/3d5f2864-1fb5-4f02-896d-2a9dfefaff39/0f524e33-692a-4961-8ad0-e97924f26470"
          (reference "C16") (unit 1)
        )
      )
    )
  )

  (symbol (lib_id "Device:C_Small") (at 154.305 99.695 0) (unit 1)
    (in_bom yes) (on_board yes) (dnp no)
    (uuid 9a9c1d91-facb-43c9-92c8-b9b1a1324a19)
    (property "Reference" "C?" (at 147.955 99.695 0)
      (effects (font (size 1.27 1.27)) (justify left))
    )
    (property "Value" "10uF" (at 147.955 101.6 0)
      (effects (font (size 1.27 1.27)) (justify left))
    )
    (property "Footprint" "Capacitor_SMD:C_1206_3216Metric_Pad1.33x1.80mm_HandSolder" (at 154.305 99.695 0)
      (effects (font (size 1.27 1.27)) hide)
    )
    (property "Datasheet" "~" (at 154.305 99.695 0)
      (effects (font (size 1.27 1.27)) hide)
    )
    (pin "1" (uuid 66f1bedc-6fd0-4f10-9ada-6aad5c6ead9f))
    (pin "2" (uuid 8e6ef50c-4b14-4259-919b-88be9e2be39a))
    (instances
      (project "HV-bias-gen"
        (path "/3d5f2864-1fb5-4f02-896d-2a9dfefaff39"
          (reference "C?") (unit 1)
        )
        (path "/3d5f2864-1fb5-4f02-896d-2a9dfefaff39/0f524e33-692a-4961-8ad0-e97924f26470"
          (reference "C13") (unit 1)
        )
      )
    )
  )

  (symbol (lib_id "Device:D_Schottky_Small") (at 150.495 89.535 0) (unit 1)
    (in_bom yes) (on_board yes) (dnp no)
    (uuid a299bc65-7f86-4770-8e26-d49e8c47d26b)
    (property "Reference" "D?" (at 150.495 86.995 0)
      (effects (font (size 1.27 1.27)))
    )
    (property "Value" "PMEG6010" (at 139.7 101.6 0)
      (effects (font (size 1.27 1.27)))
    )
    (property "Footprint" "Diode_SMD:D_SOD-323_HandSoldering" (at 150.495 89.535 90)
      (effects (font (size 1.27 1.27)) hide)
    )
    (property "Datasheet" "~" (at 150.495 89.535 90)
      (effects (font (size 1.27 1.27)) hide)
    )
    (pin "1" (uuid acc8866f-2fd3-426d-9bea-27a273a69fc6))
    (pin "2" (uuid 5ae05b59-2019-459e-9432-10f21f9d0f7a))
    (instances
      (project "HV-bias-gen"
        (path "/3d5f2864-1fb5-4f02-896d-2a9dfefaff39"
          (reference "D?") (unit 1)
        )
        (path "/3d5f2864-1fb5-4f02-896d-2a9dfefaff39/0f524e33-692a-4961-8ad0-e97924f26470"
          (reference "D3") (unit 1)
        )
      )
    )
  )

  (symbol (lib_id "Device:D_Schottky_Small") (at 137.795 89.535 180) (unit 1)
    (in_bom yes) (on_board yes) (dnp no)
    (uuid a5b450ed-bbac-4403-b7d6-f1c40de2b7e9)
    (property "Reference" "D?" (at 137.795 86.995 0)
      (effects (font (size 1.27 1.27)))
    )
    (property "Value" "PMEG6010" (at 139.7 99.695 0)
      (effects (font (size 1.27 1.27)))
    )
    (property "Footprint" "Diode_SMD:D_SOD-323_HandSoldering" (at 137.795 89.535 90)
      (effects (font (size 1.27 1.27)) hide)
    )
    (property "Datasheet" "~" (at 137.795 89.535 90)
      (effects (font (size 1.27 1.27)) hide)
    )
    (pin "1" (uuid 8a4b59eb-2391-471c-a549-7b32494dc494))
    (pin "2" (uuid 470ec2cd-a34a-41a2-b683-5d08f0d2f92b))
    (instances
      (project "HV-bias-gen"
        (path "/3d5f2864-1fb5-4f02-896d-2a9dfefaff39"
          (reference "D?") (unit 1)
        )
        (path "/3d5f2864-1fb5-4f02-896d-2a9dfefaff39/0f524e33-692a-4961-8ad0-e97924f26470"
          (reference "D2") (unit 1)
        )
      )
    )
  )

  (symbol (lib_id "Device:L_Small") (at 121.285 89.535 90) (unit 1)
    (in_bom yes) (on_board yes) (dnp no)
    (uuid a667d245-c805-4c60-af56-e674b4ca3077)
    (property "Reference" "L?" (at 119.38 87.63 90)
      (effects (font (size 1.27 1.27)))
    )
    (property "Value" "6.8uH" (at 121.285 90.805 90)
      (effects (font (size 1.27 1.27)))
    )
    (property "Footprint" "Inductor_SMD:L_Abracon_ASPI-4030S" (at 121.285 89.535 0)
      (effects (font (size 1.27 1.27)) hide)
    )
    (property "Datasheet" "~" (at 121.285 89.535 0)
      (effects (font (size 1.27 1.27)) hide)
    )
    (pin "1" (uuid 34ab1fd6-5ee3-4c77-886c-8ef25bfe5eea))
    (pin "2" (uuid 160acf83-26af-441b-80e0-120b559ae0da))
    (instances
      (project "HV-bias-gen"
        (path "/3d5f2864-1fb5-4f02-896d-2a9dfefaff39"
          (reference "L?") (unit 1)
        )
        (path "/3d5f2864-1fb5-4f02-896d-2a9dfefaff39/0f524e33-692a-4961-8ad0-e97924f26470"
          (reference "L1") (unit 1)
        )
      )
    )
  )

  (symbol (lib_id "Device:R_Small") (at 144.145 89.535 90) (unit 1)
    (in_bom yes) (on_board yes) (dnp no)
    (uuid abcf958e-50b4-4b8b-bfbf-f3b9ce0e9c29)
    (property "Reference" "R?" (at 144.145 86.995 90)
      (effects (font (size 1.27 1.27)))
    )
    (property "Value" "10" (at 143.51 91.44 90)
      (effects (font (size 1.27 1.27)))
    )
    (property "Footprint" "Resistor_SMD:R_0805_2012Metric_Pad1.20x1.40mm_HandSolder" (at 144.145 89.535 0)
      (effects (font (size 1.27 1.27)) hide)
    )
    (property "Datasheet" "~" (at 144.145 89.535 0)
      (effects (font (size 1.27 1.27)) hide)
    )
    (pin "1" (uuid f2e48b51-c620-4109-90dd-43f5d3cc6ef6))
    (pin "2" (uuid 2c8885cf-03b2-4f46-8e4d-61bcf510a3f8))
    (instances
      (project "HV-bias-gen"
        (path "/3d5f2864-1fb5-4f02-896d-2a9dfefaff39"
          (reference "R?") (unit 1)
        )
        (path "/3d5f2864-1fb5-4f02-896d-2a9dfefaff39/0f524e33-692a-4961-8ad0-e97924f26470"
          (reference "R2") (unit 1)
        )
      )
    )
  )

  (symbol (lib_id "power:GND") (at 179.705 116.84 0) (unit 1)
    (in_bom yes) (on_board yes) (dnp no)
    (uuid af09f560-0ccc-4f86-9b59-897d122dbd84)
    (property "Reference" "#PWR011" (at 179.705 123.19 0)
      (effects (font (size 1.27 1.27)) hide)
    )
    (property "Value" "GND" (at 179.705 120.65 0)
      (effects (font (size 1.27 1.27)))
    )
    (property "Footprint" "" (at 179.705 116.84 0)
      (effects (font (size 1.27 1.27)) hide)
    )
    (property "Datasheet" "" (at 179.705 116.84 0)
      (effects (font (size 1.27 1.27)) hide)
    )
    (pin "1" (uuid 81163af3-8dfb-4288-a518-baa6c1661521))
    (instances
      (project "HV-bias-gen"
        (path "/3d5f2864-1fb5-4f02-896d-2a9dfefaff39"
          (reference "#PWR011") (unit 1)
        )
        (path "/3d5f2864-1fb5-4f02-896d-2a9dfefaff39/fab16f38-0b67-40d9-a884-54f3b083e102"
          (reference "#PWR033") (unit 1)
        )
        (path "/3d5f2864-1fb5-4f02-896d-2a9dfefaff39/0f524e33-692a-4961-8ad0-e97924f26470"
          (reference "#PWR039") (unit 1)
        )
      )
    )
  )

  (symbol (lib_id "Simulation_SPICE:NPN") (at 95.885 92.075 270) (mirror x) (unit 1)
    (in_bom yes) (on_board yes) (dnp no)
    (uuid b258cd34-ad46-46fc-9e40-0d8b993c6473)
    (property "Reference" "Q?" (at 95.885 84.455 90)
      (effects (font (size 1.27 1.27)))
    )
    (property "Value" "FMMT497TA" (at 95.885 86.995 90)
      (effects (font (size 1.27 1.27)))
    )
    (property "Footprint" "Package_TO_SOT_SMD:SOT-23_Handsoldering" (at 95.885 28.575 0)
      (effects (font (size 1.27 1.27)) hide)
    )
    (property "Datasheet" "~" (at 95.885 28.575 0)
      (effects (font (size 1.27 1.27)) hide)
    )
    (property "Sim.Device" "NPN" (at 95.885 92.075 0)
      (effects (font (size 1.27 1.27)) hide)
    )
    (property "Sim.Type" "GUMMELPOON" (at 95.885 92.075 0)
      (effects (font (size 1.27 1.27)) hide)
    )
    (property "Sim.Pins" "1=C 2=B 3=E" (at 95.885 92.075 0)
      (effects (font (size 1.27 1.27)) hide)
    )
    (pin "1" (uuid 9a890194-a836-433e-afd7-ec6a86a043c8))
    (pin "2" (uuid aa3150a1-200f-491b-b9a0-19bfb11a43ee))
    (pin "3" (uuid a7c8a631-04f9-477b-8fd8-5a9e6d4130ea))
    (instances
      (project "HV-bias-gen"
        (path "/3d5f2864-1fb5-4f02-896d-2a9dfefaff39"
          (reference "Q?") (unit 1)
        )
        (path "/3d5f2864-1fb5-4f02-896d-2a9dfefaff39/0f524e33-692a-4961-8ad0-e97924f26470"
          (reference "Q1") (unit 1)
        )
      )
    )
  )

  (symbol (lib_id "power:GND") (at 169.545 96.52 0) (unit 1)
    (in_bom yes) (on_board yes) (dnp no)
    (uuid bb0c91a9-03c4-4b1c-b253-3036e9458295)
    (property "Reference" "#PWR011" (at 169.545 102.87 0)
      (effects (font (size 1.27 1.27)) hide)
    )
    (property "Value" "GND" (at 169.545 100.33 0)
      (effects (font (size 1.27 1.27)))
    )
    (property "Footprint" "" (at 169.545 96.52 0)
      (effects (font (size 1.27 1.27)) hide)
    )
    (property "Datasheet" "" (at 169.545 96.52 0)
      (effects (font (size 1.27 1.27)) hide)
    )
    (pin "1" (uuid f4a8a520-0b1f-4417-abd3-4c4bbf7e7332))
    (instances
      (project "HV-bias-gen"
        (path "/3d5f2864-1fb5-4f02-896d-2a9dfefaff39"
          (reference "#PWR011") (unit 1)
        )
        (path "/3d5f2864-1fb5-4f02-896d-2a9dfefaff39/fab16f38-0b67-40d9-a884-54f3b083e102"
          (reference "#PWR033") (unit 1)
        )
        (path "/3d5f2864-1fb5-4f02-896d-2a9dfefaff39/0f524e33-692a-4961-8ad0-e97924f26470"
          (reference "#PWR044") (unit 1)
        )
      )
    )
  )

  (symbol (lib_id "power:GND") (at 116.205 99.06 0) (unit 1)
    (in_bom yes) (on_board yes) (dnp no)
    (uuid beffb94f-ef39-4adb-a47a-49d057f8a717)
    (property "Reference" "#PWR011" (at 116.205 105.41 0)
      (effects (font (size 1.27 1.27)) hide)
    )
    (property "Value" "GND" (at 116.205 102.87 0)
      (effects (font (size 1.27 1.27)))
    )
    (property "Footprint" "" (at 116.205 99.06 0)
      (effects (font (size 1.27 1.27)) hide)
    )
    (property "Datasheet" "" (at 116.205 99.06 0)
      (effects (font (size 1.27 1.27)) hide)
    )
    (pin "1" (uuid 8477e186-a324-4242-b87d-4d6b74557f15))
    (instances
      (project "HV-bias-gen"
        (path "/3d5f2864-1fb5-4f02-896d-2a9dfefaff39"
          (reference "#PWR011") (unit 1)
        )
        (path "/3d5f2864-1fb5-4f02-896d-2a9dfefaff39/fab16f38-0b67-40d9-a884-54f3b083e102"
          (reference "#PWR033") (unit 1)
        )
        (path "/3d5f2864-1fb5-4f02-896d-2a9dfefaff39/0f524e33-692a-4961-8ad0-e97924f26470"
          (reference "#PWR047") (unit 1)
        )
      )
    )
  )

  (symbol (lib_id "Device:R_Small") (at 161.925 115.57 90) (unit 1)
    (in_bom yes) (on_board yes) (dnp no)
    (uuid c5933481-6306-447d-b00e-1d8ad7a7dc81)
    (property "Reference" "R?" (at 161.925 113.03 90)
      (effects (font (size 1.27 1.27)))
    )
    (property "Value" "35k" (at 161.29 117.475 90)
      (effects (font (size 1.27 1.27)))
    )
    (property "Footprint" "Resistor_SMD:R_0805_2012Metric_Pad1.20x1.40mm_HandSolder" (at 161.925 115.57 0)
      (effects (font (size 1.27 1.27)) hide)
    )
    (property "Datasheet" "~" (at 161.925 115.57 0)
      (effects (font (size 1.27 1.27)) hide)
    )
    (pin "1" (uuid be5819e7-46ec-495a-bd59-a6e2e441c8e9))
    (pin "2" (uuid 5693d05f-e606-4300-affb-33ffa44053fa))
    (instances
      (project "HV-bias-gen"
        (path "/3d5f2864-1fb5-4f02-896d-2a9dfefaff39"
          (reference "R?") (unit 1)
        )
        (path "/3d5f2864-1fb5-4f02-896d-2a9dfefaff39/0f524e33-692a-4961-8ad0-e97924f26470"
          (reference "R3") (unit 1)
        )
      )
    )
  )

  (symbol (lib_id "Device:R_Small") (at 175.895 115.57 90) (unit 1)
    (in_bom yes) (on_board yes) (dnp no)
    (uuid c81eb4b5-79e1-410e-849f-af266697ddca)
    (property "Reference" "R?" (at 175.895 113.03 90)
      (effects (font (size 1.27 1.27)))
    )
    (property "Value" "1k" (at 175.26 117.475 90)
      (effects (font (size 1.27 1.27)))
    )
    (property "Footprint" "Resistor_SMD:R_0805_2012Metric_Pad1.20x1.40mm_HandSolder" (at 175.895 115.57 0)
      (effects (font (size 1.27 1.27)) hide)
    )
    (property "Datasheet" "~" (at 175.895 115.57 0)
      (effects (font (size 1.27 1.27)) hide)
    )
    (pin "1" (uuid ab653b8f-a254-4d21-8803-3c459005bb31))
    (pin "2" (uuid e3eee971-f452-4e9e-ba4c-0e6bcc5dff73))
    (instances
      (project "HV-bias-gen"
        (path "/3d5f2864-1fb5-4f02-896d-2a9dfefaff39"
          (reference "R?") (unit 1)
        )
        (path "/3d5f2864-1fb5-4f02-896d-2a9dfefaff39/0f524e33-692a-4961-8ad0-e97924f26470"
          (reference "R5") (unit 1)
        )
      )
    )
  )

  (symbol (lib_id "power:GND") (at 205.74 102.87 0) (unit 1)
    (in_bom yes) (on_board yes) (dnp no)
    (uuid cc5d50f2-4bbf-4187-a007-67c0a27c5537)
    (property "Reference" "#PWR011" (at 205.74 109.22 0)
      (effects (font (size 1.27 1.27)) hide)
    )
    (property "Value" "GND" (at 205.74 106.68 0)
      (effects (font (size 1.27 1.27)))
    )
    (property "Footprint" "" (at 205.74 102.87 0)
      (effects (font (size 1.27 1.27)) hide)
    )
    (property "Datasheet" "" (at 205.74 102.87 0)
      (effects (font (size 1.27 1.27)) hide)
    )
    (pin "1" (uuid c0dbfba5-92a0-4171-90b0-b11e773a18eb))
    (instances
      (project "HV-bias-gen"
        (path "/3d5f2864-1fb5-4f02-896d-2a9dfefaff39"
          (reference "#PWR011") (unit 1)
        )
        (path "/3d5f2864-1fb5-4f02-896d-2a9dfefaff39/fab16f38-0b67-40d9-a884-54f3b083e102"
          (reference "#PWR033") (unit 1)
        )
        (path "/3d5f2864-1fb5-4f02-896d-2a9dfefaff39/0f524e33-692a-4961-8ad0-e97924f26470"
          (reference "#PWR042") (unit 1)
        )
      )
    )
  )

  (symbol (lib_id "Device:C_Small") (at 102.235 101.6 0) (unit 1)
    (in_bom yes) (on_board yes) (dnp no)
    (uuid cfb31be5-bf30-401c-ba4a-8d1732fef425)
    (property "Reference" "C?" (at 102.87 103.505 0)
      (effects (font (size 1.27 1.27)) (justify left))
    )
    (property "Value" "10uF" (at 102.87 105.41 0)
      (effects (font (size 1.27 1.27)) (justify left))
    )
    (property "Footprint" "Capacitor_SMD:C_1210_3225Metric_Pad1.33x2.70mm_HandSolder" (at 102.235 101.6 0)
      (effects (font (size 1.27 1.27)) hide)
    )
    (property "Datasheet" "~" (at 102.235 101.6 0)
      (effects (font (size 1.27 1.27)) hide)
    )
    (pin "1" (uuid 9c64de47-f1c5-446e-8015-a98bb40cbeae))
    (pin "2" (uuid 04443f47-ba05-4fea-a896-8db0ac3b9226))
    (instances
      (project "HV-bias-gen"
        (path "/3d5f2864-1fb5-4f02-896d-2a9dfefaff39"
          (reference "C?") (unit 1)
        )
        (path "/3d5f2864-1fb5-4f02-896d-2a9dfefaff39/0f524e33-692a-4961-8ad0-e97924f26470"
          (reference "C7") (unit 1)
        )
      )
    )
  )

  (symbol (lib_id "Jumper:SolderJumper_2_Open") (at 149.86 120.65 0) (unit 1)
    (in_bom yes) (on_board yes) (dnp no)
    (uuid d3603587-162c-4c3a-9baa-0bb3b81e4f3f)
    (property "Reference" "JP?" (at 146.685 130.81 0)
      (effects (font (size 1.27 1.27)))
    )
    (property "Value" "FB_sel" (at 152.4 130.81 0)
      (effects (font (size 1.27 1.27)))
    )
    (property "Footprint" "Jumper:SolderJumper-2_P1.3mm_Open_RoundedPad1.0x1.5mm" (at 149.86 120.65 0)
      (effects (font (size 1.27 1.27)) hide)
    )
    (property "Datasheet" "~" (at 149.86 120.65 0)
      (effects (font (size 1.27 1.27)) hide)
    )
    (pin "1" (uuid b1ac1dac-a146-42b8-a1b1-006bf196f435))
    (pin "2" (uuid c0109888-9b8d-45a8-9b07-62ace9dfc3d6))
    (instances
      (project "HV-bias-gen"
        (path "/3d5f2864-1fb5-4f02-896d-2a9dfefaff39"
          (reference "JP?") (unit 1)
        )
        (path "/3d5f2864-1fb5-4f02-896d-2a9dfefaff39/0f524e33-692a-4961-8ad0-e97924f26470"
          (reference "JP7") (unit 1)
        )
      )
    )
  )

  (symbol (lib_id "Device:C_Small") (at 116.205 94.615 0) (unit 1)
    (in_bom yes) (on_board yes) (dnp no)
    (uuid d44ad450-40ec-48df-8486-223d24454440)
    (property "Reference" "C?" (at 116.205 88.9 90)
      (effects (font (size 1.27 1.27)) (justify left))
    )
    (property "Value" "10uF" (at 116.205 85.09 90)
      (effects (font (size 1.27 1.27)) (justify left))
    )
    (property "Footprint" "Capacitor_SMD:C_1210_3225Metric_Pad1.33x2.70mm_HandSolder" (at 116.205 94.615 0)
      (effects (font (size 1.27 1.27)) hide)
    )
    (property "Datasheet" "~" (at 116.205 94.615 0)
      (effects (font (size 1.27 1.27)) hide)
    )
    (pin "1" (uuid 4c4956e7-f18c-4dd4-861d-d7af8997bdbd))
    (pin "2" (uuid 90658929-2092-484f-aac2-8437352f1fd0))
    (instances
      (project "HV-bias-gen"
        (path "/3d5f2864-1fb5-4f02-896d-2a9dfefaff39"
          (reference "C?") (unit 1)
        )
        (path "/3d5f2864-1fb5-4f02-896d-2a9dfefaff39/0f524e33-692a-4961-8ad0-e97924f26470"
          (reference "C9") (unit 1)
        )
      )
    )
  )

  (symbol (lib_id "power:GND") (at 86.36 99.06 0) (unit 1)
    (in_bom yes) (on_board yes) (dnp no)
    (uuid e4aa63d1-e77b-4112-986a-1afcde7e893d)
    (property "Reference" "#PWR011" (at 86.36 105.41 0)
      (effects (font (size 1.27 1.27)) hide)
    )
    (property "Value" "GND" (at 86.36 102.87 0)
      (effects (font (size 1.27 1.27)))
    )
    (property "Footprint" "" (at 86.36 99.06 0)
      (effects (font (size 1.27 1.27)) hide)
    )
    (property "Datasheet" "" (at 86.36 99.06 0)
      (effects (font (size 1.27 1.27)) hide)
    )
    (pin "1" (uuid 91c7f8e4-0f59-43b7-9ab4-49ff87073715))
    (instances
      (project "HV-bias-gen"
        (path "/3d5f2864-1fb5-4f02-896d-2a9dfefaff39"
          (reference "#PWR011") (unit 1)
        )
        (path "/3d5f2864-1fb5-4f02-896d-2a9dfefaff39/fab16f38-0b67-40d9-a884-54f3b083e102"
          (reference "#PWR033") (unit 1)
        )
        (path "/3d5f2864-1fb5-4f02-896d-2a9dfefaff39/0f524e33-692a-4961-8ad0-e97924f26470"
          (reference "#PWR051") (unit 1)
        )
      )
    )
  )

  (symbol (lib_id "Device:C_Small") (at 205.74 99.06 0) (unit 1)
    (in_bom yes) (on_board yes) (dnp no)
    (uuid ec04e188-6271-4983-b5ef-0adbe471e11f)
    (property "Reference" "C?" (at 206.375 97.155 0)
      (effects (font (size 1.27 1.27)) (justify left))
    )
    (property "Value" "10uF" (at 206.375 100.965 0)
      (effects (font (size 1.27 1.27)) (justify left))
    )
    (property "Footprint" "Capacitor_SMD:C_0805_2012Metric_Pad1.18x1.45mm_HandSolder" (at 205.74 99.06 0)
      (effects (font (size 1.27 1.27)) hide)
    )
    (property "Datasheet" "~" (at 205.74 99.06 0)
      (effects (font (size 1.27 1.27)) hide)
    )
    (pin "1" (uuid a5827a6e-a208-487b-9628-aacb9a877c9d))
    (pin "2" (uuid 36822ed0-5545-49b4-8614-720e5ebbb124))
    (instances
      (project "HV-bias-gen"
        (path "/3d5f2864-1fb5-4f02-896d-2a9dfefaff39"
          (reference "C?") (unit 1)
        )
        (path "/3d5f2864-1fb5-4f02-896d-2a9dfefaff39/0f524e33-692a-4961-8ad0-e97924f26470"
          (reference "C18") (unit 1)
        )
      )
    )
  )

  (symbol (lib_id "Device:C_Small") (at 86.36 94.615 0) (unit 1)
    (in_bom yes) (on_board yes) (dnp no)
    (uuid f5089506-3187-46bb-a7ca-1193b0f5e409)
    (property "Reference" "C?" (at 86.995 92.71 0)
      (effects (font (size 1.27 1.27)) (justify left))
    )
    (property "Value" "10uF" (at 86.995 96.52 0)
      (effects (font (size 1.27 1.27)) (justify left))
    )
    (property "Footprint" "Capacitor_SMD:C_1210_3225Metric_Pad1.33x2.70mm_HandSolder" (at 86.36 94.615 0)
      (effects (font (size 1.27 1.27)) hide)
    )
    (property "Datasheet" "~" (at 86.36 94.615 0)
      (effects (font (size 1.27 1.27)) hide)
    )
    (pin "1" (uuid 43d6be4a-9950-4bbf-9ef8-272b3ff85da8))
    (pin "2" (uuid 13333dcc-24cf-42f2-be98-d4eb2893cfd4))
    (instances
      (project "HV-bias-gen"
        (path "/3d5f2864-1fb5-4f02-896d-2a9dfefaff39"
          (reference "C?") (unit 1)
        )
        (path "/3d5f2864-1fb5-4f02-896d-2a9dfefaff39/0f524e33-692a-4961-8ad0-e97924f26470"
          (reference "C5") (unit 1)
        )
      )
    )
  )

  (symbol (lib_id "LT8330ES6TR:LT8330ES6TR") (at 131.445 89.535 0) (unit 1)
    (in_bom yes) (on_board yes) (dnp no)
    (uuid f538c531-a8d8-4d48-a884-72e4f3d57a09)
    (property "Reference" "U?" (at 174.625 99.06 0)
      (effects (font (size 1.27 1.27)))
    )
    (property "Value" "LT8330ES6TR" (at 179.705 101.6 0)
      (effects (font (size 1.27 1.27)))
    )
    (property "Footprint" "Package_TO_SOT_SMD:TSOT-23-6_HandSoldering" (at 165.735 89.535 0)
      (effects (font (size 1.27 1.27)) (justify bottom) hide)
    )
    (property "Datasheet" "" (at 165.735 89.535 0)
      (effects (font (size 1.27 1.27)) hide)
    )
    (property "MF" "Analog Devices" (at 165.735 89.535 0)
      (effects (font (size 1.27 1.27)) (justify bottom) hide)
    )
    (property "VENDOR" "Linear Technology" (at 165.735 89.535 0)
      (effects (font (size 1.27 1.27)) (justify bottom) hide)
    )
    (property "Description" "\nBoost, SEPIC Switching Regulator IC Positive or Negative, Isolation Capable Adjustable 1.6V, -0.8V 1 Output 1A SOT-23-6 Thin, TSOT-23-6\n" (at 131.445 89.535 0)
      (effects (font (size 1.27 1.27)) (justify bottom) hide)
    )
    (property "Package" "SOT-23-6 Linear Technology" (at 165.735 89.535 0)
      (effects (font (size 1.27 1.27)) (justify bottom) hide)
    )
    (property "Price" "None" (at 165.735 89.535 0)
      (effects (font (size 1.27 1.27)) (justify bottom) hide)
    )
    (property "Check_prices" "https://www.snapeda.com/parts/LT8330ES6%23TR/Analog+Devices/view-part/?ref=eda" (at 131.445 89.535 0)
      (effects (font (size 1.27 1.27)) (justify bottom) hide)
    )
    (property "SnapEDA_Link" "https://www.snapeda.com/parts/LT8330ES6%23TR/Analog+Devices/view-part/?ref=snap" (at 131.445 89.535 0)
      (effects (font (size 1.27 1.27)) (justify bottom) hide)
    )
    (property "MP" "LT8330ES6#TR" (at 165.735 89.535 0)
      (effects (font (size 1.27 1.27)) (justify bottom) hide)
    )
    (property "Purchase-URL" "https://www.snapeda.com/api/url_track_click_mouser/?unipart_id=608232&manufacturer=Analog Devices&part_name=LT8330ES6#TR&search_term=lt8330" (at 131.445 89.535 0)
      (effects (font (size 1.27 1.27)) (justify bottom) hide)
    )
    (property "Availability" "In Stock" (at 165.735 89.535 0)
      (effects (font (size 1.27 1.27)) (justify bottom) hide)
    )
    (property "MANUFACTURER_PART_NUMBER" "lt8330es6#tr" (at 165.735 89.535 0)
      (effects (font (size 1.27 1.27)) (justify bottom) hide)
    )
    (pin "1" (uuid cda760d2-155c-4bac-a32f-dfa5a25bc258))
    (pin "2" (uuid 8765def6-e352-4411-a231-9721f4c433cb))
    (pin "3" (uuid de836e2f-4803-4139-8a8c-c668af9d5cdb))
    (pin "4" (uuid 1e483857-3adf-4056-a187-e7af3ac76cda))
    (pin "5" (uuid 4c545a6c-169d-4b96-b48c-761601aa1d12))
    (pin "6" (uuid 7704ebb1-0570-4ac6-837d-74097d969e96))
    (instances
      (project "HV-bias-gen"
        (path "/3d5f2864-1fb5-4f02-896d-2a9dfefaff39"
          (reference "U?") (unit 1)
        )
        (path "/3d5f2864-1fb5-4f02-896d-2a9dfefaff39/0f524e33-692a-4961-8ad0-e97924f26470"
          (reference "U4") (unit 1)
        )
      )
    )
  )
)
