(kicad_sch (version 20230121) (generator eeschema)

  (uuid c7afcdbd-ef9a-44e6-8ca8-982b5034c373)

  (paper "A4")

  (lib_symbols
    (symbol "Device:C_Polarized_Small" (pin_numbers hide) (pin_names (offset 0.254) hide) (in_bom yes) (on_board yes)
      (property "Reference" "C" (at 0.254 1.778 0)
        (effects (font (size 1.27 1.27)) (justify left))
      )
      (property "Value" "C_Polarized_Small" (at 0.254 -2.032 0)
        (effects (font (size 1.27 1.27)) (justify left))
      )
      (property "Footprint" "" (at 0 0 0)
        (effects (font (size 1.27 1.27)) hide)
      )
      (property "Datasheet" "~" (at 0 0 0)
        (effects (font (size 1.27 1.27)) hide)
      )
      (property "ki_keywords" "cap capacitor" (at 0 0 0)
        (effects (font (size 1.27 1.27)) hide)
      )
      (property "ki_description" "Polarized capacitor, small symbol" (at 0 0 0)
        (effects (font (size 1.27 1.27)) hide)
      )
      (property "ki_fp_filters" "CP_*" (at 0 0 0)
        (effects (font (size 1.27 1.27)) hide)
      )
      (symbol "C_Polarized_Small_0_1"
        (rectangle (start -1.524 -0.3048) (end 1.524 -0.6858)
          (stroke (width 0) (type default))
          (fill (type outline))
        )
        (rectangle (start -1.524 0.6858) (end 1.524 0.3048)
          (stroke (width 0) (type default))
          (fill (type none))
        )
        (polyline
          (pts
            (xy -1.27 1.524)
            (xy -0.762 1.524)
          )
          (stroke (width 0) (type default))
          (fill (type none))
        )
        (polyline
          (pts
            (xy -1.016 1.27)
            (xy -1.016 1.778)
          )
          (stroke (width 0) (type default))
          (fill (type none))
        )
      )
      (symbol "C_Polarized_Small_1_1"
        (pin passive line (at 0 2.54 270) (length 1.8542)
          (name "~" (effects (font (size 1.27 1.27))))
          (number "1" (effects (font (size 1.27 1.27))))
        )
        (pin passive line (at 0 -2.54 90) (length 1.8542)
          (name "~" (effects (font (size 1.27 1.27))))
          (number "2" (effects (font (size 1.27 1.27))))
        )
      )
    )
    (symbol "Device:C_Small" (pin_numbers hide) (pin_names (offset 0.254) hide) (in_bom yes) (on_board yes)
      (property "Reference" "C" (at 0.254 1.778 0)
        (effects (font (size 1.27 1.27)) (justify left))
      )
      (property "Value" "C_Small" (at 0.254 -2.032 0)
        (effects (font (size 1.27 1.27)) (justify left))
      )
      (property "Footprint" "" (at 0 0 0)
        (effects (font (size 1.27 1.27)) hide)
      )
      (property "Datasheet" "~" (at 0 0 0)
        (effects (font (size 1.27 1.27)) hide)
      )
      (property "ki_keywords" "capacitor cap" (at 0 0 0)
        (effects (font (size 1.27 1.27)) hide)
      )
      (property "ki_description" "Unpolarized capacitor, small symbol" (at 0 0 0)
        (effects (font (size 1.27 1.27)) hide)
      )
      (property "ki_fp_filters" "C_*" (at 0 0 0)
        (effects (font (size 1.27 1.27)) hide)
      )
      (symbol "C_Small_0_1"
        (polyline
          (pts
            (xy -1.524 -0.508)
            (xy 1.524 -0.508)
          )
          (stroke (width 0.3302) (type default))
          (fill (type none))
        )
        (polyline
          (pts
            (xy -1.524 0.508)
            (xy 1.524 0.508)
          )
          (stroke (width 0.3048) (type default))
          (fill (type none))
        )
      )
      (symbol "C_Small_1_1"
        (pin passive line (at 0 2.54 270) (length 2.032)
          (name "~" (effects (font (size 1.27 1.27))))
          (number "1" (effects (font (size 1.27 1.27))))
        )
        (pin passive line (at 0 -2.54 90) (length 2.032)
          (name "~" (effects (font (size 1.27 1.27))))
          (number "2" (effects (font (size 1.27 1.27))))
        )
      )
    )
    (symbol "Device:D_Schottky_Small" (pin_numbers hide) (pin_names (offset 0.254) hide) (in_bom yes) (on_board yes)
      (property "Reference" "D" (at -1.27 2.032 0)
        (effects (font (size 1.27 1.27)) (justify left))
      )
      (property "Value" "D_Schottky_Small" (at -7.112 -2.032 0)
        (effects (font (size 1.27 1.27)) (justify left))
      )
      (property "Footprint" "" (at 0 0 90)
        (effects (font (size 1.27 1.27)) hide)
      )
      (property "Datasheet" "~" (at 0 0 90)
        (effects (font (size 1.27 1.27)) hide)
      )
      (property "ki_keywords" "diode Schottky" (at 0 0 0)
        (effects (font (size 1.27 1.27)) hide)
      )
      (property "ki_description" "Schottky diode, small symbol" (at 0 0 0)
        (effects (font (size 1.27 1.27)) hide)
      )
      (property "ki_fp_filters" "TO-???* *_Diode_* *SingleDiode* D_*" (at 0 0 0)
        (effects (font (size 1.27 1.27)) hide)
      )
      (symbol "D_Schottky_Small_0_1"
        (polyline
          (pts
            (xy -0.762 0)
            (xy 0.762 0)
          )
          (stroke (width 0) (type default))
          (fill (type none))
        )
        (polyline
          (pts
            (xy 0.762 -1.016)
            (xy -0.762 0)
            (xy 0.762 1.016)
            (xy 0.762 -1.016)
          )
          (stroke (width 0.254) (type default))
          (fill (type none))
        )
        (polyline
          (pts
            (xy -1.27 0.762)
            (xy -1.27 1.016)
            (xy -0.762 1.016)
            (xy -0.762 -1.016)
            (xy -0.254 -1.016)
            (xy -0.254 -0.762)
          )
          (stroke (width 0.254) (type default))
          (fill (type none))
        )
      )
      (symbol "D_Schottky_Small_1_1"
        (pin passive line (at -2.54 0 0) (length 1.778)
          (name "K" (effects (font (size 1.27 1.27))))
          (number "1" (effects (font (size 1.27 1.27))))
        )
        (pin passive line (at 2.54 0 180) (length 1.778)
          (name "A" (effects (font (size 1.27 1.27))))
          (number "2" (effects (font (size 1.27 1.27))))
        )
      )
    )
    (symbol "Device:L" (pin_numbers hide) (pin_names (offset 1.016) hide) (in_bom yes) (on_board yes)
      (property "Reference" "L" (at -1.27 0 90)
        (effects (font (size 1.27 1.27)))
      )
      (property "Value" "L" (at 1.905 0 90)
        (effects (font (size 1.27 1.27)))
      )
      (property "Footprint" "" (at 0 0 0)
        (effects (font (size 1.27 1.27)) hide)
      )
      (property "Datasheet" "~" (at 0 0 0)
        (effects (font (size 1.27 1.27)) hide)
      )
      (property "ki_keywords" "inductor choke coil reactor magnetic" (at 0 0 0)
        (effects (font (size 1.27 1.27)) hide)
      )
      (property "ki_description" "Inductor" (at 0 0 0)
        (effects (font (size 1.27 1.27)) hide)
      )
      (property "ki_fp_filters" "Choke_* *Coil* Inductor_* L_*" (at 0 0 0)
        (effects (font (size 1.27 1.27)) hide)
      )
      (symbol "L_0_1"
        (arc (start 0 -2.54) (mid 0.6323 -1.905) (end 0 -1.27)
          (stroke (width 0) (type default))
          (fill (type none))
        )
        (arc (start 0 -1.27) (mid 0.6323 -0.635) (end 0 0)
          (stroke (width 0) (type default))
          (fill (type none))
        )
        (arc (start 0 0) (mid 0.6323 0.635) (end 0 1.27)
          (stroke (width 0) (type default))
          (fill (type none))
        )
        (arc (start 0 1.27) (mid 0.6323 1.905) (end 0 2.54)
          (stroke (width 0) (type default))
          (fill (type none))
        )
      )
      (symbol "L_1_1"
        (pin passive line (at 0 3.81 270) (length 1.27)
          (name "1" (effects (font (size 1.27 1.27))))
          (number "1" (effects (font (size 1.27 1.27))))
        )
        (pin passive line (at 0 -3.81 90) (length 1.27)
          (name "2" (effects (font (size 1.27 1.27))))
          (number "2" (effects (font (size 1.27 1.27))))
        )
      )
    )
    (symbol "Device:L_Small" (pin_numbers hide) (pin_names (offset 0.254) hide) (in_bom yes) (on_board yes)
      (property "Reference" "L" (at 0.762 1.016 0)
        (effects (font (size 1.27 1.27)) (justify left))
      )
      (property "Value" "L_Small" (at 0.762 -1.016 0)
        (effects (font (size 1.27 1.27)) (justify left))
      )
      (property "Footprint" "" (at 0 0 0)
        (effects (font (size 1.27 1.27)) hide)
      )
      (property "Datasheet" "~" (at 0 0 0)
        (effects (font (size 1.27 1.27)) hide)
      )
      (property "ki_keywords" "inductor choke coil reactor magnetic" (at 0 0 0)
        (effects (font (size 1.27 1.27)) hide)
      )
      (property "ki_description" "Inductor, small symbol" (at 0 0 0)
        (effects (font (size 1.27 1.27)) hide)
      )
      (property "ki_fp_filters" "Choke_* *Coil* Inductor_* L_*" (at 0 0 0)
        (effects (font (size 1.27 1.27)) hide)
      )
      (symbol "L_Small_0_1"
        (arc (start 0 -2.032) (mid 0.5058 -1.524) (end 0 -1.016)
          (stroke (width 0) (type default))
          (fill (type none))
        )
        (arc (start 0 -1.016) (mid 0.5058 -0.508) (end 0 0)
          (stroke (width 0) (type default))
          (fill (type none))
        )
        (arc (start 0 0) (mid 0.5058 0.508) (end 0 1.016)
          (stroke (width 0) (type default))
          (fill (type none))
        )
        (arc (start 0 1.016) (mid 0.5058 1.524) (end 0 2.032)
          (stroke (width 0) (type default))
          (fill (type none))
        )
      )
      (symbol "L_Small_1_1"
        (pin passive line (at 0 2.54 270) (length 0.508)
          (name "~" (effects (font (size 1.27 1.27))))
          (number "1" (effects (font (size 1.27 1.27))))
        )
        (pin passive line (at 0 -2.54 90) (length 0.508)
          (name "~" (effects (font (size 1.27 1.27))))
          (number "2" (effects (font (size 1.27 1.27))))
        )
      )
    )
    (symbol "Device:R_Small" (pin_numbers hide) (pin_names (offset 0.254) hide) (in_bom yes) (on_board yes)
      (property "Reference" "R" (at 0.762 0.508 0)
        (effects (font (size 1.27 1.27)) (justify left))
      )
      (property "Value" "R_Small" (at 0.762 -1.016 0)
        (effects (font (size 1.27 1.27)) (justify left))
      )
      (property "Footprint" "" (at 0 0 0)
        (effects (font (size 1.27 1.27)) hide)
      )
      (property "Datasheet" "~" (at 0 0 0)
        (effects (font (size 1.27 1.27)) hide)
      )
      (property "ki_keywords" "R resistor" (at 0 0 0)
        (effects (font (size 1.27 1.27)) hide)
      )
      (property "ki_description" "Resistor, small symbol" (at 0 0 0)
        (effects (font (size 1.27 1.27)) hide)
      )
      (property "ki_fp_filters" "R_*" (at 0 0 0)
        (effects (font (size 1.27 1.27)) hide)
      )
      (symbol "R_Small_0_1"
        (rectangle (start -0.762 1.778) (end 0.762 -1.778)
          (stroke (width 0.2032) (type default))
          (fill (type none))
        )
      )
      (symbol "R_Small_1_1"
        (pin passive line (at 0 2.54 270) (length 0.762)
          (name "~" (effects (font (size 1.27 1.27))))
          (number "1" (effects (font (size 1.27 1.27))))
        )
        (pin passive line (at 0 -2.54 90) (length 0.762)
          (name "~" (effects (font (size 1.27 1.27))))
          (number "2" (effects (font (size 1.27 1.27))))
        )
      )
    )
    (symbol "Jumper:SolderJumper_2_Open" (pin_names (offset 0) hide) (in_bom yes) (on_board yes)
      (property "Reference" "JP" (at 0 2.032 0)
        (effects (font (size 1.27 1.27)))
      )
      (property "Value" "SolderJumper_2_Open" (at 0 -2.54 0)
        (effects (font (size 1.27 1.27)))
      )
      (property "Footprint" "" (at 0 0 0)
        (effects (font (size 1.27 1.27)) hide)
      )
      (property "Datasheet" "~" (at 0 0 0)
        (effects (font (size 1.27 1.27)) hide)
      )
      (property "ki_keywords" "solder jumper SPST" (at 0 0 0)
        (effects (font (size 1.27 1.27)) hide)
      )
      (property "ki_description" "Solder Jumper, 2-pole, open" (at 0 0 0)
        (effects (font (size 1.27 1.27)) hide)
      )
      (property "ki_fp_filters" "SolderJumper*Open*" (at 0 0 0)
        (effects (font (size 1.27 1.27)) hide)
      )
      (symbol "SolderJumper_2_Open_0_1"
        (arc (start -0.254 1.016) (mid -1.2656 0) (end -0.254 -1.016)
          (stroke (width 0) (type default))
          (fill (type none))
        )
        (arc (start -0.254 1.016) (mid -1.2656 0) (end -0.254 -1.016)
          (stroke (width 0) (type default))
          (fill (type outline))
        )
        (polyline
          (pts
            (xy -0.254 1.016)
            (xy -0.254 -1.016)
          )
          (stroke (width 0) (type default))
          (fill (type none))
        )
        (polyline
          (pts
            (xy 0.254 1.016)
            (xy 0.254 -1.016)
          )
          (stroke (width 0) (type default))
          (fill (type none))
        )
        (arc (start 0.254 -1.016) (mid 1.2656 0) (end 0.254 1.016)
          (stroke (width 0) (type default))
          (fill (type none))
        )
        (arc (start 0.254 -1.016) (mid 1.2656 0) (end 0.254 1.016)
          (stroke (width 0) (type default))
          (fill (type outline))
        )
      )
      (symbol "SolderJumper_2_Open_1_1"
        (pin passive line (at -3.81 0 0) (length 2.54)
          (name "A" (effects (font (size 1.27 1.27))))
          (number "1" (effects (font (size 1.27 1.27))))
        )
        (pin passive line (at 3.81 0 180) (length 2.54)
          (name "B" (effects (font (size 1.27 1.27))))
          (number "2" (effects (font (size 1.27 1.27))))
        )
      )
    )
    (symbol "LT1930ES5TRMPBF:LT1930ES5TRMPBF" (pin_names (offset 1.016)) (in_bom yes) (on_board yes)
      (property "Reference" "U" (at 15.6022 9.1225 0)
        (effects (font (size 1.27 1.27)) (justify left bottom))
      )
      (property "Value" "LT1930ES5TRMPBF" (at 14.9696 6.5826 0)
        (effects (font (size 1.27 1.27)) (justify left bottom))
      )
      (property "Footprint" "LT1930ES5TRMPBF:SOT-5_S" (at 0 0 0)
        (effects (font (size 1.27 1.27)) (justify bottom) hide)
      )
      (property "Datasheet" "" (at 0 0 0)
        (effects (font (size 1.27 1.27)) hide)
      )
      (property "DIGIKEY_PART_NUMBER" "LT1930ES5#TRMPBFTRND" (at 0 0 0)
        (effects (font (size 1.27 1.27)) (justify bottom) hide)
      )
      (property "MF" "Analog Devices" (at 0 0 0)
        (effects (font (size 1.27 1.27)) (justify bottom) hide)
      )
      (property "VENDOR" "Linear Technology" (at 0 0 0)
        (effects (font (size 1.27 1.27)) (justify bottom) hide)
      )
      (property "Description" "\nBoost, Flyback, SEPIC Switching Regulator IC Positive Adjustable 2.45V 1 Output 1A (Switch) SOT-23-5 Thin, TSOT-23-5\n" (at 0 0 0)
        (effects (font (size 1.27 1.27)) (justify bottom) hide)
      )
      (property "COPYRIGHT" "Copyright C 2016 Accelerated Designs. All rights reserved" (at 0 0 0)
        (effects (font (size 1.27 1.27)) (justify bottom) hide)
      )
      (property "Package" "TSOT-23 Linear Technology" (at 0 0 0)
        (effects (font (size 1.27 1.27)) (justify bottom) hide)
      )
      (property "Price" "None" (at 0 0 0)
        (effects (font (size 1.27 1.27)) (justify bottom) hide)
      )
      (property "Check_prices" "https://www.snapeda.com/parts/LT1930ES5%23TRMPBF/Analog+Devices/view-part/?ref=eda" (at 0 0 0)
        (effects (font (size 1.27 1.27)) (justify bottom) hide)
      )
      (property "SnapEDA_Link" "https://www.snapeda.com/parts/LT1930ES5%23TRMPBF/Analog+Devices/view-part/?ref=snap" (at 0 0 0)
        (effects (font (size 1.27 1.27)) (justify bottom) hide)
      )
      (property "MP" "LT1930ES5#TRMPBF" (at 0 0 0)
        (effects (font (size 1.27 1.27)) (justify bottom) hide)
      )
      (property "Purchase-URL" "https://www.snapeda.com/api/url_track_click_mouser/?unipart_id=587119&manufacturer=Analog Devices&part_name=LT1930ES5#TRMPBF&search_term=None" (at 0 0 0)
        (effects (font (size 1.27 1.27)) (justify bottom) hide)
      )
      (property "Availability" "Not in stock" (at 0 0 0)
        (effects (font (size 1.27 1.27)) (justify bottom) hide)
      )
      (property "MANUFACTURER_PART_NUMBER" "LT1930ES5#TRMPBF" (at 0 0 0)
        (effects (font (size 1.27 1.27)) (justify bottom) hide)
      )
      (symbol "LT1930ES5TRMPBF_0_0"
        (rectangle (start 7.62 -10.16) (end 33.02 5.08)
          (stroke (width 0.1524) (type default))
          (fill (type background))
        )
        (pin passive line (at 0 0 0) (length 7.62)
          (name "SW" (effects (font (size 1.016 1.016))))
          (number "1" (effects (font (size 1.016 1.016))))
        )
        (pin power_in line (at 0 -2.54 0) (length 7.62)
          (name "GND" (effects (font (size 1.016 1.016))))
          (number "2" (effects (font (size 1.016 1.016))))
        )
        (pin input line (at 40.64 -5.08 180) (length 7.62)
          (name "FB" (effects (font (size 1.016 1.016))))
          (number "3" (effects (font (size 1.016 1.016))))
        )
        (pin input line (at 40.64 -2.54 180) (length 7.62)
          (name "*SHDN" (effects (font (size 1.016 1.016))))
          (number "4" (effects (font (size 1.016 1.016))))
        )
        (pin power_in line (at 40.64 0 180) (length 7.62)
          (name "VIN" (effects (font (size 1.016 1.016))))
          (number "5" (effects (font (size 1.016 1.016))))
        )
      )
    )
    (symbol "Simulation_SPICE:NPN" (pin_numbers hide) (pin_names (offset 0)) (in_bom yes) (on_board yes)
      (property "Reference" "Q" (at -2.54 7.62 0)
        (effects (font (size 1.27 1.27)))
      )
      (property "Value" "NPN" (at -2.54 5.08 0)
        (effects (font (size 1.27 1.27)))
      )
      (property "Footprint" "" (at 63.5 0 0)
        (effects (font (size 1.27 1.27)) hide)
      )
      (property "Datasheet" "~" (at 63.5 0 0)
        (effects (font (size 1.27 1.27)) hide)
      )
      (property "Sim.Device" "NPN" (at 0 0 0)
        (effects (font (size 1.27 1.27)) hide)
      )
      (property "Sim.Type" "GUMMELPOON" (at 0 0 0)
        (effects (font (size 1.27 1.27)) hide)
      )
      (property "Sim.Pins" "1=C 2=B 3=E" (at 0 0 0)
        (effects (font (size 1.27 1.27)) hide)
      )
      (property "ki_keywords" "simulation" (at 0 0 0)
        (effects (font (size 1.27 1.27)) hide)
      )
      (property "ki_description" "Bipolar transistor symbol for simulation only, substrate tied to the emitter" (at 0 0 0)
        (effects (font (size 1.27 1.27)) hide)
      )
      (symbol "NPN_0_1"
        (polyline
          (pts
            (xy -2.54 0)
            (xy 0.635 0)
          )
          (stroke (width 0.1524) (type default))
          (fill (type none))
        )
        (polyline
          (pts
            (xy 0.635 0.635)
            (xy 2.54 2.54)
          )
          (stroke (width 0) (type default))
          (fill (type none))
        )
        (polyline
          (pts
            (xy 2.794 -1.27)
            (xy 2.794 -1.27)
          )
          (stroke (width 0.1524) (type default))
          (fill (type none))
        )
        (polyline
          (pts
            (xy 2.794 -1.27)
            (xy 2.794 -1.27)
          )
          (stroke (width 0.1524) (type default))
          (fill (type none))
        )
        (polyline
          (pts
            (xy 0.635 -0.635)
            (xy 2.54 -2.54)
            (xy 2.54 -2.54)
          )
          (stroke (width 0) (type default))
          (fill (type none))
        )
        (polyline
          (pts
            (xy 0.635 1.905)
            (xy 0.635 -1.905)
            (xy 0.635 -1.905)
          )
          (stroke (width 0.508) (type default))
          (fill (type none))
        )
        (polyline
          (pts
            (xy 1.27 -1.778)
            (xy 1.778 -1.27)
            (xy 2.286 -2.286)
            (xy 1.27 -1.778)
            (xy 1.27 -1.778)
          )
          (stroke (width 0) (type default))
          (fill (type outline))
        )
        (circle (center 1.27 0) (radius 2.8194)
          (stroke (width 0.254) (type default))
          (fill (type none))
        )
      )
      (symbol "NPN_1_1"
        (pin open_collector line (at 2.54 5.08 270) (length 2.54)
          (name "C" (effects (font (size 1.27 1.27))))
          (number "1" (effects (font (size 1.27 1.27))))
        )
        (pin input line (at -5.08 0 0) (length 2.54)
          (name "B" (effects (font (size 1.27 1.27))))
          (number "2" (effects (font (size 1.27 1.27))))
        )
        (pin open_emitter line (at 2.54 -5.08 90) (length 2.54)
          (name "E" (effects (font (size 1.27 1.27))))
          (number "3" (effects (font (size 1.27 1.27))))
        )
      )
    )
    (symbol "power:GND" (power) (pin_names (offset 0)) (in_bom yes) (on_board yes)
      (property "Reference" "#PWR" (at 0 -6.35 0)
        (effects (font (size 1.27 1.27)) hide)
      )
      (property "Value" "GND" (at 0 -3.81 0)
        (effects (font (size 1.27 1.27)))
      )
      (property "Footprint" "" (at 0 0 0)
        (effects (font (size 1.27 1.27)) hide)
      )
      (property "Datasheet" "" (at 0 0 0)
        (effects (font (size 1.27 1.27)) hide)
      )
      (property "ki_keywords" "global power" (at 0 0 0)
        (effects (font (size 1.27 1.27)) hide)
      )
      (property "ki_description" "Power symbol creates a global label with name \"GND\" , ground" (at 0 0 0)
        (effects (font (size 1.27 1.27)) hide)
      )
      (symbol "GND_0_1"
        (polyline
          (pts
            (xy 0 0)
            (xy 0 -1.27)
            (xy 1.27 -1.27)
            (xy 0 -2.54)
            (xy -1.27 -1.27)
            (xy 0 -1.27)
          )
          (stroke (width 0) (type default))
          (fill (type none))
        )
      )
      (symbol "GND_1_1"
        (pin power_in line (at 0 0 270) (length 0) hide
          (name "GND" (effects (font (size 1.27 1.27))))
          (number "1" (effects (font (size 1.27 1.27))))
        )
      )
    )
  )

  (junction (at 123.19 78.74) (diameter 0) (color 0 0 0 0)
    (uuid 00da061e-91cb-40d2-97c6-e9f3271cd443)
  )
  (junction (at 173.99 106.68) (diameter 0) (color 0 0 0 0)
    (uuid 07153aad-3c54-4cb9-9bd1-32710fccfabb)
  )
  (junction (at 90.805 78.74) (diameter 0) (color 0 0 0 0)
    (uuid 09e41293-90f2-47b6-b7da-a214ba973080)
  )
  (junction (at 130.175 78.74) (diameter 0) (color 0 0 0 0)
    (uuid 0eff503e-498f-459e-b10e-824dc62b616b)
  )
  (junction (at 173.99 104.14) (diameter 0) (color 0 0 0 0)
    (uuid 24d21a1f-e9f0-45bc-bcb8-fb4bfd9c22a1)
  )
  (junction (at 171.45 71.755) (diameter 0) (color 0 0 0 0)
    (uuid 315a8656-ed42-4856-b1fb-0eca56a4b491)
  )
  (junction (at 214.63 78.74) (diameter 0) (color 0 0 0 0)
    (uuid 364ec3f5-3a7b-48b6-b550-7965ba009abd)
  )
  (junction (at 214.63 81.28) (diameter 0) (color 0 0 0 0)
    (uuid 39022205-b096-4e9d-aa55-87b1e752c8c1)
  )
  (junction (at 171.45 78.74) (diameter 0) (color 0 0 0 0)
    (uuid 43dcd721-2751-4590-be96-c223988a42a7)
  )
  (junction (at 120.015 78.74) (diameter 0) (color 0 0 0 0)
    (uuid 4d1696dc-b9db-4c40-8c57-af00c3a86866)
  )
  (junction (at 184.15 109.22) (diameter 0) (color 0 0 0 0)
    (uuid 56f7b0a7-e18b-4600-8bab-816c996248cb)
  )
  (junction (at 150.495 78.74) (diameter 0) (color 0 0 0 0)
    (uuid 5a8cf726-d884-40f8-9a12-58f8297e128d)
  )
  (junction (at 84.455 86.995) (diameter 0) (color 0 0 0 0)
    (uuid 63e364d0-80f4-4a67-9a55-1b24ebc9a4fc)
  )
  (junction (at 184.15 104.14) (diameter 0) (color 0 0 0 0)
    (uuid 6cfe607e-3993-4b91-9917-7f4fa062cb0d)
  )
  (junction (at 97.79 78.74) (diameter 0) (color 0 0 0 0)
    (uuid 6e396531-a779-4b05-85fc-3ebefd1c8a88)
  )
  (junction (at 74.93 78.74) (diameter 0) (color 0 0 0 0)
    (uuid 884c3f43-0a40-41d5-9e60-284b4808fab5)
  )
  (junction (at 100.33 78.74) (diameter 0) (color 0 0 0 0)
    (uuid 8b48036c-3560-4110-b877-b913a59d1975)
  )
  (junction (at 88.9 86.995) (diameter 0) (color 0 0 0 0)
    (uuid 8d93cb74-3392-43e1-82b2-ab1556837dda)
  )
  (junction (at 115.57 78.74) (diameter 0) (color 0 0 0 0)
    (uuid 8f6575bd-83cb-4954-9b58-5dda66f3c3e6)
  )
  (junction (at 163.83 85.09) (diameter 0) (color 0 0 0 0)
    (uuid 959258b4-ffdb-48c1-a91c-fd6035ef8801)
  )
  (junction (at 177.165 104.14) (diameter 0) (color 0 0 0 0)
    (uuid 97c48907-93bf-4e0c-a6db-b9c807b0e4a6)
  )
  (junction (at 191.135 104.14) (diameter 0) (color 0 0 0 0)
    (uuid 992d5d0c-e0a0-40e6-ad38-03ed5193abda)
  )
  (junction (at 143.51 78.74) (diameter 0) (color 0 0 0 0)
    (uuid aa388641-dccd-4adb-b443-20488e5b58be)
  )
  (junction (at 104.775 78.74) (diameter 0) (color 0 0 0 0)
    (uuid b00861bf-6eb6-4e3c-bdee-5f5de7992093)
  )
  (junction (at 150.495 71.755) (diameter 0) (color 0 0 0 0)
    (uuid b1cf7438-6fb1-49cd-8da5-a7796a0be23c)
  )
  (junction (at 163.83 78.74) (diameter 0) (color 0 0 0 0)
    (uuid c7495cec-af14-41b9-8526-19482a831922)
  )
  (junction (at 143.51 85.09) (diameter 0) (color 0 0 0 0)
    (uuid c981adf2-02ec-4b83-aa29-96b8d9d78a03)
  )
  (junction (at 214.63 71.755) (diameter 0) (color 0 0 0 0)
    (uuid f8f438b7-5704-4fda-a044-6348f972b14d)
  )

  (wire (pts (xy 173.99 104.14) (xy 173.99 106.68))
    (stroke (width 0) (type default))
    (uuid 0f3158cd-8d7b-406f-afaa-680e17ea205f)
  )
  (wire (pts (xy 214.63 71.755) (xy 215.9 71.755))
    (stroke (width 0) (type default))
    (uuid 113fce95-b865-4850-ba5a-6e230c936d48)
  )
  (wire (pts (xy 130.81 71.755) (xy 130.175 71.755))
    (stroke (width 0) (type default))
    (uuid 113fffa0-9c2d-45e2-aa3a-a4ed49883fff)
  )
  (wire (pts (xy 163.83 78.74) (xy 163.83 85.09))
    (stroke (width 0) (type default))
    (uuid 1158579a-6413-4019-b51c-8fb9cc47337f)
  )
  (wire (pts (xy 123.19 78.74) (xy 123.19 85.09))
    (stroke (width 0) (type default))
    (uuid 1243245a-ef51-4c1f-aec7-f797edc10ec2)
  )
  (wire (pts (xy 88.9 86.995) (xy 88.9 88.265))
    (stroke (width 0) (type default))
    (uuid 134320c9-ffe4-4af6-9ee4-ae2554ed6500)
  )
  (wire (pts (xy 150.495 71.755) (xy 150.495 78.74))
    (stroke (width 0) (type default))
    (uuid 1490c576-99e8-4d3d-8388-4eb3d16bd10a)
  )
  (wire (pts (xy 74.93 86.36) (xy 74.93 88.265))
    (stroke (width 0) (type default))
    (uuid 14c0504c-2e71-4792-971f-5ea17b1914e9)
  )
  (wire (pts (xy 184.15 104.14) (xy 184.785 104.14))
    (stroke (width 0) (type default))
    (uuid 157d3a48-e3dc-49ec-b26c-d30742e409f6)
  )
  (wire (pts (xy 197.485 104.14) (xy 198.755 104.14))
    (stroke (width 0) (type default))
    (uuid 16fefe72-3047-473e-9c03-f4f26858bb4e)
  )
  (wire (pts (xy 112.395 78.74) (xy 115.57 78.74))
    (stroke (width 0) (type default))
    (uuid 183ee28d-6486-4d8e-8809-d720cda66955)
  )
  (wire (pts (xy 115.57 78.74) (xy 120.015 78.74))
    (stroke (width 0) (type default))
    (uuid 193bea72-d205-4b02-a771-cb44577f14ad)
  )
  (wire (pts (xy 104.775 86.36) (xy 104.775 88.265))
    (stroke (width 0) (type default))
    (uuid 1e70204c-d105-42eb-ab94-25a937446e68)
  )
  (wire (pts (xy 142.24 78.74) (xy 143.51 78.74))
    (stroke (width 0) (type default))
    (uuid 20196aef-6555-438d-9a41-1ad825624442)
  )
  (wire (pts (xy 74.93 78.74) (xy 74.93 81.28))
    (stroke (width 0) (type default))
    (uuid 24c6dda5-1d46-4c46-bde3-90ef2e966a8e)
  )
  (wire (pts (xy 183.515 104.14) (xy 184.15 104.14))
    (stroke (width 0) (type default))
    (uuid 24ce3e4b-0b7e-4ebb-b682-916e412d1691)
  )
  (wire (pts (xy 173.99 104.14) (xy 177.165 104.14))
    (stroke (width 0) (type default))
    (uuid 26cdb3e8-383a-4c7e-a0dd-922c7cd66e13)
  )
  (wire (pts (xy 90.805 80.01) (xy 90.805 78.74))
    (stroke (width 0) (type default))
    (uuid 2f022f20-1a0b-44f9-a03f-983110c5283a)
  )
  (wire (pts (xy 164.465 106.68) (xy 165.1 106.68))
    (stroke (width 0) (type default))
    (uuid 2fa4f3b6-4975-46f0-bcc2-1c9d5413c22c)
  )
  (wire (pts (xy 130.81 85.09) (xy 123.19 85.09))
    (stroke (width 0) (type default))
    (uuid 313e8c31-277f-48b3-bbee-7964791c1953)
  )
  (wire (pts (xy 88.9 93.345) (xy 88.9 94.615))
    (stroke (width 0) (type default))
    (uuid 3377ee1b-8dd1-40e3-8100-764c1b73d8f2)
  )
  (wire (pts (xy 90.805 78.74) (xy 97.79 78.74))
    (stroke (width 0) (type default))
    (uuid 342b35f4-0901-411c-96a8-4513231881a4)
  )
  (wire (pts (xy 69.85 78.74) (xy 74.93 78.74))
    (stroke (width 0) (type default))
    (uuid 3464bfb9-fee5-4891-9393-8e12b652c375)
  )
  (wire (pts (xy 213.36 83.82) (xy 216.535 83.82))
    (stroke (width 0) (type default))
    (uuid 3ad68eff-63d5-43dd-a40a-154d5a23ca97)
  )
  (wire (pts (xy 97.79 78.74) (xy 100.33 78.74))
    (stroke (width 0) (type default))
    (uuid 3afbd6f2-ac05-4c92-ac84-5e7d20be652f)
  )
  (wire (pts (xy 213.36 81.28) (xy 214.63 81.28))
    (stroke (width 0) (type default))
    (uuid 3c1185b2-baae-450f-a59a-a519010d2094)
  )
  (wire (pts (xy 115.57 78.74) (xy 115.57 81.28))
    (stroke (width 0) (type default))
    (uuid 4100b831-eaf8-44ff-8216-af8ddea085e3)
  )
  (wire (pts (xy 171.45 71.755) (xy 171.45 78.74))
    (stroke (width 0) (type default))
    (uuid 42dfacfc-9e8f-4c99-accb-bf4e452841d8)
  )
  (wire (pts (xy 214.63 71.755) (xy 195.58 71.755))
    (stroke (width 0) (type default))
    (uuid 473d3144-0c5f-4b6c-8316-e9d19f48c6da)
  )
  (wire (pts (xy 100.33 78.74) (xy 104.775 78.74))
    (stroke (width 0) (type default))
    (uuid 498d8cee-a183-4ca8-829b-4a8f3b2cac98)
  )
  (wire (pts (xy 173.99 106.68) (xy 173.99 109.22))
    (stroke (width 0) (type default))
    (uuid 4ab49449-ad82-4b8d-8847-5ccccf7a7396)
  )
  (wire (pts (xy 89.535 78.74) (xy 90.805 78.74))
    (stroke (width 0) (type default))
    (uuid 4f7bb0bf-7155-42f3-97a1-2806ceba77ee)
  )
  (wire (pts (xy 88.9 86.995) (xy 90.805 86.995))
    (stroke (width 0) (type default))
    (uuid 4fde7f82-cdab-4338-b4d7-328c9e70c5ea)
  )
  (wire (pts (xy 150.495 78.74) (xy 151.13 78.74))
    (stroke (width 0) (type default))
    (uuid 50d09224-867b-4766-a424-6d0f62dd0779)
  )
  (wire (pts (xy 191.135 109.22) (xy 191.135 104.14))
    (stroke (width 0) (type default))
    (uuid 5270222d-84b6-4532-9ab4-0f2bdf5ec93a)
  )
  (wire (pts (xy 143.51 78.74) (xy 143.51 85.09))
    (stroke (width 0) (type default))
    (uuid 64708ab9-6939-4288-8ab4-0ff9a0f9040a)
  )
  (wire (pts (xy 74.93 78.74) (xy 79.375 78.74))
    (stroke (width 0) (type default))
    (uuid 6505c476-62a6-4b6d-bc6c-9b970974abfd)
  )
  (wire (pts (xy 120.015 78.74) (xy 123.19 78.74))
    (stroke (width 0) (type default))
    (uuid 656efe71-7303-4caa-8123-de0d25367dd6)
  )
  (wire (pts (xy 104.775 78.74) (xy 104.775 81.28))
    (stroke (width 0) (type default))
    (uuid 6690ad1c-4a32-419c-a08f-3cc4e56f4b9f)
  )
  (wire (pts (xy 192.405 98.425) (xy 191.135 98.425))
    (stroke (width 0) (type default))
    (uuid 6aad5b39-a4b4-4301-a9cc-35c62e9cdb6b)
  )
  (wire (pts (xy 177.165 109.22) (xy 178.435 109.22))
    (stroke (width 0) (type default))
    (uuid 7408a4a7-b017-4618-be35-c67610a669eb)
  )
  (wire (pts (xy 84.455 86.36) (xy 84.455 86.995))
    (stroke (width 0) (type default))
    (uuid 77d20046-4304-4e51-a26e-b890dca07765)
  )
  (wire (pts (xy 184.15 104.14) (xy 184.15 109.22))
    (stroke (width 0) (type default))
    (uuid 79ac1994-8ec9-4585-897d-c3e2a7f3c860)
  )
  (wire (pts (xy 100.33 78.74) (xy 100.33 81.28))
    (stroke (width 0) (type default))
    (uuid 7c4c9c75-49ff-441f-aaee-92c399c978a2)
  )
  (wire (pts (xy 162.56 78.74) (xy 163.83 78.74))
    (stroke (width 0) (type default))
    (uuid 7e6664d2-72db-4b61-a80f-c6c8412cd00c)
  )
  (wire (pts (xy 149.86 78.74) (xy 150.495 78.74))
    (stroke (width 0) (type default))
    (uuid 81ee66eb-213e-47eb-bfd0-651c0e332673)
  )
  (wire (pts (xy 187.96 71.755) (xy 171.45 71.755))
    (stroke (width 0) (type default))
    (uuid 827b695e-58a6-4643-a1f3-7d2edc956d4d)
  )
  (wire (pts (xy 156.21 78.74) (xy 157.48 78.74))
    (stroke (width 0) (type default))
    (uuid 85a51e20-c0e6-43a7-a25a-858626fcc705)
  )
  (wire (pts (xy 97.79 77.47) (xy 97.79 78.74))
    (stroke (width 0) (type default))
    (uuid 941bfe0a-8295-4e98-9c49-ba9ed3f08625)
  )
  (wire (pts (xy 163.83 85.09) (xy 163.83 85.725))
    (stroke (width 0) (type default))
    (uuid 94ce738d-1304-444f-8eda-113cd1cfe572)
  )
  (wire (pts (xy 191.135 104.14) (xy 192.405 104.14))
    (stroke (width 0) (type default))
    (uuid 95413e0b-b427-4b68-9b94-d2a4e5568978)
  )
  (wire (pts (xy 104.775 78.74) (xy 107.315 78.74))
    (stroke (width 0) (type default))
    (uuid 9aa3de90-e1b1-4be1-a4de-3616e0d64d54)
  )
  (wire (pts (xy 172.72 106.68) (xy 173.99 106.68))
    (stroke (width 0) (type default))
    (uuid 9b4ea1cf-493d-4a3b-856f-cdd146c0c085)
  )
  (wire (pts (xy 120.015 86.36) (xy 120.015 88.265))
    (stroke (width 0) (type default))
    (uuid a11ad476-6d49-4595-bf1f-4f33683344c0)
  )
  (wire (pts (xy 84.455 93.345) (xy 84.455 94.615))
    (stroke (width 0) (type default))
    (uuid a19219dc-1bb7-4a24-b293-2ad14da48607)
  )
  (wire (pts (xy 123.19 77.47) (xy 123.19 78.74))
    (stroke (width 0) (type default))
    (uuid a43b0658-2662-4af2-a545-ab002982c19f)
  )
  (wire (pts (xy 171.45 78.74) (xy 172.72 78.74))
    (stroke (width 0) (type default))
    (uuid a49fcbe2-ad48-4f6a-8907-d6b86d920734)
  )
  (wire (pts (xy 214.63 81.28) (xy 214.63 86.36))
    (stroke (width 0) (type default))
    (uuid aa225fec-b6ec-4649-9c0f-57405570002e)
  )
  (wire (pts (xy 156.21 85.09) (xy 163.83 85.09))
    (stroke (width 0) (type default))
    (uuid ae08d69f-47b0-4b95-833e-7dd85e851f4f)
  )
  (wire (pts (xy 164.465 109.22) (xy 165.1 109.22))
    (stroke (width 0) (type default))
    (uuid ae8687d1-4ca9-4eb3-ab4f-ddcbf23718dd)
  )
  (wire (pts (xy 214.63 71.755) (xy 214.63 78.74))
    (stroke (width 0) (type default))
    (uuid b07ab66c-e142-488b-849f-68ec53e02580)
  )
  (wire (pts (xy 74.93 77.47) (xy 74.93 78.74))
    (stroke (width 0) (type default))
    (uuid b290295d-049a-4382-b712-c6a08ce7311c)
  )
  (wire (pts (xy 100.33 86.36) (xy 100.33 88.265))
    (stroke (width 0) (type default))
    (uuid b2fae346-d34e-4b77-add2-959bb89ab288)
  )
  (wire (pts (xy 172.72 81.28) (xy 171.45 81.28))
    (stroke (width 0) (type default))
    (uuid b45456e2-7b44-4729-a301-6e5564d448b9)
  )
  (wire (pts (xy 156.21 71.755) (xy 171.45 71.755))
    (stroke (width 0) (type default))
    (uuid b87f9ea3-7edf-44a6-8111-4ac5273dfa50)
  )
  (wire (pts (xy 191.135 98.425) (xy 191.135 104.14))
    (stroke (width 0) (type default))
    (uuid b8d44685-fe6f-4247-8a84-08925ff5aede)
  )
  (wire (pts (xy 164.465 104.14) (xy 165.1 104.14))
    (stroke (width 0) (type default))
    (uuid be45af28-f17f-482b-8a33-865b551379dd)
  )
  (wire (pts (xy 84.455 86.995) (xy 88.9 86.995))
    (stroke (width 0) (type default))
    (uuid beb64c3d-4b3d-4638-a3a8-a55f06ee4d0b)
  )
  (wire (pts (xy 135.89 85.09) (xy 143.51 85.09))
    (stroke (width 0) (type default))
    (uuid c29a4599-ae88-4829-aab9-5b680a91ee82)
  )
  (wire (pts (xy 151.13 85.09) (xy 143.51 85.09))
    (stroke (width 0) (type default))
    (uuid c2ff81e8-f5d3-4596-ade2-f1496c845d8b)
  )
  (wire (pts (xy 171.45 81.28) (xy 171.45 91.44))
    (stroke (width 0) (type default))
    (uuid c3cad776-1c4e-4e14-9797-0f9562eb3558)
  )
  (wire (pts (xy 143.51 78.74) (xy 144.78 78.74))
    (stroke (width 0) (type default))
    (uuid cc3b3df1-82ec-4c78-94bd-204c7746f7f5)
  )
  (wire (pts (xy 135.89 71.755) (xy 150.495 71.755))
    (stroke (width 0) (type default))
    (uuid cfc31bbe-96c2-47ba-945b-90c85a8a051a)
  )
  (wire (pts (xy 84.455 86.995) (xy 84.455 88.265))
    (stroke (width 0) (type default))
    (uuid d0c77d54-8dee-4f7e-828b-da29008f87c5)
  )
  (wire (pts (xy 213.36 78.74) (xy 214.63 78.74))
    (stroke (width 0) (type default))
    (uuid d0de7ab0-329d-4167-a627-7a98754a600a)
  )
  (wire (pts (xy 165.1 78.74) (xy 163.83 78.74))
    (stroke (width 0) (type default))
    (uuid d2c64918-13fb-4602-84b3-ede01ee938f4)
  )
  (wire (pts (xy 130.175 71.755) (xy 130.175 78.74))
    (stroke (width 0) (type default))
    (uuid d55dedc7-4922-40ac-ba88-4c699c5a59cd)
  )
  (wire (pts (xy 150.495 71.755) (xy 151.13 71.755))
    (stroke (width 0) (type default))
    (uuid d8d213ef-9ee6-45e9-a933-3e9fdef0df07)
  )
  (wire (pts (xy 170.18 78.74) (xy 171.45 78.74))
    (stroke (width 0) (type default))
    (uuid da17cea7-ef1b-4c94-9f47-e65dca5563f8)
  )
  (wire (pts (xy 214.63 78.74) (xy 214.63 81.28))
    (stroke (width 0) (type default))
    (uuid da30bfa9-bc5e-41b0-b172-cd380b42b5de)
  )
  (wire (pts (xy 120.015 78.74) (xy 120.015 81.28))
    (stroke (width 0) (type default))
    (uuid db6bf7f2-7345-4464-b7d1-a680922fa6fc)
  )
  (wire (pts (xy 130.175 78.74) (xy 130.81 78.74))
    (stroke (width 0) (type default))
    (uuid e059ea9c-eb41-4573-b2bf-cfdf79abeb10)
  )
  (wire (pts (xy 189.865 109.22) (xy 191.135 109.22))
    (stroke (width 0) (type default))
    (uuid e145cff8-4bf0-4bf3-ae65-fc7961ada80a)
  )
  (wire (pts (xy 163.83 91.44) (xy 163.83 90.805))
    (stroke (width 0) (type default))
    (uuid e27d207d-a669-4a64-8c9d-017b5a2e8a20)
  )
  (wire (pts (xy 177.165 104.14) (xy 177.165 109.22))
    (stroke (width 0) (type default))
    (uuid e2adeb3e-deee-47bc-a517-2e61b1f78950)
  )
  (wire (pts (xy 198.755 104.14) (xy 198.755 105.41))
    (stroke (width 0) (type default))
    (uuid e427276c-7e10-47bb-97cd-6c7c993d611b)
  )
  (wire (pts (xy 135.89 78.74) (xy 137.16 78.74))
    (stroke (width 0) (type default))
    (uuid e67f7a2f-b74c-435b-bd72-7818efe6baba)
  )
  (wire (pts (xy 189.865 104.14) (xy 191.135 104.14))
    (stroke (width 0) (type default))
    (uuid e70d5b64-61d8-48ae-a4ee-07ea6c722c23)
  )
  (wire (pts (xy 115.57 86.36) (xy 115.57 88.265))
    (stroke (width 0) (type default))
    (uuid ea38596a-3e21-48f7-a033-fe175810fd78)
  )
  (wire (pts (xy 172.72 109.22) (xy 173.99 109.22))
    (stroke (width 0) (type default))
    (uuid eabb5a57-fa7e-45ae-ac07-ed8f35887ca0)
  )
  (wire (pts (xy 177.165 104.14) (xy 178.435 104.14))
    (stroke (width 0) (type default))
    (uuid ead067b9-52b4-4410-92ba-de5eeee80c75)
  )
  (wire (pts (xy 214.63 92.71) (xy 214.63 91.44))
    (stroke (width 0) (type default))
    (uuid ece26e5c-e147-41ec-8f7b-da8a1a5565a2)
  )
  (wire (pts (xy 129.54 78.74) (xy 130.175 78.74))
    (stroke (width 0) (type default))
    (uuid ee30696d-96fe-40e0-956b-e27848e8bae0)
  )
  (wire (pts (xy 90.805 85.09) (xy 90.805 86.995))
    (stroke (width 0) (type default))
    (uuid f1b25af4-4e1b-4f03-aa16-cc2dd13e9b84)
  )
  (wire (pts (xy 184.15 109.22) (xy 184.785 109.22))
    (stroke (width 0) (type default))
    (uuid f59aeea4-c750-4b49-b72a-1634082c563a)
  )
  (wire (pts (xy 183.515 109.22) (xy 184.15 109.22))
    (stroke (width 0) (type default))
    (uuid f8d3918b-ac33-4431-91b4-ef22053beeed)
  )
  (wire (pts (xy 172.72 104.14) (xy 173.99 104.14))
    (stroke (width 0) (type default))
    (uuid f99251e1-b447-413d-a9ab-4573c7498f60)
  )
  (wire (pts (xy 123.19 78.74) (xy 124.46 78.74))
    (stroke (width 0) (type default))
    (uuid fc14293c-b7c2-4107-820f-43994d0f08d5)
  )

  (text "https://electrical.codidact.com/posts/279580" (at 129.54 64.135 0)
    (effects (font (size 1.27 1.27)) (justify left bottom))
    (uuid c7b90af8-cb8f-49bc-b88c-71cfa17dbb2b)
  )

  (global_label "LT1930_FB" (shape input) (at 192.405 98.425 0) (fields_autoplaced)
    (effects (font (size 1.27 1.27)) (justify left))
    (uuid 1facef11-2497-47cb-9541-bf3a4427e92a)
    (property "Intersheetrefs" "${INTERSHEET_REFS}" (at 205.4707 98.425 0)
      (effects (font (size 1.27 1.27)) (justify left) hide)
    )
  )
  (global_label "LT1930_FB_2" (shape input) (at 97.79 77.47 90) (fields_autoplaced)
    (effects (font (size 1.27 1.27)) (justify left))
    (uuid 582e7852-2ce5-4644-b4f8-950f56157e97)
    (property "Intersheetrefs" "${INTERSHEET_REFS}" (at 97.79 62.2272 90)
      (effects (font (size 1.27 1.27)) (justify left) hide)
    )
  )
  (global_label "LT1930_FB_3" (shape input) (at 164.465 109.22 180) (fields_autoplaced)
    (effects (font (size 1.27 1.27)) (justify right))
    (uuid 7e1c0d62-89a0-4cd1-8aeb-3e5f7112977c)
    (property "Intersheetrefs" "${INTERSHEET_REFS}" (at 149.2222 109.22 0)
      (effects (font (size 1.27 1.27)) (justify right) hide)
    )
  )
  (global_label "LT1930_FB_2" (shape input) (at 164.465 106.68 180) (fields_autoplaced)
    (effects (font (size 1.27 1.27)) (justify right))
    (uuid 97e588de-fe1e-4f7a-9aba-0b2bf830c708)
    (property "Intersheetrefs" "${INTERSHEET_REFS}" (at 149.2222 106.68 0)
      (effects (font (size 1.27 1.27)) (justify right) hide)
    )
  )
  (global_label "LT1930_FB" (shape input) (at 216.535 83.82 0) (fields_autoplaced)
    (effects (font (size 1.27 1.27)) (justify left))
    (uuid ac018684-a5c9-4624-a4a6-ff1531b60f55)
    (property "Intersheetrefs" "${INTERSHEET_REFS}" (at 229.6007 83.82 0)
      (effects (font (size 1.27 1.27)) (justify left) hide)
    )
  )
  (global_label "LT1930_FB_3" (shape input) (at 74.93 77.47 90) (fields_autoplaced)
    (effects (font (size 1.27 1.27)) (justify left))
    (uuid e940a22b-ef4d-434e-adf5-5aa48b3345e4)
    (property "Intersheetrefs" "${INTERSHEET_REFS}" (at 74.93 62.2272 90)
      (effects (font (size 1.27 1.27)) (justify left) hide)
    )
  )
  (global_label "LT1930_FB_1" (shape input) (at 123.19 77.47 90) (fields_autoplaced)
    (effects (font (size 1.27 1.27)) (justify left))
    (uuid f7242c63-a21c-451c-89b0-35af4a099964)
    (property "Intersheetrefs" "${INTERSHEET_REFS}" (at 123.19 62.2272 90)
      (effects (font (size 1.27 1.27)) (justify left) hide)
    )
  )
  (global_label "LT1930_FB_1" (shape input) (at 164.465 104.14 180) (fields_autoplaced)
    (effects (font (size 1.27 1.27)) (justify right))
    (uuid fdd4128f-fa76-4387-8a96-e52fbd9d1081)
    (property "Intersheetrefs" "${INTERSHEET_REFS}" (at 149.2222 104.14 0)
      (effects (font (size 1.27 1.27)) (justify right) hide)
    )
  )

  (hierarchical_label "5V-IN" (shape input) (at 215.9 71.755 0) (fields_autoplaced)
    (effects (font (size 1.27 1.27)) (justify left))
    (uuid 09a9ac12-4c90-446a-b913-77608be11849)
  )
  (hierarchical_label "100V" (shape input) (at 69.85 78.74 180) (fields_autoplaced)
    (effects (font (size 1.27 1.27)) (justify right))
    (uuid 45651e35-4417-4c10-8240-a8bf66d5dfe5)
  )

  (symbol (lib_id "power:GND") (at 214.63 92.71 0) (unit 1)
    (in_bom yes) (on_board yes) (dnp no)
    (uuid 03291831-401a-45b5-95fe-b1d0f2a9f4db)
    (property "Reference" "#PWR011" (at 214.63 99.06 0)
      (effects (font (size 1.27 1.27)) hide)
    )
    (property "Value" "GND" (at 214.63 96.52 0)
      (effects (font (size 1.27 1.27)))
    )
    (property "Footprint" "" (at 214.63 92.71 0)
      (effects (font (size 1.27 1.27)) hide)
    )
    (property "Datasheet" "" (at 214.63 92.71 0)
      (effects (font (size 1.27 1.27)) hide)
    )
    (pin "1" (uuid 4936d9bb-c797-410a-970e-70d8b8fdc172))
    (instances
      (project "HV-bias-gen"
        (path "/3d5f2864-1fb5-4f02-896d-2a9dfefaff39"
          (reference "#PWR011") (unit 1)
        )
        (path "/3d5f2864-1fb5-4f02-896d-2a9dfefaff39/17042029-9b10-4267-af17-b285e3d0949f"
          (reference "#PWR021") (unit 1)
        )
      )
    )
  )

  (symbol (lib_id "Jumper:SolderJumper_2_Open") (at 168.91 106.68 0) (unit 1)
    (in_bom yes) (on_board yes) (dnp no)
    (uuid 11e73809-3aaf-4189-a6a7-c814430db19a)
    (property "Reference" "JP?" (at 165.735 116.84 0)
      (effects (font (size 1.27 1.27)))
    )
    (property "Value" "FB_sel" (at 171.45 116.84 0)
      (effects (font (size 1.27 1.27)))
    )
    (property "Footprint" "Jumper:SolderJumper-2_P1.3mm_Open_RoundedPad1.0x1.5mm" (at 168.91 106.68 0)
      (effects (font (size 1.27 1.27)) hide)
    )
    (property "Datasheet" "~" (at 168.91 106.68 0)
      (effects (font (size 1.27 1.27)) hide)
    )
    (pin "1" (uuid f8df60eb-da66-45ee-9027-91ff69978812))
    (pin "2" (uuid 78329b00-d34c-4fea-9439-c9b2b85a1b4a))
    (instances
      (project "HV-bias-gen"
        (path "/3d5f2864-1fb5-4f02-896d-2a9dfefaff39"
          (reference "JP?") (unit 1)
        )
        (path "/3d5f2864-1fb5-4f02-896d-2a9dfefaff39/0f524e33-692a-4961-8ad0-e97924f26470"
          (reference "JP?") (unit 1)
        )
        (path "/3d5f2864-1fb5-4f02-896d-2a9dfefaff39/17042029-9b10-4267-af17-b285e3d0949f"
          (reference "JP10") (unit 1)
        )
      )
    )
  )

  (symbol (lib_id "power:GND") (at 163.83 91.44 0) (unit 1)
    (in_bom yes) (on_board yes) (dnp no)
    (uuid 1233edaa-6fc2-46b4-98dd-e760eb9e8e92)
    (property "Reference" "#PWR011" (at 163.83 97.79 0)
      (effects (font (size 1.27 1.27)) hide)
    )
    (property "Value" "GND" (at 163.83 95.25 0)
      (effects (font (size 1.27 1.27)))
    )
    (property "Footprint" "" (at 163.83 91.44 0)
      (effects (font (size 1.27 1.27)) hide)
    )
    (property "Datasheet" "" (at 163.83 91.44 0)
      (effects (font (size 1.27 1.27)) hide)
    )
    (pin "1" (uuid 81431f66-b8d9-476d-af8e-a5d417a1fd51))
    (instances
      (project "HV-bias-gen"
        (path "/3d5f2864-1fb5-4f02-896d-2a9dfefaff39"
          (reference "#PWR011") (unit 1)
        )
        (path "/3d5f2864-1fb5-4f02-896d-2a9dfefaff39/17042029-9b10-4267-af17-b285e3d0949f"
          (reference "#PWR020") (unit 1)
        )
      )
    )
  )

  (symbol (lib_id "power:GND") (at 198.755 105.41 0) (unit 1)
    (in_bom yes) (on_board yes) (dnp no)
    (uuid 21da08f1-8815-4a2c-9bdd-d137b170d22a)
    (property "Reference" "#PWR011" (at 198.755 111.76 0)
      (effects (font (size 1.27 1.27)) hide)
    )
    (property "Value" "GND" (at 198.755 109.22 0)
      (effects (font (size 1.27 1.27)))
    )
    (property "Footprint" "" (at 198.755 105.41 0)
      (effects (font (size 1.27 1.27)) hide)
    )
    (property "Datasheet" "" (at 198.755 105.41 0)
      (effects (font (size 1.27 1.27)) hide)
    )
    (pin "1" (uuid 36cfbf82-d1c0-4b96-b69c-ce8c050ee4be))
    (instances
      (project "HV-bias-gen"
        (path "/3d5f2864-1fb5-4f02-896d-2a9dfefaff39"
          (reference "#PWR011") (unit 1)
        )
        (path "/3d5f2864-1fb5-4f02-896d-2a9dfefaff39/17042029-9b10-4267-af17-b285e3d0949f"
          (reference "#PWR022") (unit 1)
        )
      )
    )
  )

  (symbol (lib_id "Device:L_Small") (at 109.855 78.74 90) (unit 1)
    (in_bom yes) (on_board yes) (dnp no)
    (uuid 232f7d92-ba30-41e9-9fa9-a2ffdbf12cb9)
    (property "Reference" "L?" (at 107.95 76.835 90)
      (effects (font (size 1.27 1.27)))
    )
    (property "Value" "6.8uH" (at 109.855 80.01 90)
      (effects (font (size 1.27 1.27)))
    )
    (property "Footprint" "Inductor_SMD:L_Abracon_ASPI-4030S" (at 109.855 78.74 0)
      (effects (font (size 1.27 1.27)) hide)
    )
    (property "Datasheet" "~" (at 109.855 78.74 0)
      (effects (font (size 1.27 1.27)) hide)
    )
    (pin "1" (uuid 349cd7c3-fcf3-4f6d-aaa1-264357f4a557))
    (pin "2" (uuid 7f7edaa9-a2a6-401c-96fc-b906d13e64d4))
    (instances
      (project "HV-bias-gen"
        (path "/3d5f2864-1fb5-4f02-896d-2a9dfefaff39"
          (reference "L?") (unit 1)
        )
        (path "/3d5f2864-1fb5-4f02-896d-2a9dfefaff39/0f524e33-692a-4961-8ad0-e97924f26470"
          (reference "L?") (unit 1)
        )
        (path "/3d5f2864-1fb5-4f02-896d-2a9dfefaff39/17042029-9b10-4267-af17-b285e3d0949f"
          (reference "L5") (unit 1)
        )
      )
    )
  )

  (symbol (lib_id "power:GND") (at 171.45 91.44 0) (unit 1)
    (in_bom yes) (on_board yes) (dnp no)
    (uuid 26ab89ea-ded6-40ce-b3f0-a05750baead4)
    (property "Reference" "#PWR011" (at 171.45 97.79 0)
      (effects (font (size 1.27 1.27)) hide)
    )
    (property "Value" "GND" (at 171.45 95.25 0)
      (effects (font (size 1.27 1.27)))
    )
    (property "Footprint" "" (at 171.45 91.44 0)
      (effects (font (size 1.27 1.27)) hide)
    )
    (property "Datasheet" "" (at 171.45 91.44 0)
      (effects (font (size 1.27 1.27)) hide)
    )
    (pin "1" (uuid 03e5040a-f925-446a-9001-620f5503063e))
    (instances
      (project "HV-bias-gen"
        (path "/3d5f2864-1fb5-4f02-896d-2a9dfefaff39"
          (reference "#PWR011") (unit 1)
        )
        (path "/3d5f2864-1fb5-4f02-896d-2a9dfefaff39/17042029-9b10-4267-af17-b285e3d0949f"
          (reference "#PWR019") (unit 1)
        )
      )
    )
  )

  (symbol (lib_id "Device:R_Small") (at 153.67 78.74 90) (unit 1)
    (in_bom yes) (on_board yes) (dnp no)
    (uuid 2cd26252-460d-4632-a048-829edd0145f9)
    (property "Reference" "R?" (at 153.67 76.2 90)
      (effects (font (size 1.27 1.27)))
    )
    (property "Value" "10" (at 153.035 80.645 90)
      (effects (font (size 1.27 1.27)))
    )
    (property "Footprint" "Resistor_SMD:R_0805_2012Metric_Pad1.20x1.40mm_HandSolder" (at 153.67 78.74 0)
      (effects (font (size 1.27 1.27)) hide)
    )
    (property "Datasheet" "~" (at 153.67 78.74 0)
      (effects (font (size 1.27 1.27)) hide)
    )
    (pin "1" (uuid af51833f-0666-4a7e-9245-ea3eed56a3af))
    (pin "2" (uuid a14d7958-ed47-4c85-8bcb-ab1a5a48570e))
    (instances
      (project "HV-bias-gen"
        (path "/3d5f2864-1fb5-4f02-896d-2a9dfefaff39"
          (reference "R?") (unit 1)
        )
        (path "/3d5f2864-1fb5-4f02-896d-2a9dfefaff39/0f524e33-692a-4961-8ad0-e97924f26470"
          (reference "R?") (unit 1)
        )
        (path "/3d5f2864-1fb5-4f02-896d-2a9dfefaff39/17042029-9b10-4267-af17-b285e3d0949f"
          (reference "R11") (unit 1)
        )
      )
    )
  )

  (symbol (lib_id "Device:C_Small") (at 84.455 90.805 0) (unit 1)
    (in_bom yes) (on_board yes) (dnp no)
    (uuid 2e505ac3-4a4f-4b9d-aaa4-367c888a6dd7)
    (property "Reference" "C?" (at 78.105 92.71 0)
      (effects (font (size 1.27 1.27)) (justify left))
    )
    (property "Value" "10uF" (at 78.105 94.615 0)
      (effects (font (size 1.27 1.27)) (justify left))
    )
    (property "Footprint" "Capacitor_SMD:C_1210_3225Metric_Pad1.33x2.70mm_HandSolder" (at 84.455 90.805 0)
      (effects (font (size 1.27 1.27)) hide)
    )
    (property "Datasheet" "~" (at 84.455 90.805 0)
      (effects (font (size 1.27 1.27)) hide)
    )
    (pin "1" (uuid 797b581a-8d77-4e43-bf02-e2c283fb70b3))
    (pin "2" (uuid 13a6811c-5577-491f-8125-0156d1061ceb))
    (instances
      (project "HV-bias-gen"
        (path "/3d5f2864-1fb5-4f02-896d-2a9dfefaff39"
          (reference "C?") (unit 1)
        )
        (path "/3d5f2864-1fb5-4f02-896d-2a9dfefaff39/0f524e33-692a-4961-8ad0-e97924f26470"
          (reference "C?") (unit 1)
        )
        (path "/3d5f2864-1fb5-4f02-896d-2a9dfefaff39/17042029-9b10-4267-af17-b285e3d0949f"
          (reference "C31") (unit 1)
        )
      )
    )
  )

  (symbol (lib_id "Device:D_Schottky_Small") (at 139.7 78.74 0) (unit 1)
    (in_bom yes) (on_board yes) (dnp no)
    (uuid 2fab3705-7c64-4c8d-87b3-ea1c5a6f4f5e)
    (property "Reference" "D?" (at 139.7 76.2 0)
      (effects (font (size 1.27 1.27)))
    )
    (property "Value" "PMEG6010" (at 127.635 90.805 0)
      (effects (font (size 1.27 1.27)))
    )
    (property "Footprint" "Diode_SMD:D_SOD-323_HandSoldering" (at 139.7 78.74 90)
      (effects (font (size 1.27 1.27)) hide)
    )
    (property "Datasheet" "~" (at 139.7 78.74 90)
      (effects (font (size 1.27 1.27)) hide)
    )
    (pin "1" (uuid 3a908905-b8c8-4cb4-ac29-dc9d1dd89bb7))
    (pin "2" (uuid e000be06-38a9-421e-ac02-abdc67e3744e))
    (instances
      (project "HV-bias-gen"
        (path "/3d5f2864-1fb5-4f02-896d-2a9dfefaff39"
          (reference "D?") (unit 1)
        )
        (path "/3d5f2864-1fb5-4f02-896d-2a9dfefaff39/0f524e33-692a-4961-8ad0-e97924f26470"
          (reference "D?") (unit 1)
        )
        (path "/3d5f2864-1fb5-4f02-896d-2a9dfefaff39/17042029-9b10-4267-af17-b285e3d0949f"
          (reference "D12") (unit 1)
        )
      )
    )
  )

  (symbol (lib_id "Device:C_Small") (at 153.67 71.755 90) (unit 1)
    (in_bom yes) (on_board yes) (dnp no)
    (uuid 3b132c1a-a2bd-4638-a055-8d103ac87716)
    (property "Reference" "C?" (at 156.845 70.485 90)
      (effects (font (size 1.27 1.27)) (justify left))
    )
    (property "Value" "220nF" (at 164.465 70.485 90)
      (effects (font (size 1.27 1.27)) (justify left))
    )
    (property "Footprint" "Capacitor_SMD:C_0805_2012Metric_Pad1.18x1.45mm_HandSolder" (at 153.67 71.755 0)
      (effects (font (size 1.27 1.27)) hide)
    )
    (property "Datasheet" "~" (at 153.67 71.755 0)
      (effects (font (size 1.27 1.27)) hide)
    )
    (pin "1" (uuid 7f8fbaf1-4ec8-4022-b64e-9fde4188c4a9))
    (pin "2" (uuid 7a36440b-61e5-46e9-9ca9-d59c322c4d2c))
    (instances
      (project "HV-bias-gen"
        (path "/3d5f2864-1fb5-4f02-896d-2a9dfefaff39"
          (reference "C?") (unit 1)
        )
        (path "/3d5f2864-1fb5-4f02-896d-2a9dfefaff39/0f524e33-692a-4961-8ad0-e97924f26470"
          (reference "C?") (unit 1)
        )
        (path "/3d5f2864-1fb5-4f02-896d-2a9dfefaff39/17042029-9b10-4267-af17-b285e3d0949f"
          (reference "C38") (unit 1)
        )
      )
    )
  )

  (symbol (lib_id "Device:D_Schottky_Small") (at 167.64 78.74 0) (unit 1)
    (in_bom yes) (on_board yes) (dnp no)
    (uuid 4079e853-d9ee-46ab-87dc-881d9a7e80ad)
    (property "Reference" "D?" (at 167.64 76.2 0)
      (effects (font (size 1.27 1.27)))
    )
    (property "Value" "PMEG6010" (at 167.64 86.36 90)
      (effects (font (size 1.27 1.27)))
    )
    (property "Footprint" "Diode_SMD:D_SOD-323_HandSoldering" (at 167.64 78.74 90)
      (effects (font (size 1.27 1.27)) hide)
    )
    (property "Datasheet" "~" (at 167.64 78.74 90)
      (effects (font (size 1.27 1.27)) hide)
    )
    (pin "1" (uuid eddc9c39-012d-4236-b080-74a90ffcb9d6))
    (pin "2" (uuid f572d107-580f-4b66-b588-8bd89e5dbaa3))
    (instances
      (project "HV-bias-gen"
        (path "/3d5f2864-1fb5-4f02-896d-2a9dfefaff39"
          (reference "D?") (unit 1)
        )
        (path "/3d5f2864-1fb5-4f02-896d-2a9dfefaff39/0f524e33-692a-4961-8ad0-e97924f26470"
          (reference "D?") (unit 1)
        )
        (path "/3d5f2864-1fb5-4f02-896d-2a9dfefaff39/17042029-9b10-4267-af17-b285e3d0949f"
          (reference "D15") (unit 1)
        )
      )
    )
  )

  (symbol (lib_id "Device:C_Polarized_Small") (at 180.975 109.22 90) (mirror x) (unit 1)
    (in_bom yes) (on_board yes) (dnp no)
    (uuid 40b245ae-9358-41a3-8c56-8e50dd091d68)
    (property "Reference" "C?" (at 179.07 112.395 90)
      (effects (font (size 1.27 1.27)))
    )
    (property "Value" "220nF" (at 180.975 114.3 90)
      (effects (font (size 1.27 1.27)))
    )
    (property "Footprint" "Capacitor_SMD:C_1206_3216Metric_Pad1.33x1.80mm_HandSolder" (at 180.975 109.22 0)
      (effects (font (size 1.27 1.27)) hide)
    )
    (property "Datasheet" "~" (at 180.975 109.22 0)
      (effects (font (size 1.27 1.27)) hide)
    )
    (pin "1" (uuid 5c8dc6fc-b491-41b7-85cd-41d61990f6c8))
    (pin "2" (uuid c217059f-d2c4-4808-8900-fed949238cf7))
    (instances
      (project "HV-bias-gen"
        (path "/3d5f2864-1fb5-4f02-896d-2a9dfefaff39"
          (reference "C?") (unit 1)
        )
        (path "/3d5f2864-1fb5-4f02-896d-2a9dfefaff39/0f524e33-692a-4961-8ad0-e97924f26470"
          (reference "C?") (unit 1)
        )
        (path "/3d5f2864-1fb5-4f02-896d-2a9dfefaff39/17042029-9b10-4267-af17-b285e3d0949f"
          (reference "C41") (unit 1)
        )
      )
    )
  )

  (symbol (lib_id "Device:D_Schottky_Small") (at 127 78.74 180) (unit 1)
    (in_bom yes) (on_board yes) (dnp no)
    (uuid 42284ffb-1ea5-49d0-9508-2e9d334471df)
    (property "Reference" "D?" (at 127 76.2 0)
      (effects (font (size 1.27 1.27)))
    )
    (property "Value" "PMEG6010" (at 127.635 88.9 0)
      (effects (font (size 1.27 1.27)))
    )
    (property "Footprint" "Diode_SMD:D_SOD-323_HandSoldering" (at 127 78.74 90)
      (effects (font (size 1.27 1.27)) hide)
    )
    (property "Datasheet" "~" (at 127 78.74 90)
      (effects (font (size 1.27 1.27)) hide)
    )
    (pin "1" (uuid 366869e9-790b-498e-bb36-cc19194977da))
    (pin "2" (uuid 133e1c0a-62b7-489f-b6bb-f658a05b0196))
    (instances
      (project "HV-bias-gen"
        (path "/3d5f2864-1fb5-4f02-896d-2a9dfefaff39"
          (reference "D?") (unit 1)
        )
        (path "/3d5f2864-1fb5-4f02-896d-2a9dfefaff39/0f524e33-692a-4961-8ad0-e97924f26470"
          (reference "D?") (unit 1)
        )
        (path "/3d5f2864-1fb5-4f02-896d-2a9dfefaff39/17042029-9b10-4267-af17-b285e3d0949f"
          (reference "D11") (unit 1)
        )
      )
    )
  )

  (symbol (lib_id "Device:C_Small") (at 74.93 83.82 0) (unit 1)
    (in_bom yes) (on_board yes) (dnp no)
    (uuid 49a097b0-496f-4a83-8838-439b4fa8e008)
    (property "Reference" "C?" (at 75.565 81.915 0)
      (effects (font (size 1.27 1.27)) (justify left))
    )
    (property "Value" "10uF" (at 75.565 85.725 0)
      (effects (font (size 1.27 1.27)) (justify left))
    )
    (property "Footprint" "Capacitor_SMD:C_1210_3225Metric_Pad1.33x2.70mm_HandSolder" (at 74.93 83.82 0)
      (effects (font (size 1.27 1.27)) hide)
    )
    (property "Datasheet" "~" (at 74.93 83.82 0)
      (effects (font (size 1.27 1.27)) hide)
    )
    (pin "1" (uuid 6d9c9135-951f-4054-ab38-4c9a71ec1e72))
    (pin "2" (uuid 79a56fe0-ebc1-49e2-b524-942b6421d866))
    (instances
      (project "HV-bias-gen"
        (path "/3d5f2864-1fb5-4f02-896d-2a9dfefaff39"
          (reference "C?") (unit 1)
        )
        (path "/3d5f2864-1fb5-4f02-896d-2a9dfefaff39/0f524e33-692a-4961-8ad0-e97924f26470"
          (reference "C?") (unit 1)
        )
        (path "/3d5f2864-1fb5-4f02-896d-2a9dfefaff39/17042029-9b10-4267-af17-b285e3d0949f"
          (reference "C30") (unit 1)
        )
      )
    )
  )

  (symbol (lib_id "LT1930ES5TRMPBF:LT1930ES5TRMPBF") (at 172.72 78.74 0) (unit 1)
    (in_bom yes) (on_board yes) (dnp no)
    (uuid 5736129d-af03-4ae6-ab26-403a20354dec)
    (property "Reference" "U?" (at 181.61 90.17 0)
      (effects (font (size 1.27 1.27)))
    )
    (property "Value" "LT1930ES5TRMPBF" (at 196.85 90.17 0)
      (effects (font (size 1.27 1.27)))
    )
    (property "Footprint" "Package_TO_SOT_SMD:TSOT-23-5_HandSoldering" (at 172.72 78.74 0)
      (effects (font (size 1.27 1.27)) (justify bottom) hide)
    )
    (property "Datasheet" "" (at 172.72 78.74 0)
      (effects (font (size 1.27 1.27)) hide)
    )
    (property "DIGIKEY_PART_NUMBER" "LT1930ES5#TRMPBFTRND" (at 172.72 78.74 0)
      (effects (font (size 1.27 1.27)) (justify bottom) hide)
    )
    (property "MF" "Analog Devices" (at 172.72 78.74 0)
      (effects (font (size 1.27 1.27)) (justify bottom) hide)
    )
    (property "VENDOR" "Linear Technology" (at 172.72 78.74 0)
      (effects (font (size 1.27 1.27)) (justify bottom) hide)
    )
    (property "Description" "\nBoost, Flyback, SEPIC Switching Regulator IC Positive Adjustable 2.45V 1 Output 1A (Switch) SOT-23-5 Thin, TSOT-23-5\n" (at 172.72 78.74 0)
      (effects (font (size 1.27 1.27)) (justify bottom) hide)
    )
    (property "COPYRIGHT" "Copyright C 2016 Accelerated Designs. All rights reserved" (at 172.72 78.74 0)
      (effects (font (size 1.27 1.27)) (justify bottom) hide)
    )
    (property "Package" "TSOT-23 Linear Technology" (at 172.72 78.74 0)
      (effects (font (size 1.27 1.27)) (justify bottom) hide)
    )
    (property "Price" "None" (at 172.72 78.74 0)
      (effects (font (size 1.27 1.27)) (justify bottom) hide)
    )
    (property "Check_prices" "https://www.snapeda.com/parts/LT1930ES5%23TRMPBF/Analog+Devices/view-part/?ref=eda" (at 172.72 78.74 0)
      (effects (font (size 1.27 1.27)) (justify bottom) hide)
    )
    (property "SnapEDA_Link" "https://www.snapeda.com/parts/LT1930ES5%23TRMPBF/Analog+Devices/view-part/?ref=snap" (at 172.72 78.74 0)
      (effects (font (size 1.27 1.27)) (justify bottom) hide)
    )
    (property "MP" "LT1930ES5#TRMPBF" (at 172.72 78.74 0)
      (effects (font (size 1.27 1.27)) (justify bottom) hide)
    )
    (property "Purchase-URL" "https://www.snapeda.com/api/url_track_click_mouser/?unipart_id=587119&manufacturer=Analog Devices&part_name=LT1930ES5#TRMPBF&search_term=None" (at 172.72 78.74 0)
      (effects (font (size 1.27 1.27)) (justify bottom) hide)
    )
    (property "Availability" "Not in stock" (at 172.72 78.74 0)
      (effects (font (size 1.27 1.27)) (justify bottom) hide)
    )
    (property "MANUFACTURER_PART_NUMBER" "LT1930ES5#TRMPBF" (at 172.72 78.74 0)
      (effects (font (size 1.27 1.27)) (justify bottom) hide)
    )
    (pin "1" (uuid 98a6a9f4-0c0b-4d80-a261-b69736729e18))
    (pin "2" (uuid e79a8dd0-f3bd-45ec-a044-313ed36cd715))
    (pin "3" (uuid 0a4e04a3-6c4a-4f04-8bf4-bf357c19f7d9))
    (pin "4" (uuid 20a69c08-51a1-4642-9f0e-51bedf7ade3a))
    (pin "5" (uuid 60ad8e57-99f9-41dc-afc1-10189e23254a))
    (instances
      (project "HV-bias-gen"
        (path "/3d5f2864-1fb5-4f02-896d-2a9dfefaff39"
          (reference "U?") (unit 1)
        )
        (path "/3d5f2864-1fb5-4f02-896d-2a9dfefaff39/0f524e33-692a-4961-8ad0-e97924f26470"
          (reference "U?") (unit 1)
        )
        (path "/3d5f2864-1fb5-4f02-896d-2a9dfefaff39/17042029-9b10-4267-af17-b285e3d0949f"
          (reference "U6") (unit 1)
        )
      )
    )
  )

  (symbol (lib_id "power:GND") (at 100.33 88.265 0) (unit 1)
    (in_bom yes) (on_board yes) (dnp no)
    (uuid 5a0b211c-0eae-4ef0-b701-a590b9d58bd8)
    (property "Reference" "#PWR011" (at 100.33 94.615 0)
      (effects (font (size 1.27 1.27)) hide)
    )
    (property "Value" "GND" (at 100.33 92.075 0)
      (effects (font (size 1.27 1.27)))
    )
    (property "Footprint" "" (at 100.33 88.265 0)
      (effects (font (size 1.27 1.27)) hide)
    )
    (property "Datasheet" "" (at 100.33 88.265 0)
      (effects (font (size 1.27 1.27)) hide)
    )
    (pin "1" (uuid 08e3fb07-34b6-4ed2-b2be-9be8cbe5dd09))
    (instances
      (project "HV-bias-gen"
        (path "/3d5f2864-1fb5-4f02-896d-2a9dfefaff39"
          (reference "#PWR011") (unit 1)
        )
        (path "/3d5f2864-1fb5-4f02-896d-2a9dfefaff39/17042029-9b10-4267-af17-b285e3d0949f"
          (reference "#PWR015") (unit 1)
        )
      )
    )
  )

  (symbol (lib_id "Jumper:SolderJumper_2_Open") (at 168.91 109.22 0) (unit 1)
    (in_bom yes) (on_board yes) (dnp no)
    (uuid 5b7a6001-2d87-40cb-95a1-d91d85f52463)
    (property "Reference" "JP?" (at 165.735 119.38 0)
      (effects (font (size 1.27 1.27)))
    )
    (property "Value" "FB_sel" (at 171.45 119.38 0)
      (effects (font (size 1.27 1.27)))
    )
    (property "Footprint" "Jumper:SolderJumper-2_P1.3mm_Open_RoundedPad1.0x1.5mm" (at 168.91 109.22 0)
      (effects (font (size 1.27 1.27)) hide)
    )
    (property "Datasheet" "~" (at 168.91 109.22 0)
      (effects (font (size 1.27 1.27)) hide)
    )
    (pin "1" (uuid 464f2f89-6a5c-4cff-a9ef-b72fec3db531))
    (pin "2" (uuid 797b256c-c9c8-4e45-a880-6464a155e502))
    (instances
      (project "HV-bias-gen"
        (path "/3d5f2864-1fb5-4f02-896d-2a9dfefaff39"
          (reference "JP?") (unit 1)
        )
        (path "/3d5f2864-1fb5-4f02-896d-2a9dfefaff39/0f524e33-692a-4961-8ad0-e97924f26470"
          (reference "JP?") (unit 1)
        )
        (path "/3d5f2864-1fb5-4f02-896d-2a9dfefaff39/17042029-9b10-4267-af17-b285e3d0949f"
          (reference "JP11") (unit 1)
        )
      )
    )
  )

  (symbol (lib_id "power:GND") (at 115.57 88.265 0) (unit 1)
    (in_bom yes) (on_board yes) (dnp no)
    (uuid 6ac3c426-1a25-4ff0-aaed-4f830707da39)
    (property "Reference" "#PWR011" (at 115.57 94.615 0)
      (effects (font (size 1.27 1.27)) hide)
    )
    (property "Value" "GND" (at 115.57 92.075 0)
      (effects (font (size 1.27 1.27)))
    )
    (property "Footprint" "" (at 115.57 88.265 0)
      (effects (font (size 1.27 1.27)) hide)
    )
    (property "Datasheet" "" (at 115.57 88.265 0)
      (effects (font (size 1.27 1.27)) hide)
    )
    (pin "1" (uuid c252fdbd-7f7f-42ee-b64d-12de4ddf9a08))
    (instances
      (project "HV-bias-gen"
        (path "/3d5f2864-1fb5-4f02-896d-2a9dfefaff39"
          (reference "#PWR011") (unit 1)
        )
        (path "/3d5f2864-1fb5-4f02-896d-2a9dfefaff39/17042029-9b10-4267-af17-b285e3d0949f"
          (reference "#PWR017") (unit 1)
        )
      )
    )
  )

  (symbol (lib_id "power:GND") (at 120.015 88.265 0) (unit 1)
    (in_bom yes) (on_board yes) (dnp no)
    (uuid 6e6c1e01-0b96-4879-b14e-7b41d2d15598)
    (property "Reference" "#PWR011" (at 120.015 94.615 0)
      (effects (font (size 1.27 1.27)) hide)
    )
    (property "Value" "GND" (at 120.015 92.075 0)
      (effects (font (size 1.27 1.27)))
    )
    (property "Footprint" "" (at 120.015 88.265 0)
      (effects (font (size 1.27 1.27)) hide)
    )
    (property "Datasheet" "" (at 120.015 88.265 0)
      (effects (font (size 1.27 1.27)) hide)
    )
    (pin "1" (uuid f5342e9b-5827-4172-b68a-34666e8a0025))
    (instances
      (project "HV-bias-gen"
        (path "/3d5f2864-1fb5-4f02-896d-2a9dfefaff39"
          (reference "#PWR011") (unit 1)
        )
        (path "/3d5f2864-1fb5-4f02-896d-2a9dfefaff39/17042029-9b10-4267-af17-b285e3d0949f"
          (reference "#PWR018") (unit 1)
        )
      )
    )
  )

  (symbol (lib_id "power:GND") (at 88.9 94.615 0) (unit 1)
    (in_bom yes) (on_board yes) (dnp no)
    (uuid 6fc6f143-0e41-42bd-8898-41a90252b278)
    (property "Reference" "#PWR011" (at 88.9 100.965 0)
      (effects (font (size 1.27 1.27)) hide)
    )
    (property "Value" "GND" (at 88.9 98.425 0)
      (effects (font (size 1.27 1.27)))
    )
    (property "Footprint" "" (at 88.9 94.615 0)
      (effects (font (size 1.27 1.27)) hide)
    )
    (property "Datasheet" "" (at 88.9 94.615 0)
      (effects (font (size 1.27 1.27)) hide)
    )
    (pin "1" (uuid 24aa6aef-9d20-4dff-9b06-0736c0d7b9c1))
    (instances
      (project "HV-bias-gen"
        (path "/3d5f2864-1fb5-4f02-896d-2a9dfefaff39"
          (reference "#PWR011") (unit 1)
        )
        (path "/3d5f2864-1fb5-4f02-896d-2a9dfefaff39/17042029-9b10-4267-af17-b285e3d0949f"
          (reference "#PWR014") (unit 1)
        )
      )
    )
  )

  (symbol (lib_id "Device:R_Small") (at 194.945 104.14 90) (unit 1)
    (in_bom yes) (on_board yes) (dnp no)
    (uuid 70351a9e-ba4d-4198-a235-ce63edcbe58b)
    (property "Reference" "R?" (at 194.945 101.6 90)
      (effects (font (size 1.27 1.27)))
    )
    (property "Value" "1k" (at 194.31 106.045 90)
      (effects (font (size 1.27 1.27)))
    )
    (property "Footprint" "Resistor_SMD:R_0805_2012Metric_Pad1.20x1.40mm_HandSolder" (at 194.945 104.14 0)
      (effects (font (size 1.27 1.27)) hide)
    )
    (property "Datasheet" "~" (at 194.945 104.14 0)
      (effects (font (size 1.27 1.27)) hide)
    )
    (pin "1" (uuid 0aa569f6-39c8-4cd9-aec3-91dd1f2d78f6))
    (pin "2" (uuid b9513bf6-36f6-486d-8982-701b68619987))
    (instances
      (project "HV-bias-gen"
        (path "/3d5f2864-1fb5-4f02-896d-2a9dfefaff39"
          (reference "R?") (unit 1)
        )
        (path "/3d5f2864-1fb5-4f02-896d-2a9dfefaff39/0f524e33-692a-4961-8ad0-e97924f26470"
          (reference "R?") (unit 1)
        )
        (path "/3d5f2864-1fb5-4f02-896d-2a9dfefaff39/17042029-9b10-4267-af17-b285e3d0949f"
          (reference "R14") (unit 1)
        )
      )
    )
  )

  (symbol (lib_id "power:GND") (at 84.455 94.615 0) (unit 1)
    (in_bom yes) (on_board yes) (dnp no)
    (uuid 90e6d647-baa2-408f-b81b-ebb663da0435)
    (property "Reference" "#PWR011" (at 84.455 100.965 0)
      (effects (font (size 1.27 1.27)) hide)
    )
    (property "Value" "GND" (at 84.455 98.425 0)
      (effects (font (size 1.27 1.27)))
    )
    (property "Footprint" "" (at 84.455 94.615 0)
      (effects (font (size 1.27 1.27)) hide)
    )
    (property "Datasheet" "" (at 84.455 94.615 0)
      (effects (font (size 1.27 1.27)) hide)
    )
    (pin "1" (uuid 8b662ea7-62a8-453d-9a16-23cdb9886b1b))
    (instances
      (project "HV-bias-gen"
        (path "/3d5f2864-1fb5-4f02-896d-2a9dfefaff39"
          (reference "#PWR011") (unit 1)
        )
        (path "/3d5f2864-1fb5-4f02-896d-2a9dfefaff39/17042029-9b10-4267-af17-b285e3d0949f"
          (reference "#PWR013") (unit 1)
        )
      )
    )
  )

  (symbol (lib_id "Simulation_SPICE:NPN") (at 84.455 81.28 270) (mirror x) (unit 1)
    (in_bom yes) (on_board yes) (dnp no)
    (uuid 97726272-e175-46f9-bd17-499baca8de00)
    (property "Reference" "Q?" (at 84.455 73.66 90)
      (effects (font (size 1.27 1.27)))
    )
    (property "Value" "FMMT497TA" (at 84.455 76.2 90)
      (effects (font (size 1.27 1.27)))
    )
    (property "Footprint" "Package_TO_SOT_SMD:SOT-23_Handsoldering" (at 84.455 17.78 0)
      (effects (font (size 1.27 1.27)) hide)
    )
    (property "Datasheet" "~" (at 84.455 17.78 0)
      (effects (font (size 1.27 1.27)) hide)
    )
    (property "Sim.Device" "NPN" (at 84.455 81.28 0)
      (effects (font (size 1.27 1.27)) hide)
    )
    (property "Sim.Type" "GUMMELPOON" (at 84.455 81.28 0)
      (effects (font (size 1.27 1.27)) hide)
    )
    (property "Sim.Pins" "1=C 2=B 3=E" (at 84.455 81.28 0)
      (effects (font (size 1.27 1.27)) hide)
    )
    (pin "1" (uuid f1c10733-d63e-492f-9822-cda20d80623f))
    (pin "2" (uuid 3fe8a270-7bfa-46df-be07-38f5ab9deeb0))
    (pin "3" (uuid 61910f07-cc89-480a-b110-220998dd1c30))
    (instances
      (project "HV-bias-gen"
        (path "/3d5f2864-1fb5-4f02-896d-2a9dfefaff39"
          (reference "Q?") (unit 1)
        )
        (path "/3d5f2864-1fb5-4f02-896d-2a9dfefaff39/0f524e33-692a-4961-8ad0-e97924f26470"
          (reference "Q?") (unit 1)
        )
        (path "/3d5f2864-1fb5-4f02-896d-2a9dfefaff39/17042029-9b10-4267-af17-b285e3d0949f"
          (reference "Q3") (unit 1)
        )
      )
    )
  )

  (symbol (lib_id "Device:C_Small") (at 163.83 88.265 0) (unit 1)
    (in_bom yes) (on_board yes) (dnp no)
    (uuid 97ab11e6-5896-44e0-bf60-f8d3db76a5dd)
    (property "Reference" "C?" (at 157.48 88.265 0)
      (effects (font (size 1.27 1.27)) (justify left))
    )
    (property "Value" "10uF" (at 157.48 90.17 0)
      (effects (font (size 1.27 1.27)) (justify left))
    )
    (property "Footprint" "Capacitor_SMD:C_1206_3216Metric_Pad1.33x1.80mm_HandSolder" (at 163.83 88.265 0)
      (effects (font (size 1.27 1.27)) hide)
    )
    (property "Datasheet" "~" (at 163.83 88.265 0)
      (effects (font (size 1.27 1.27)) hide)
    )
    (pin "1" (uuid 06c85020-c2a2-4df2-a0c0-3ecbc8a49ab8))
    (pin "2" (uuid 3466c835-4854-4cdc-88cf-839cc211c29b))
    (instances
      (project "HV-bias-gen"
        (path "/3d5f2864-1fb5-4f02-896d-2a9dfefaff39"
          (reference "C?") (unit 1)
        )
        (path "/3d5f2864-1fb5-4f02-896d-2a9dfefaff39/0f524e33-692a-4961-8ad0-e97924f26470"
          (reference "C?") (unit 1)
        )
        (path "/3d5f2864-1fb5-4f02-896d-2a9dfefaff39/17042029-9b10-4267-af17-b285e3d0949f"
          (reference "C40") (unit 1)
        )
      )
    )
  )

  (symbol (lib_id "Device:C_Small") (at 100.33 83.82 0) (unit 1)
    (in_bom yes) (on_board yes) (dnp no)
    (uuid a88a7eb9-9095-4469-be9c-39013f51139d)
    (property "Reference" "C?" (at 100.33 78.105 90)
      (effects (font (size 1.27 1.27)) (justify left))
    )
    (property "Value" "10uF" (at 100.33 74.295 90)
      (effects (font (size 1.27 1.27)) (justify left))
    )
    (property "Footprint" "Capacitor_SMD:C_1210_3225Metric_Pad1.33x2.70mm_HandSolder" (at 100.33 83.82 0)
      (effects (font (size 1.27 1.27)) hide)
    )
    (property "Datasheet" "~" (at 100.33 83.82 0)
      (effects (font (size 1.27 1.27)) hide)
    )
    (pin "1" (uuid 31f8873d-e35e-4040-b786-eb743e8b4fcf))
    (pin "2" (uuid 64a17905-f648-4930-a9c9-6e6b5424e0fb))
    (instances
      (project "HV-bias-gen"
        (path "/3d5f2864-1fb5-4f02-896d-2a9dfefaff39"
          (reference "C?") (unit 1)
        )
        (path "/3d5f2864-1fb5-4f02-896d-2a9dfefaff39/0f524e33-692a-4961-8ad0-e97924f26470"
          (reference "C?") (unit 1)
        )
        (path "/3d5f2864-1fb5-4f02-896d-2a9dfefaff39/17042029-9b10-4267-af17-b285e3d0949f"
          (reference "C33") (unit 1)
        )
      )
    )
  )

  (symbol (lib_id "power:GND") (at 104.775 88.265 0) (unit 1)
    (in_bom yes) (on_board yes) (dnp no)
    (uuid ab37e9fb-ea28-4a38-815c-dca865ebaae2)
    (property "Reference" "#PWR011" (at 104.775 94.615 0)
      (effects (font (size 1.27 1.27)) hide)
    )
    (property "Value" "GND" (at 104.775 92.075 0)
      (effects (font (size 1.27 1.27)))
    )
    (property "Footprint" "" (at 104.775 88.265 0)
      (effects (font (size 1.27 1.27)) hide)
    )
    (property "Datasheet" "" (at 104.775 88.265 0)
      (effects (font (size 1.27 1.27)) hide)
    )
    (pin "1" (uuid fc16c2eb-fc77-469c-999c-7a74fe837126))
    (instances
      (project "HV-bias-gen"
        (path "/3d5f2864-1fb5-4f02-896d-2a9dfefaff39"
          (reference "#PWR011") (unit 1)
        )
        (path "/3d5f2864-1fb5-4f02-896d-2a9dfefaff39/17042029-9b10-4267-af17-b285e3d0949f"
          (reference "#PWR016") (unit 1)
        )
      )
    )
  )

  (symbol (lib_id "Jumper:SolderJumper_2_Open") (at 168.91 104.14 0) (unit 1)
    (in_bom yes) (on_board yes) (dnp no)
    (uuid ac076c0b-8f4b-4ec4-8a0a-aac471533adb)
    (property "Reference" "JP?" (at 165.735 114.3 0)
      (effects (font (size 1.27 1.27)))
    )
    (property "Value" "FB_sel" (at 171.45 114.3 0)
      (effects (font (size 1.27 1.27)))
    )
    (property "Footprint" "Jumper:SolderJumper-2_P1.3mm_Open_RoundedPad1.0x1.5mm" (at 168.91 104.14 0)
      (effects (font (size 1.27 1.27)) hide)
    )
    (property "Datasheet" "~" (at 168.91 104.14 0)
      (effects (font (size 1.27 1.27)) hide)
    )
    (pin "1" (uuid 327c94c6-0f53-4322-9339-802051528742))
    (pin "2" (uuid 62863d8d-a1e0-494d-94f2-2e1c3a6307ea))
    (instances
      (project "HV-bias-gen"
        (path "/3d5f2864-1fb5-4f02-896d-2a9dfefaff39"
          (reference "JP?") (unit 1)
        )
        (path "/3d5f2864-1fb5-4f02-896d-2a9dfefaff39/0f524e33-692a-4961-8ad0-e97924f26470"
          (reference "JP?") (unit 1)
        )
        (path "/3d5f2864-1fb5-4f02-896d-2a9dfefaff39/17042029-9b10-4267-af17-b285e3d0949f"
          (reference "JP9") (unit 1)
        )
      )
    )
  )

  (symbol (lib_id "Device:C_Small") (at 88.9 90.805 0) (unit 1)
    (in_bom yes) (on_board yes) (dnp no)
    (uuid c5c019c8-a0bf-486d-97c7-a50842e7b979)
    (property "Reference" "C?" (at 89.535 92.71 0)
      (effects (font (size 1.27 1.27)) (justify left))
    )
    (property "Value" "10uF" (at 89.535 94.615 0)
      (effects (font (size 1.27 1.27)) (justify left))
    )
    (property "Footprint" "Capacitor_SMD:C_1210_3225Metric_Pad1.33x2.70mm_HandSolder" (at 88.9 90.805 0)
      (effects (font (size 1.27 1.27)) hide)
    )
    (property "Datasheet" "~" (at 88.9 90.805 0)
      (effects (font (size 1.27 1.27)) hide)
    )
    (pin "1" (uuid 9140fd51-d4c7-4a24-ac17-9d7de5ad630c))
    (pin "2" (uuid 0213d3ed-700d-4587-a57e-53fd0257612b))
    (instances
      (project "HV-bias-gen"
        (path "/3d5f2864-1fb5-4f02-896d-2a9dfefaff39"
          (reference "C?") (unit 1)
        )
        (path "/3d5f2864-1fb5-4f02-896d-2a9dfefaff39/0f524e33-692a-4961-8ad0-e97924f26470"
          (reference "C?") (unit 1)
        )
        (path "/3d5f2864-1fb5-4f02-896d-2a9dfefaff39/17042029-9b10-4267-af17-b285e3d0949f"
          (reference "C32") (unit 1)
        )
      )
    )
  )

  (symbol (lib_id "Device:C_Small") (at 120.015 83.82 0) (unit 1)
    (in_bom yes) (on_board yes) (dnp no)
    (uuid c71e9106-8b49-4ee9-801e-862c9bde6a91)
    (property "Reference" "C?" (at 118.745 77.47 90)
      (effects (font (size 1.27 1.27)) (justify left))
    )
    (property "Value" "10uF" (at 118.745 74.295 90)
      (effects (font (size 1.27 1.27)) (justify left))
    )
    (property "Footprint" "Capacitor_SMD:C_1210_3225Metric_Pad1.33x2.70mm_HandSolder" (at 120.015 83.82 0)
      (effects (font (size 1.27 1.27)) hide)
    )
    (property "Datasheet" "~" (at 120.015 83.82 0)
      (effects (font (size 1.27 1.27)) hide)
    )
    (pin "1" (uuid 464677b7-52d2-4324-a242-567b206b15d1))
    (pin "2" (uuid e9107821-6cd2-45a2-99b1-f1bf37bae5d7))
    (instances
      (project "HV-bias-gen"
        (path "/3d5f2864-1fb5-4f02-896d-2a9dfefaff39"
          (reference "C?") (unit 1)
        )
        (path "/3d5f2864-1fb5-4f02-896d-2a9dfefaff39/0f524e33-692a-4961-8ad0-e97924f26470"
          (reference "C?") (unit 1)
        )
        (path "/3d5f2864-1fb5-4f02-896d-2a9dfefaff39/17042029-9b10-4267-af17-b285e3d0949f"
          (reference "C27") (unit 1)
        )
      )
    )
  )

  (symbol (lib_id "Device:C_Small") (at 133.35 85.09 270) (unit 1)
    (in_bom yes) (on_board yes) (dnp no)
    (uuid cf003ae2-f57b-4738-b19d-74c41cec0d2b)
    (property "Reference" "C?" (at 127.635 83.82 90)
      (effects (font (size 1.27 1.27)) (justify left))
    )
    (property "Value" "1uF" (at 134.62 83.82 90)
      (effects (font (size 1.27 1.27)) (justify left))
    )
    (property "Footprint" "Capacitor_SMD:C_0805_2012Metric_Pad1.18x1.45mm_HandSolder" (at 133.35 85.09 0)
      (effects (font (size 1.27 1.27)) hide)
    )
    (property "Datasheet" "~" (at 133.35 85.09 0)
      (effects (font (size 1.27 1.27)) hide)
    )
    (pin "1" (uuid e0a285ca-f8b8-40ac-be24-c63b396084f1))
    (pin "2" (uuid 8dc70729-6801-40cd-a86b-589ac159c561))
    (instances
      (project "HV-bias-gen"
        (path "/3d5f2864-1fb5-4f02-896d-2a9dfefaff39"
          (reference "C?") (unit 1)
        )
        (path "/3d5f2864-1fb5-4f02-896d-2a9dfefaff39/0f524e33-692a-4961-8ad0-e97924f26470"
          (reference "C?") (unit 1)
        )
        (path "/3d5f2864-1fb5-4f02-896d-2a9dfefaff39/17042029-9b10-4267-af17-b285e3d0949f"
          (reference "C37") (unit 1)
        )
      )
    )
  )

  (symbol (lib_id "Device:R_Small") (at 180.975 104.14 90) (unit 1)
    (in_bom yes) (on_board yes) (dnp no)
    (uuid d0964998-e9a2-498d-80bf-52c6030d693a)
    (property "Reference" "R?" (at 180.975 101.6 90)
      (effects (font (size 1.27 1.27)))
    )
    (property "Value" "35k" (at 180.34 106.045 90)
      (effects (font (size 1.27 1.27)))
    )
    (property "Footprint" "Resistor_SMD:R_0805_2012Metric_Pad1.20x1.40mm_HandSolder" (at 180.975 104.14 0)
      (effects (font (size 1.27 1.27)) hide)
    )
    (property "Datasheet" "~" (at 180.975 104.14 0)
      (effects (font (size 1.27 1.27)) hide)
    )
    (pin "1" (uuid 2566de15-9dd5-4e5f-af44-a9e6c57fd452))
    (pin "2" (uuid 339b19e6-f4a4-4f4a-b71a-d618a7d385f0))
    (instances
      (project "HV-bias-gen"
        (path "/3d5f2864-1fb5-4f02-896d-2a9dfefaff39"
          (reference "R?") (unit 1)
        )
        (path "/3d5f2864-1fb5-4f02-896d-2a9dfefaff39/0f524e33-692a-4961-8ad0-e97924f26470"
          (reference "R?") (unit 1)
        )
        (path "/3d5f2864-1fb5-4f02-896d-2a9dfefaff39/17042029-9b10-4267-af17-b285e3d0949f"
          (reference "R12") (unit 1)
        )
      )
    )
  )

  (symbol (lib_id "Device:C_Small") (at 153.67 85.09 270) (unit 1)
    (in_bom yes) (on_board yes) (dnp no)
    (uuid d33e5d0f-41b2-40b4-874e-13cfcf6863e1)
    (property "Reference" "C?" (at 147.955 83.82 90)
      (effects (font (size 1.27 1.27)) (justify left))
    )
    (property "Value" "1uF" (at 154.94 83.82 90)
      (effects (font (size 1.27 1.27)) (justify left))
    )
    (property "Footprint" "Capacitor_SMD:C_0805_2012Metric_Pad1.18x1.45mm_HandSolder" (at 153.67 85.09 0)
      (effects (font (size 1.27 1.27)) hide)
    )
    (property "Datasheet" "~" (at 153.67 85.09 0)
      (effects (font (size 1.27 1.27)) hide)
    )
    (pin "1" (uuid 0468a18f-0877-4ab1-a16c-65c78f3f5473))
    (pin "2" (uuid 1216f746-3149-4b61-a9a5-0decb5312107))
    (instances
      (project "HV-bias-gen"
        (path "/3d5f2864-1fb5-4f02-896d-2a9dfefaff39"
          (reference "C?") (unit 1)
        )
        (path "/3d5f2864-1fb5-4f02-896d-2a9dfefaff39/0f524e33-692a-4961-8ad0-e97924f26470"
          (reference "C?") (unit 1)
        )
        (path "/3d5f2864-1fb5-4f02-896d-2a9dfefaff39/17042029-9b10-4267-af17-b285e3d0949f"
          (reference "C39") (unit 1)
        )
      )
    )
  )

  (symbol (lib_id "Device:C_Small") (at 104.775 83.82 0) (unit 1)
    (in_bom yes) (on_board yes) (dnp no)
    (uuid d83ccde4-fdc2-4d7e-ab83-9d26c1318181)
    (property "Reference" "C?" (at 104.775 78.105 90)
      (effects (font (size 1.27 1.27)) (justify left))
    )
    (property "Value" "10uF" (at 104.775 74.295 90)
      (effects (font (size 1.27 1.27)) (justify left))
    )
    (property "Footprint" "Capacitor_SMD:C_1210_3225Metric_Pad1.33x2.70mm_HandSolder" (at 104.775 83.82 0)
      (effects (font (size 1.27 1.27)) hide)
    )
    (property "Datasheet" "~" (at 104.775 83.82 0)
      (effects (font (size 1.27 1.27)) hide)
    )
    (pin "1" (uuid f480fc64-448c-45e3-aede-a93936a9d711))
    (pin "2" (uuid e65e5922-f085-4005-a3cd-0ef4d6603674))
    (instances
      (project "HV-bias-gen"
        (path "/3d5f2864-1fb5-4f02-896d-2a9dfefaff39"
          (reference "C?") (unit 1)
        )
        (path "/3d5f2864-1fb5-4f02-896d-2a9dfefaff39/0f524e33-692a-4961-8ad0-e97924f26470"
          (reference "C?") (unit 1)
        )
        (path "/3d5f2864-1fb5-4f02-896d-2a9dfefaff39/17042029-9b10-4267-af17-b285e3d0949f"
          (reference "C34") (unit 1)
        )
      )
    )
  )

  (symbol (lib_id "power:GND") (at 74.93 88.265 0) (unit 1)
    (in_bom yes) (on_board yes) (dnp no)
    (uuid da3bf06b-7c1e-4976-bfb0-6a14ebc5485b)
    (property "Reference" "#PWR011" (at 74.93 94.615 0)
      (effects (font (size 1.27 1.27)) hide)
    )
    (property "Value" "GND" (at 74.93 92.075 0)
      (effects (font (size 1.27 1.27)))
    )
    (property "Footprint" "" (at 74.93 88.265 0)
      (effects (font (size 1.27 1.27)) hide)
    )
    (property "Datasheet" "" (at 74.93 88.265 0)
      (effects (font (size 1.27 1.27)) hide)
    )
    (pin "1" (uuid c134061f-0d95-4dd6-8cbc-2c756c48515d))
    (instances
      (project "HV-bias-gen"
        (path "/3d5f2864-1fb5-4f02-896d-2a9dfefaff39"
          (reference "#PWR011") (unit 1)
        )
        (path "/3d5f2864-1fb5-4f02-896d-2a9dfefaff39/17042029-9b10-4267-af17-b285e3d0949f"
          (reference "#PWR012") (unit 1)
        )
      )
    )
  )

  (symbol (lib_id "Device:R_Small") (at 187.325 104.14 90) (unit 1)
    (in_bom yes) (on_board yes) (dnp no)
    (uuid e7935e24-721a-4233-a165-33bc34efc9f3)
    (property "Reference" "R?" (at 187.325 101.6 90)
      (effects (font (size 1.27 1.27)))
    )
    (property "Value" "35k" (at 186.69 106.045 90)
      (effects (font (size 1.27 1.27)))
    )
    (property "Footprint" "Resistor_SMD:R_0805_2012Metric_Pad1.20x1.40mm_HandSolder" (at 187.325 104.14 0)
      (effects (font (size 1.27 1.27)) hide)
    )
    (property "Datasheet" "~" (at 187.325 104.14 0)
      (effects (font (size 1.27 1.27)) hide)
    )
    (pin "1" (uuid d2369a64-040d-4c2c-9f5f-7271656ce805))
    (pin "2" (uuid 6010d30d-c801-4242-b0ac-3a558effbaa1))
    (instances
      (project "HV-bias-gen"
        (path "/3d5f2864-1fb5-4f02-896d-2a9dfefaff39"
          (reference "R?") (unit 1)
        )
        (path "/3d5f2864-1fb5-4f02-896d-2a9dfefaff39/0f524e33-692a-4961-8ad0-e97924f26470"
          (reference "R?") (unit 1)
        )
        (path "/3d5f2864-1fb5-4f02-896d-2a9dfefaff39/17042029-9b10-4267-af17-b285e3d0949f"
          (reference "R13") (unit 1)
        )
      )
    )
  )

  (symbol (lib_id "Device:D_Schottky_Small") (at 147.32 78.74 180) (unit 1)
    (in_bom yes) (on_board yes) (dnp no)
    (uuid e8dd789b-884c-42e6-aa18-23d17bd574bb)
    (property "Reference" "D?" (at 147.32 76.2 0)
      (effects (font (size 1.27 1.27)))
    )
    (property "Value" "PMEG6010" (at 149.225 88.9 0)
      (effects (font (size 1.27 1.27)))
    )
    (property "Footprint" "Diode_SMD:D_SOD-323_HandSoldering" (at 147.32 78.74 90)
      (effects (font (size 1.27 1.27)) hide)
    )
    (property "Datasheet" "~" (at 147.32 78.74 90)
      (effects (font (size 1.27 1.27)) hide)
    )
    (pin "1" (uuid f82baaf3-1bf1-4d74-8f9b-80d5c45ab347))
    (pin "2" (uuid 814c66bc-99cf-429b-bcb1-d35f708b767e))
    (instances
      (project "HV-bias-gen"
        (path "/3d5f2864-1fb5-4f02-896d-2a9dfefaff39"
          (reference "D?") (unit 1)
        )
        (path "/3d5f2864-1fb5-4f02-896d-2a9dfefaff39/0f524e33-692a-4961-8ad0-e97924f26470"
          (reference "D?") (unit 1)
        )
        (path "/3d5f2864-1fb5-4f02-896d-2a9dfefaff39/17042029-9b10-4267-af17-b285e3d0949f"
          (reference "D13") (unit 1)
        )
      )
    )
  )

  (symbol (lib_id "Device:L") (at 191.77 71.755 90) (unit 1)
    (in_bom yes) (on_board yes) (dnp no)
    (uuid f08d44b2-3c88-4b85-bc37-68c6ba2232ee)
    (property "Reference" "L?" (at 189.23 69.85 90)
      (effects (font (size 1.27 1.27)))
    )
    (property "Value" "6.8uH" (at 194.31 69.85 90)
      (effects (font (size 1.27 1.27)))
    )
    (property "Footprint" "Inductor_SMD:L_Abracon_ASPI-4030S" (at 191.77 71.755 0)
      (effects (font (size 1.27 1.27)) hide)
    )
    (property "Datasheet" "~" (at 191.77 71.755 0)
      (effects (font (size 1.27 1.27)) hide)
    )
    (pin "1" (uuid e1202836-abcf-4d43-bd6d-966525d36977))
    (pin "2" (uuid 41727168-e5e6-467c-a91f-9c0618e7071a))
    (instances
      (project "HV-bias-gen"
        (path "/3d5f2864-1fb5-4f02-896d-2a9dfefaff39"
          (reference "L?") (unit 1)
        )
        (path "/3d5f2864-1fb5-4f02-896d-2a9dfefaff39/0f524e33-692a-4961-8ad0-e97924f26470"
          (reference "L?") (unit 1)
        )
        (path "/3d5f2864-1fb5-4f02-896d-2a9dfefaff39/17042029-9b10-4267-af17-b285e3d0949f"
          (reference "L6") (unit 1)
        )
      )
    )
  )

  (symbol (lib_id "Device:R_Small") (at 133.35 78.74 90) (unit 1)
    (in_bom yes) (on_board yes) (dnp no)
    (uuid f161e842-2ec9-4458-a167-cd16e2663786)
    (property "Reference" "R?" (at 133.35 76.2 90)
      (effects (font (size 1.27 1.27)))
    )
    (property "Value" "10" (at 132.715 80.645 90)
      (effects (font (size 1.27 1.27)))
    )
    (property "Footprint" "Resistor_SMD:R_0805_2012Metric_Pad1.20x1.40mm_HandSolder" (at 133.35 78.74 0)
      (effects (font (size 1.27 1.27)) hide)
    )
    (property "Datasheet" "~" (at 133.35 78.74 0)
      (effects (font (size 1.27 1.27)) hide)
    )
    (pin "1" (uuid 1ba11908-7602-4bd9-a3d1-79dcb2bf83e8))
    (pin "2" (uuid 4f149940-20da-497d-970f-faa3b53cc682))
    (instances
      (project "HV-bias-gen"
        (path "/3d5f2864-1fb5-4f02-896d-2a9dfefaff39"
          (reference "R?") (unit 1)
        )
        (path "/3d5f2864-1fb5-4f02-896d-2a9dfefaff39/0f524e33-692a-4961-8ad0-e97924f26470"
          (reference "R?") (unit 1)
        )
        (path "/3d5f2864-1fb5-4f02-896d-2a9dfefaff39/17042029-9b10-4267-af17-b285e3d0949f"
          (reference "R10") (unit 1)
        )
      )
    )
  )

  (symbol (lib_id "Device:R_Small") (at 90.805 82.55 180) (unit 1)
    (in_bom yes) (on_board yes) (dnp no)
    (uuid f2886595-5fd0-4c06-8b9d-3fa2c6b633b0)
    (property "Reference" "R?" (at 86.995 83.82 0)
      (effects (font (size 1.27 1.27)))
    )
    (property "Value" "100k" (at 88.265 85.725 0)
      (effects (font (size 1.27 1.27)))
    )
    (property "Footprint" "Resistor_SMD:R_0805_2012Metric_Pad1.20x1.40mm_HandSolder" (at 90.805 82.55 0)
      (effects (font (size 1.27 1.27)) hide)
    )
    (property "Datasheet" "~" (at 90.805 82.55 0)
      (effects (font (size 1.27 1.27)) hide)
    )
    (pin "1" (uuid 69f70045-5e21-4877-ad36-f8da85970bce))
    (pin "2" (uuid 7f146073-2fd1-4416-aae6-eaf87a3b3403))
    (instances
      (project "HV-bias-gen"
        (path "/3d5f2864-1fb5-4f02-896d-2a9dfefaff39"
          (reference "R?") (unit 1)
        )
        (path "/3d5f2864-1fb5-4f02-896d-2a9dfefaff39/0f524e33-692a-4961-8ad0-e97924f26470"
          (reference "R?") (unit 1)
        )
        (path "/3d5f2864-1fb5-4f02-896d-2a9dfefaff39/17042029-9b10-4267-af17-b285e3d0949f"
          (reference "R9") (unit 1)
        )
      )
    )
  )

  (symbol (lib_id "Device:D_Schottky_Small") (at 160.02 78.74 0) (unit 1)
    (in_bom yes) (on_board yes) (dnp no)
    (uuid f4ac1ba4-3d87-42bb-8f23-e720bcf0e853)
    (property "Reference" "D?" (at 160.02 76.2 0)
      (effects (font (size 1.27 1.27)))
    )
    (property "Value" "PMEG6010" (at 149.225 90.805 0)
      (effects (font (size 1.27 1.27)))
    )
    (property "Footprint" "Diode_SMD:D_SOD-323_HandSoldering" (at 160.02 78.74 90)
      (effects (font (size 1.27 1.27)) hide)
    )
    (property "Datasheet" "~" (at 160.02 78.74 90)
      (effects (font (size 1.27 1.27)) hide)
    )
    (pin "1" (uuid c4263b0e-1811-4680-a655-4ba190a057bc))
    (pin "2" (uuid 75904bd6-8976-479b-bad6-4de2cdc48c2a))
    (instances
      (project "HV-bias-gen"
        (path "/3d5f2864-1fb5-4f02-896d-2a9dfefaff39"
          (reference "D?") (unit 1)
        )
        (path "/3d5f2864-1fb5-4f02-896d-2a9dfefaff39/0f524e33-692a-4961-8ad0-e97924f26470"
          (reference "D?") (unit 1)
        )
        (path "/3d5f2864-1fb5-4f02-896d-2a9dfefaff39/17042029-9b10-4267-af17-b285e3d0949f"
          (reference "D14") (unit 1)
        )
      )
    )
  )

  (symbol (lib_id "Device:C_Small") (at 133.35 71.755 90) (unit 1)
    (in_bom yes) (on_board yes) (dnp no)
    (uuid f7548bc9-b74c-4309-8a14-663d6c03ef63)
    (property "Reference" "C?" (at 136.525 70.485 90)
      (effects (font (size 1.27 1.27)) (justify left))
    )
    (property "Value" "220nF" (at 144.145 70.485 90)
      (effects (font (size 1.27 1.27)) (justify left))
    )
    (property "Footprint" "Capacitor_SMD:C_0805_2012Metric_Pad1.18x1.45mm_HandSolder" (at 133.35 71.755 0)
      (effects (font (size 1.27 1.27)) hide)
    )
    (property "Datasheet" "~" (at 133.35 71.755 0)
      (effects (font (size 1.27 1.27)) hide)
    )
    (pin "1" (uuid 61d95623-41cc-49a5-a9ce-29e50dc97abb))
    (pin "2" (uuid c9dc080b-276c-4de4-8e33-aed12504191b))
    (instances
      (project "HV-bias-gen"
        (path "/3d5f2864-1fb5-4f02-896d-2a9dfefaff39"
          (reference "C?") (unit 1)
        )
        (path "/3d5f2864-1fb5-4f02-896d-2a9dfefaff39/0f524e33-692a-4961-8ad0-e97924f26470"
          (reference "C?") (unit 1)
        )
        (path "/3d5f2864-1fb5-4f02-896d-2a9dfefaff39/17042029-9b10-4267-af17-b285e3d0949f"
          (reference "C36") (unit 1)
        )
      )
    )
  )

  (symbol (lib_id "Device:C_Small") (at 214.63 88.9 0) (unit 1)
    (in_bom yes) (on_board yes) (dnp no)
    (uuid f982bc14-83f6-40e0-8e69-f3f8934b100c)
    (property "Reference" "C?" (at 216.535 86.995 0)
      (effects (font (size 1.27 1.27)) (justify left))
    )
    (property "Value" "10uF" (at 216.535 90.805 0)
      (effects (font (size 1.27 1.27)) (justify left))
    )
    (property "Footprint" "Capacitor_SMD:C_0805_2012Metric_Pad1.18x1.45mm_HandSolder" (at 214.63 88.9 0)
      (effects (font (size 1.27 1.27)) hide)
    )
    (property "Datasheet" "~" (at 214.63 88.9 0)
      (effects (font (size 1.27 1.27)) hide)
    )
    (pin "1" (uuid 4bf8a736-0fc5-4042-abd5-b873e41785d2))
    (pin "2" (uuid 2b464850-9e53-471a-b969-0138fd0f6e44))
    (instances
      (project "HV-bias-gen"
        (path "/3d5f2864-1fb5-4f02-896d-2a9dfefaff39"
          (reference "C?") (unit 1)
        )
        (path "/3d5f2864-1fb5-4f02-896d-2a9dfefaff39/0f524e33-692a-4961-8ad0-e97924f26470"
          (reference "C?") (unit 1)
        )
        (path "/3d5f2864-1fb5-4f02-896d-2a9dfefaff39/17042029-9b10-4267-af17-b285e3d0949f"
          (reference "C43") (unit 1)
        )
      )
    )
  )

  (symbol (lib_id "Device:C_Small") (at 115.57 83.82 0) (unit 1)
    (in_bom yes) (on_board yes) (dnp no)
    (uuid fbd3a8f5-3509-4086-bfdb-6596ae50e044)
    (property "Reference" "C?" (at 109.22 83.82 0)
      (effects (font (size 1.27 1.27)) (justify left))
    )
    (property "Value" "10uF" (at 109.22 85.725 0)
      (effects (font (size 1.27 1.27)) (justify left))
    )
    (property "Footprint" "Capacitor_SMD:C_1210_3225Metric_Pad1.33x2.70mm_HandSolder" (at 115.57 83.82 0)
      (effects (font (size 1.27 1.27)) hide)
    )
    (property "Datasheet" "~" (at 115.57 83.82 0)
      (effects (font (size 1.27 1.27)) hide)
    )
    (pin "1" (uuid f03ef272-85e9-43af-b8f1-0bfd3afe054e))
    (pin "2" (uuid 6cf2f137-6506-4e78-a50f-227274146d35))
    (instances
      (project "HV-bias-gen"
        (path "/3d5f2864-1fb5-4f02-896d-2a9dfefaff39"
          (reference "C?") (unit 1)
        )
        (path "/3d5f2864-1fb5-4f02-896d-2a9dfefaff39/0f524e33-692a-4961-8ad0-e97924f26470"
          (reference "C?") (unit 1)
        )
        (path "/3d5f2864-1fb5-4f02-896d-2a9dfefaff39/17042029-9b10-4267-af17-b285e3d0949f"
          (reference "C35") (unit 1)
        )
      )
    )
  )

  (symbol (lib_id "Device:C_Polarized_Small") (at 187.325 109.22 90) (mirror x) (unit 1)
    (in_bom yes) (on_board yes) (dnp no)
    (uuid fbdc9feb-2285-4a8a-83ba-7da8410ed207)
    (property "Reference" "C?" (at 187.325 112.395 90)
      (effects (font (size 1.27 1.27)))
    )
    (property "Value" "220nF" (at 189.23 114.3 90)
      (effects (font (size 1.27 1.27)))
    )
    (property "Footprint" "Capacitor_SMD:C_1206_3216Metric_Pad1.33x1.80mm_HandSolder" (at 187.325 109.22 0)
      (effects (font (size 1.27 1.27)) hide)
    )
    (property "Datasheet" "~" (at 187.325 109.22 0)
      (effects (font (size 1.27 1.27)) hide)
    )
    (pin "1" (uuid 350842d9-efec-4852-97f0-9affc255fdc1))
    (pin "2" (uuid 9350e351-0494-46bc-91b4-39ac849d6ea4))
    (instances
      (project "HV-bias-gen"
        (path "/3d5f2864-1fb5-4f02-896d-2a9dfefaff39"
          (reference "C?") (unit 1)
        )
        (path "/3d5f2864-1fb5-4f02-896d-2a9dfefaff39/0f524e33-692a-4961-8ad0-e97924f26470"
          (reference "C?") (unit 1)
        )
        (path "/3d5f2864-1fb5-4f02-896d-2a9dfefaff39/17042029-9b10-4267-af17-b285e3d0949f"
          (reference "C42") (unit 1)
        )
      )
    )
  )
)
