(kicad_sch (version 20211123) (generator eeschema)

  (uuid 128428a7-88b9-49db-84c4-d75df0464efd)

  (paper "A4")

  (lib_symbols
  )


  (sheet (at 73.66 19.05) (size 49.53 49.53) (fields_autoplaced)
    (stroke (width 0.1524) (type solid) (color 0 0 0 0))
    (fill (color 0 0 0 0.0000))
    (uuid 12c1c2ee-7e1f-4688-810b-d69fb6626b8a)
    (property "Sheet name" "Battery Mangement systema" (id 0) (at 73.66 18.3384 0)
      (effects (font (size 1.27 1.27)) (justify left bottom))
    )
    (property "Sheet file" "Battery_Mangement_system.kicad_sch" (id 1) (at 73.66 69.1646 0)
      (effects (font (size 1.27 1.27)) (justify left top))
    )
  )

  (sheet (at 73.66 81.28) (size 49.53 43.18) (fields_autoplaced)
    (stroke (width 0.1524) (type solid) (color 0 0 0 0))
    (fill (color 0 0 0 0.0000))
    (uuid 1d6bd551-6503-43fe-a12e-5443b441d2e6)
    (property "Sheet name" "Inner Power Lines" (id 0) (at 73.66 80.5684 0)
      (effects (font (size 1.27 1.27)) (justify left bottom))
    )
    (property "Sheet file" "Inner_Power_Lines.kicad_sch" (id 1) (at 73.66 125.0446 0)
      (effects (font (size 1.27 1.27)) (justify left top))
    )
  )

  (sheet (at 19.05 133.35) (size 151.13 59.69) (fields_autoplaced)
    (stroke (width 0.1524) (type solid) (color 0 0 0 0))
    (fill (color 0 0 0 0.0000))
    (uuid 3e32bed3-156e-4e7f-832d-c5691d7bb983)
    (property "Sheet name" "Microcontroller" (id 0) (at 19.05 132.6384 0)
      (effects (font (size 1.27 1.27)) (justify left bottom))
    )
    (property "Sheet file" "Microcontroller.kicad_sch" (id 1) (at 19.05 193.6246 0)
      (effects (font (size 1.27 1.27)) (justify left top))
    )
  )

  (sheet (at 147.32 62.23) (size 60.96 33.02) (fields_autoplaced)
    (stroke (width 0.1524) (type solid) (color 0 0 0 0))
    (fill (color 0 0 0 0.0000))
    (uuid 554613b0-a55e-4fdb-9901-3167f4bdeae2)
    (property "Sheet name" "Boost Converters" (id 0) (at 147.32 61.5184 0)
      (effects (font (size 1.27 1.27)) (justify left bottom))
    )
    (property "Sheet file" "Boost_Converters.kicad_sch" (id 1) (at 147.32 95.8346 0)
      (effects (font (size 1.27 1.27)) (justify left top))
    )
  )

  (sheet (at 17.78 81.28) (size 49.53 43.18) (fields_autoplaced)
    (stroke (width 0.1524) (type solid) (color 0 0 0 0))
    (fill (color 0 0 0 0.0000))
    (uuid 5db6ab01-4abd-43ae-970c-634a29fe1dc9)
    (property "Sheet name" "Step-Down Converter" (id 0) (at 17.78 80.5684 0)
      (effects (font (size 1.27 1.27)) (justify left bottom))
    )
    (property "Sheet file" "Step_Down_Converter.kicad_sch" (id 1) (at 17.78 125.0446 0)
      (effects (font (size 1.27 1.27)) (justify left top))
    )
  )

  (sheet (at 218.44 16.51) (size 63.5 34.29) (fields_autoplaced)
    (stroke (width 0.1524) (type solid) (color 0 0 0 0))
    (fill (color 0 0 0 0.0000))
    (uuid 6302d820-d6f5-4305-ad0d-e8c5809a3b5b)
    (property "Sheet name" "Maximum Power Point Tracking" (id 0) (at 218.44 15.7984 0)
      (effects (font (size 1.27 1.27)) (justify left bottom))
    )
    (property "Sheet file" "MaxPPTracking.kicad_sch" (id 1) (at 218.44 51.3846 0)
      (effects (font (size 1.27 1.27)) (justify left top))
    )
  )

  (sheet (at 17.78 19.05) (size 49.53 49.53) (fields_autoplaced)
    (stroke (width 0.1524) (type solid) (color 0 0 0 0))
    (fill (color 0 0 0 0.0000))
    (uuid 87de0029-62b0-4d50-a282-35d60fcdf853)
    (property "Sheet name" "DC Converteres Temperature" (id 0) (at 17.78 18.3384 0)
      (effects (font (size 1.27 1.27)) (justify left bottom))
    )
    (property "Sheet file" "DC_Converters_Temperature.kicad_sch" (id 1) (at 17.78 69.1646 0)
      (effects (font (size 1.27 1.27)) (justify left top))
    )
  )

  (sheet (at 147.32 16.51) (size 60.96 34.29) (fields_autoplaced)
    (stroke (width 0.1524) (type solid) (color 0 0 0 0))
    (fill (color 0 0 0 0.0000))
    (uuid 926ce822-3149-43b3-a69b-199c0dc97a2a)
    (property "Sheet name" "Analog to Digital Converters" (id 0) (at 147.32 15.7984 0)
      (effects (font (size 1.27 1.27)) (justify left bottom))
    )
    (property "Sheet file" "Analog_to_Digital_Converters.kicad_sch" (id 1) (at 147.32 51.3846 0)
      (effects (font (size 1.27 1.27)) (justify left top))
    )
  )

  (sheet (at 177.8 104.14) (size 101.6 55.88) (fields_autoplaced)
    (stroke (width 0.1524) (type solid) (color 0 0 0 0))
    (fill (color 0 0 0 0.0000))
    (uuid af95d319-466c-4b4f-822e-6257b41c2e95)
    (property "Sheet name" "Output Power Lines" (id 0) (at 177.8 103.4284 0)
      (effects (font (size 1.27 1.27)) (justify left bottom))
    )
    (property "Sheet file" "Output_Power_Lines.kicad_sch" (id 1) (at 177.8 160.6046 0)
      (effects (font (size 1.27 1.27)) (justify left top))
    )
  )

  (sheet (at 218.44 62.23) (size 63.5 33.02) (fields_autoplaced)
    (stroke (width 0.1524) (type solid) (color 0 0 0 0))
    (fill (color 0 0 0 0.0000))
    (uuid ddc9d9b1-9b59-4944-87d2-e723be4f8e25)
    (property "Sheet name" "Voltage Dividers" (id 0) (at 218.44 61.5184 0)
      (effects (font (size 1.27 1.27)) (justify left bottom))
    )
    (property "Sheet file" "Voltage_Dividers.kicad_sch" (id 1) (at 218.44 95.8346 0)
      (effects (font (size 1.27 1.27)) (justify left top))
    )
  )

  (sheet_instances
    (path "/" (page "1"))
    (path "/87de0029-62b0-4d50-a282-35d60fcdf853" (page "2"))
    (path "/6302d820-d6f5-4305-ad0d-e8c5809a3b5b" (page "9"))
    (path "/5db6ab01-4abd-43ae-970c-634a29fe1dc9" (page "13"))
    (path "/554613b0-a55e-4fdb-9901-3167f4bdeae2" (page "14"))
    (path "/ddc9d9b1-9b59-4944-87d2-e723be4f8e25" (page "15"))
    (path "/926ce822-3149-43b3-a69b-199c0dc97a2a" (page "16"))
    (path "/1d6bd551-6503-43fe-a12e-5443b441d2e6" (page "17"))
    (path "/af95d319-466c-4b4f-822e-6257b41c2e95" (page "18"))
    (path "/3e32bed3-156e-4e7f-832d-c5691d7bb983" (page "19"))
    (path "/12c1c2ee-7e1f-4688-810b-d69fb6626b8a" (page "25"))
  )

  (symbol_instances
    (path "/3e32bed3-156e-4e7f-832d-c5691d7bb983/584f4368-3155-498e-8c25-d60be20a6e40"
      (reference "#PWR0124") (unit 1) (value "GND") (footprint "")
    )
    (path "/6302d820-d6f5-4305-ad0d-e8c5809a3b5b/43c1c92e-9f9a-47d6-ba36-53caa29c7a7a"
      (reference "#PWR0127") (unit 1) (value "GND") (footprint "")
    )
    (path "/6302d820-d6f5-4305-ad0d-e8c5809a3b5b/c87946a7-f96e-49f3-802b-08a41bb4721a"
      (reference "#PWR0128") (unit 1) (value "GND") (footprint "")
    )
    (path "/554613b0-a55e-4fdb-9901-3167f4bdeae2/32d39b54-7f73-4fc6-a808-b5f6f442009c"
      (reference "#PWR0135") (unit 1) (value "GND") (footprint "")
    )
    (path "/554613b0-a55e-4fdb-9901-3167f4bdeae2/432b29c0-823a-488c-815c-9c6004f25afc"
      (reference "#PWR0136") (unit 1) (value "GND") (footprint "")
    )
    (path "/554613b0-a55e-4fdb-9901-3167f4bdeae2/676b0562-32ee-4212-b2ec-7f031764eb55"
      (reference "#PWR0137") (unit 1) (value "GND") (footprint "")
    )
    (path "/554613b0-a55e-4fdb-9901-3167f4bdeae2/b346a965-3b52-458f-b024-2904737895cd"
      (reference "#PWR0138") (unit 1) (value "GND") (footprint "")
    )
    (path "/554613b0-a55e-4fdb-9901-3167f4bdeae2/e92e625a-ab6d-49e8-91ff-81caca495992"
      (reference "#PWR0139") (unit 1) (value "GND") (footprint "")
    )
    (path "/554613b0-a55e-4fdb-9901-3167f4bdeae2/99604f97-881e-41e7-b289-6dae0ecc2797"
      (reference "#PWR0140") (unit 1) (value "+3V3") (footprint "")
    )
    (path "/554613b0-a55e-4fdb-9901-3167f4bdeae2/f49a14fa-acf8-41ec-9e87-d156ebec988a"
      (reference "#PWR0141") (unit 1) (value "GND") (footprint "")
    )
    (path "/554613b0-a55e-4fdb-9901-3167f4bdeae2/3b1bb6a5-19a5-4cd1-a13e-bf2a5f414819"
      (reference "#PWR0142") (unit 1) (value "GND") (footprint "")
    )
    (path "/554613b0-a55e-4fdb-9901-3167f4bdeae2/d05c0bad-3c29-4eab-9490-25c6216ddcb7"
      (reference "#PWR0143") (unit 1) (value "GND") (footprint "")
    )
    (path "/ddc9d9b1-9b59-4944-87d2-e723be4f8e25/2bbd5fc1-b41d-4930-ab02-d9ba2117734c"
      (reference "#PWR0144") (unit 1) (value "GND") (footprint "")
    )
    (path "/ddc9d9b1-9b59-4944-87d2-e723be4f8e25/a6589362-4d46-46a5-a415-ba836f63b02e"
      (reference "#PWR0145") (unit 1) (value "GND") (footprint "")
    )
    (path "/ddc9d9b1-9b59-4944-87d2-e723be4f8e25/b24ba5e3-a342-464a-ad63-a0525f9ba7ae"
      (reference "#PWR0146") (unit 1) (value "GND") (footprint "")
    )
    (path "/ddc9d9b1-9b59-4944-87d2-e723be4f8e25/efba3692-a2e4-42da-9f67-a9a28540b60b"
      (reference "#PWR0147") (unit 1) (value "GND") (footprint "")
    )
    (path "/ddc9d9b1-9b59-4944-87d2-e723be4f8e25/30017652-fb7e-411a-815c-58e351edb792"
      (reference "#PWR0148") (unit 1) (value "GND") (footprint "")
    )
    (path "/ddc9d9b1-9b59-4944-87d2-e723be4f8e25/37683c0d-0dbf-4f8b-8f81-06e508798750"
      (reference "#PWR0149") (unit 1) (value "GND") (footprint "")
    )
    (path "/ddc9d9b1-9b59-4944-87d2-e723be4f8e25/f8ae93a7-706a-4c63-a214-18ea728bb8d7"
      (reference "#PWR0150") (unit 1) (value "GND") (footprint "")
    )
    (path "/ddc9d9b1-9b59-4944-87d2-e723be4f8e25/89345661-2d8e-4670-8eea-7eb23892c608"
      (reference "#PWR0151") (unit 1) (value "GND") (footprint "")
    )
    (path "/ddc9d9b1-9b59-4944-87d2-e723be4f8e25/5b3e61c5-efa1-4b9c-93e2-d2854dabd959"
      (reference "#PWR0152") (unit 1) (value "GND") (footprint "")
    )
    (path "/926ce822-3149-43b3-a69b-199c0dc97a2a/2377dfab-83f2-499a-bf57-aa3076ca7f4f"
      (reference "#PWR0153") (unit 1) (value "+3V3") (footprint "")
    )
    (path "/926ce822-3149-43b3-a69b-199c0dc97a2a/dac972cb-d95d-4430-b6bf-2b30c90a6612"
      (reference "#PWR0154") (unit 1) (value "GND") (footprint "")
    )
    (path "/926ce822-3149-43b3-a69b-199c0dc97a2a/9178d362-4496-474a-bc59-24b70166c105"
      (reference "#PWR0155") (unit 1) (value "GND") (footprint "")
    )
    (path "/926ce822-3149-43b3-a69b-199c0dc97a2a/903c2292-abf4-431b-bfb2-2069a3d57dc2"
      (reference "#PWR0156") (unit 1) (value "+3V3") (footprint "")
    )
    (path "/1d6bd551-6503-43fe-a12e-5443b441d2e6/c6c225cc-727f-4ff9-9897-8b15986edbc6"
      (reference "#PWR0157") (unit 1) (value "GND") (footprint "")
    )
    (path "/1d6bd551-6503-43fe-a12e-5443b441d2e6/dbc457b3-e297-432a-be71-46f901e8539a"
      (reference "#PWR0158") (unit 1) (value "GND") (footprint "")
    )
    (path "/1d6bd551-6503-43fe-a12e-5443b441d2e6/2f913f2b-299d-4204-8dfe-dee0bbf9535c"
      (reference "#PWR0159") (unit 1) (value "+3V3") (footprint "")
    )
    (path "/1d6bd551-6503-43fe-a12e-5443b441d2e6/d00b773b-b9f3-49d7-93f0-2f03c8a89d02"
      (reference "#PWR0160") (unit 1) (value "GND") (footprint "")
    )
    (path "/1d6bd551-6503-43fe-a12e-5443b441d2e6/07af1758-eaf1-47a8-9c1a-2a54288b1dfb"
      (reference "#PWR0161") (unit 1) (value "GND") (footprint "")
    )
    (path "/1d6bd551-6503-43fe-a12e-5443b441d2e6/e741ac4b-202b-4c72-b53d-fdedc3b61baf"
      (reference "#PWR0162") (unit 1) (value "GND") (footprint "")
    )
    (path "/1d6bd551-6503-43fe-a12e-5443b441d2e6/4e1720ef-311a-412f-9973-93c45b21c19f"
      (reference "#PWR0163") (unit 1) (value "+3V3") (footprint "")
    )
    (path "/1d6bd551-6503-43fe-a12e-5443b441d2e6/0415d948-f390-4be6-8f65-9008abcd1496"
      (reference "#PWR0164") (unit 1) (value "GND") (footprint "")
    )
    (path "/1d6bd551-6503-43fe-a12e-5443b441d2e6/1af02306-e092-4d3d-a8d0-9fbb9de4ad3e"
      (reference "#PWR0165") (unit 1) (value "+3V3") (footprint "")
    )
    (path "/af95d319-466c-4b4f-822e-6257b41c2e95/2e272246-d64e-4d4f-91e2-a9a82ef5457f"
      (reference "#PWR0166") (unit 1) (value "+3V3") (footprint "")
    )
    (path "/af95d319-466c-4b4f-822e-6257b41c2e95/c68e38d3-3077-464f-9ac4-2bbc2779309a"
      (reference "#PWR0167") (unit 1) (value "GND") (footprint "")
    )
    (path "/af95d319-466c-4b4f-822e-6257b41c2e95/652a3b18-5321-42e4-a2c3-8a0f801054ea"
      (reference "#PWR0168") (unit 1) (value "GND") (footprint "")
    )
    (path "/af95d319-466c-4b4f-822e-6257b41c2e95/38ce7383-5650-42b7-ac7a-eb5d4058ad79"
      (reference "#PWR0169") (unit 1) (value "GND") (footprint "")
    )
    (path "/af95d319-466c-4b4f-822e-6257b41c2e95/db27803f-67f1-4814-b572-b2c6b72b8ff5"
      (reference "#PWR0170") (unit 1) (value "+3V3") (footprint "")
    )
    (path "/af95d319-466c-4b4f-822e-6257b41c2e95/a1d91aa3-935c-4f78-a424-aab918486722"
      (reference "#PWR0171") (unit 1) (value "GND") (footprint "")
    )
    (path "/af95d319-466c-4b4f-822e-6257b41c2e95/92c2ae44-b891-483a-bfee-54711cf893be"
      (reference "#PWR0172") (unit 1) (value "GND") (footprint "")
    )
    (path "/af95d319-466c-4b4f-822e-6257b41c2e95/8e0fdf2b-8ede-493a-9f80-95407fa8193f"
      (reference "#PWR0173") (unit 1) (value "+3V3") (footprint "")
    )
    (path "/af95d319-466c-4b4f-822e-6257b41c2e95/0ce3588f-56ed-432e-874f-523aa3d8eaea"
      (reference "#PWR0174") (unit 1) (value "GND") (footprint "")
    )
    (path "/af95d319-466c-4b4f-822e-6257b41c2e95/e243998c-b35e-4bba-830f-b812ebc20f6b"
      (reference "#PWR0175") (unit 1) (value "GND") (footprint "")
    )
    (path "/af95d319-466c-4b4f-822e-6257b41c2e95/5bdb3b5f-0d54-4d45-88fb-ee47b5dd3ce0"
      (reference "#PWR0176") (unit 1) (value "GND") (footprint "")
    )
    (path "/af95d319-466c-4b4f-822e-6257b41c2e95/1eb3df74-254e-44e5-a6e9-29f187b5242a"
      (reference "#PWR0177") (unit 1) (value "+3V3") (footprint "")
    )
    (path "/af95d319-466c-4b4f-822e-6257b41c2e95/495c8be3-910f-4627-809a-c8868f69a271"
      (reference "#PWR0178") (unit 1) (value "+3V3") (footprint "")
    )
    (path "/af95d319-466c-4b4f-822e-6257b41c2e95/907c8ff4-7cc2-43b2-ba21-e9f6546724d6"
      (reference "#PWR0179") (unit 1) (value "+3V3") (footprint "")
    )
    (path "/af95d319-466c-4b4f-822e-6257b41c2e95/20f9c394-970b-4bcf-ba65-a27561a271ed"
      (reference "#PWR0180") (unit 1) (value "GND") (footprint "")
    )
    (path "/af95d319-466c-4b4f-822e-6257b41c2e95/19306bb4-98ba-43b4-b473-c64941630e99"
      (reference "#PWR0181") (unit 1) (value "GND") (footprint "")
    )
    (path "/af95d319-466c-4b4f-822e-6257b41c2e95/d2c1c483-efd4-4f67-89b5-c354e78b3374"
      (reference "#PWR0182") (unit 1) (value "+3V3") (footprint "")
    )
    (path "/af95d319-466c-4b4f-822e-6257b41c2e95/52fbb033-ff54-458f-a1cf-089cdfd231e9"
      (reference "#PWR0183") (unit 1) (value "GND") (footprint "")
    )
    (path "/af95d319-466c-4b4f-822e-6257b41c2e95/56c070a6-f22e-43ae-8063-ae4debca6fbd"
      (reference "#PWR0184") (unit 1) (value "GND") (footprint "")
    )
    (path "/af95d319-466c-4b4f-822e-6257b41c2e95/ccb4ceba-4d29-41fe-ac20-99a466a5fd5a"
      (reference "#PWR0185") (unit 1) (value "GND") (footprint "")
    )
    (path "/af95d319-466c-4b4f-822e-6257b41c2e95/bad6a02b-c8c2-4eae-b6b9-97fa26ebb73d"
      (reference "#PWR0186") (unit 1) (value "GND") (footprint "")
    )
    (path "/3e32bed3-156e-4e7f-832d-c5691d7bb983/26adc68e-e1d2-42b1-bd4e-c033c399f9e0"
      (reference "#PWR0187") (unit 1) (value "GND") (footprint "")
    )
    (path "/3e32bed3-156e-4e7f-832d-c5691d7bb983/5ff438ef-6a51-4668-b6f4-447564ee89f7"
      (reference "#PWR0188") (unit 1) (value "GND") (footprint "")
    )
    (path "/3e32bed3-156e-4e7f-832d-c5691d7bb983/3af5b441-63ff-4dd8-b0b4-2e0ba89b968f"
      (reference "#PWR0189") (unit 1) (value "+3V3") (footprint "")
    )
    (path "/3e32bed3-156e-4e7f-832d-c5691d7bb983/8744fab1-f90d-4ef0-96a7-9ed702fabcb5"
      (reference "#PWR0190") (unit 1) (value "GND") (footprint "")
    )
    (path "/3e32bed3-156e-4e7f-832d-c5691d7bb983/d5fcba4c-44f0-47d9-b260-ad13ae8d5c2b"
      (reference "#PWR0191") (unit 1) (value "+3V3") (footprint "")
    )
    (path "/3e32bed3-156e-4e7f-832d-c5691d7bb983/13072703-a983-4b4f-8d01-ca1101d60cc9"
      (reference "#PWR0192") (unit 1) (value "GND") (footprint "")
    )
    (path "/3e32bed3-156e-4e7f-832d-c5691d7bb983/564d77d7-e4c7-4414-8a03-a8ebb350c538"
      (reference "#PWR0193") (unit 1) (value "GND") (footprint "")
    )
    (path "/3e32bed3-156e-4e7f-832d-c5691d7bb983/b0e53a32-079b-409f-939f-42739828620f"
      (reference "#PWR0194") (unit 1) (value "GND") (footprint "")
    )
    (path "/3e32bed3-156e-4e7f-832d-c5691d7bb983/d0b6153a-cfff-4c7d-bd0c-f1738f1c5be0"
      (reference "#PWR0195") (unit 1) (value "+3V3") (footprint "")
    )
    (path "/3e32bed3-156e-4e7f-832d-c5691d7bb983/53bc4ca8-59c5-451e-8130-0038f3848cbe"
      (reference "#PWR0196") (unit 1) (value "GND") (footprint "")
    )
    (path "/3e32bed3-156e-4e7f-832d-c5691d7bb983/d9a90677-6c08-4154-ac89-8b835ccb4205"
      (reference "#PWR0197") (unit 1) (value "GND") (footprint "")
    )
    (path "/3e32bed3-156e-4e7f-832d-c5691d7bb983/c3301d2f-dabe-4d89-a997-76505eefb933"
      (reference "#PWR0198") (unit 1) (value "GND") (footprint "")
    )
    (path "/3e32bed3-156e-4e7f-832d-c5691d7bb983/5fa276e9-f910-44aa-9616-c952967df330"
      (reference "#PWR0199") (unit 1) (value "+3V3") (footprint "")
    )
    (path "/3e32bed3-156e-4e7f-832d-c5691d7bb983/dce08d90-da4d-4fa1-9046-88cb2c2181ad"
      (reference "#PWR0200") (unit 1) (value "GND") (footprint "")
    )
    (path "/3e32bed3-156e-4e7f-832d-c5691d7bb983/83c543c2-e656-4d7d-8c2e-2a7418bdd881"
      (reference "#PWR0201") (unit 1) (value "GND") (footprint "")
    )
    (path "/3e32bed3-156e-4e7f-832d-c5691d7bb983/44111b8b-be42-44ae-9f7d-1b22f34b9bed"
      (reference "#PWR0202") (unit 1) (value "GND") (footprint "")
    )
    (path "/3e32bed3-156e-4e7f-832d-c5691d7bb983/b70f92a1-12cd-43c3-bd25-ce5978be9782"
      (reference "#PWR0203") (unit 1) (value "GND") (footprint "")
    )
    (path "/3e32bed3-156e-4e7f-832d-c5691d7bb983/805829fd-d2c4-42f9-ac09-590183e9aafd"
      (reference "#PWR0204") (unit 1) (value "GND") (footprint "")
    )
    (path "/3e32bed3-156e-4e7f-832d-c5691d7bb983/53e36f9e-7e52-4299-bb73-283b44fb3a16"
      (reference "#PWR0205") (unit 1) (value "+3V3") (footprint "")
    )
    (path "/3e32bed3-156e-4e7f-832d-c5691d7bb983/0b1797f8-ae9d-4693-ad11-b7c642ce2488"
      (reference "#PWR0206") (unit 1) (value "+3V3") (footprint "")
    )
    (path "/af95d319-466c-4b4f-822e-6257b41c2e95/a4a77d2c-88e9-42ed-9161-49cd6a25b382"
      (reference "#PWR0207") (unit 1) (value "+3V3") (footprint "")
    )
    (path "/af95d319-466c-4b4f-822e-6257b41c2e95/95de5e27-45d4-412f-9693-260243df7ff7"
      (reference "#PWR0208") (unit 1) (value "+3V3") (footprint "")
    )
    (path "/af95d319-466c-4b4f-822e-6257b41c2e95/7a6b7ff2-31f8-4d00-92eb-5d85fe67a7ac"
      (reference "#PWR0209") (unit 1) (value "GND") (footprint "")
    )
    (path "/af95d319-466c-4b4f-822e-6257b41c2e95/ce95558e-fc7e-4028-8459-877a87d6f513"
      (reference "#PWR0210") (unit 1) (value "GND") (footprint "")
    )
    (path "/926ce822-3149-43b3-a69b-199c0dc97a2a/c3168e3b-a5ea-4835-a643-0bba7789d0ca"
      (reference "#PWR0211") (unit 1) (value "+3V3") (footprint "")
    )
    (path "/926ce822-3149-43b3-a69b-199c0dc97a2a/71d02b29-af7f-4d2c-b9a8-d45206cb4628"
      (reference "#PWR0212") (unit 1) (value "GND") (footprint "")
    )
    (path "/926ce822-3149-43b3-a69b-199c0dc97a2a/15143100-ebcc-4227-b3b2-771cc82a45c0"
      (reference "#PWR0213") (unit 1) (value "GND") (footprint "")
    )
    (path "/926ce822-3149-43b3-a69b-199c0dc97a2a/c625db6b-8359-4fa0-a57c-6b69269f6b8c"
      (reference "#PWR0214") (unit 1) (value "GND") (footprint "")
    )
    (path "/926ce822-3149-43b3-a69b-199c0dc97a2a/044fd9e8-8cf1-40d4-a3dc-b891347f5e33"
      (reference "#PWR0215") (unit 1) (value "GND") (footprint "")
    )
    (path "/926ce822-3149-43b3-a69b-199c0dc97a2a/ef893230-313c-4211-8f71-b606ccfd88d3"
      (reference "#PWR0216") (unit 1) (value "+3V3") (footprint "")
    )
    (path "/926ce822-3149-43b3-a69b-199c0dc97a2a/2e2c8152-3fcc-450c-b636-08a130a449dc"
      (reference "#PWR0217") (unit 1) (value "+3V3") (footprint "")
    )
    (path "/926ce822-3149-43b3-a69b-199c0dc97a2a/d738b989-47b8-4cc5-8463-4f21652931bc"
      (reference "#PWR0218") (unit 1) (value "GND") (footprint "")
    )
    (path "/926ce822-3149-43b3-a69b-199c0dc97a2a/aedde16a-5a8e-4b0c-ae70-47c25ac3d5bc"
      (reference "#PWR0219") (unit 1) (value "+3V3") (footprint "")
    )
    (path "/1d6bd551-6503-43fe-a12e-5443b441d2e6/b83e3961-c3cb-44e6-8e50-b586189448b9"
      (reference "#PWR0220") (unit 1) (value "GND") (footprint "")
    )
    (path "/1d6bd551-6503-43fe-a12e-5443b441d2e6/0c3987db-f789-4336-9e17-6af829382442"
      (reference "#PWR0221") (unit 1) (value "GND") (footprint "")
    )
    (path "/1d6bd551-6503-43fe-a12e-5443b441d2e6/53fe0607-e0cb-4600-8ba2-c479d2f623bd"
      (reference "#PWR0222") (unit 1) (value "+3V3") (footprint "")
    )
    (path "/1d6bd551-6503-43fe-a12e-5443b441d2e6/49892dd2-4268-4b6b-a27c-e3b6e33f2676"
      (reference "#PWR0223") (unit 1) (value "GND") (footprint "")
    )
    (path "/1d6bd551-6503-43fe-a12e-5443b441d2e6/03b2f15a-f2b8-4e80-81c0-c0f920c3a238"
      (reference "#PWR0224") (unit 1) (value "GND") (footprint "")
    )
    (path "/1d6bd551-6503-43fe-a12e-5443b441d2e6/f8b195a1-df21-4b79-803f-87fdcf58dbeb"
      (reference "#PWR0225") (unit 1) (value "GND") (footprint "")
    )
    (path "/1d6bd551-6503-43fe-a12e-5443b441d2e6/06cb287a-21c0-44a5-9e2a-e8ff65383be5"
      (reference "#PWR0226") (unit 1) (value "GND") (footprint "")
    )
    (path "/1d6bd551-6503-43fe-a12e-5443b441d2e6/786922c9-0a37-4a6d-b002-8faa3bad7936"
      (reference "#PWR0227") (unit 1) (value "+3V3") (footprint "")
    )
    (path "/1d6bd551-6503-43fe-a12e-5443b441d2e6/92779f69-ff98-43f7-8040-112dc1e78724"
      (reference "#PWR0228") (unit 1) (value "+3V3") (footprint "")
    )
    (path "/1d6bd551-6503-43fe-a12e-5443b441d2e6/bf4a1833-db20-4537-b0e0-53fa8e114b80"
      (reference "#PWR0229") (unit 1) (value "GND") (footprint "")
    )
    (path "/1d6bd551-6503-43fe-a12e-5443b441d2e6/b989ce01-9877-43ea-98df-28ce9eaf4c76"
      (reference "#PWR0230") (unit 1) (value "+3V3") (footprint "")
    )
    (path "/1d6bd551-6503-43fe-a12e-5443b441d2e6/c075b8fd-1eb6-4e8d-8635-cf4de8f88e37"
      (reference "#PWR0231") (unit 1) (value "GND") (footprint "")
    )
    (path "/1d6bd551-6503-43fe-a12e-5443b441d2e6/94e225dd-6292-4cce-84e6-a0c75208bead"
      (reference "#PWR0232") (unit 1) (value "+3V3") (footprint "")
    )
    (path "/6302d820-d6f5-4305-ad0d-e8c5809a3b5b/a152a636-89c8-4579-9fc9-285b6691e3f7"
      (reference "#PWR0237") (unit 1) (value "GND") (footprint "")
    )
    (path "/6302d820-d6f5-4305-ad0d-e8c5809a3b5b/224b648a-c66c-4ec6-aded-b2af6b699996"
      (reference "#PWR0238") (unit 1) (value "+3.3V") (footprint "")
    )
    (path "/6302d820-d6f5-4305-ad0d-e8c5809a3b5b/35f2ddc9-fbfd-4532-a3fd-e18d2d62485e"
      (reference "#PWR0239") (unit 1) (value "GND") (footprint "")
    )
    (path "/6302d820-d6f5-4305-ad0d-e8c5809a3b5b/2f25bcc0-f462-47cd-9f61-a1c919c95975"
      (reference "#PWR0240") (unit 1) (value "GND") (footprint "")
    )
    (path "/87de0029-62b0-4d50-a282-35d60fcdf853/187787e0-8a0d-425e-8a7c-db5d0ad40908"
      (reference "#PWR?") (unit 1) (value "GND") (footprint "")
    )
    (path "/87de0029-62b0-4d50-a282-35d60fcdf853/18a0c839-cb52-48bd-819f-50d0f6dc626d"
      (reference "#PWR?") (unit 1) (value "GND") (footprint "")
    )
    (path "/87de0029-62b0-4d50-a282-35d60fcdf853/256d74d7-ccc9-460e-9b45-465f6daff0e7"
      (reference "#PWR?") (unit 1) (value "+3V3") (footprint "")
    )
    (path "/12c1c2ee-7e1f-4688-810b-d69fb6626b8a/259d2a8f-bea4-4177-a4bc-b7bb50d08952"
      (reference "#PWR?") (unit 1) (value "GND") (footprint "")
    )
    (path "/87de0029-62b0-4d50-a282-35d60fcdf853/402a4dfb-e700-477b-86a9-9e6c6089cb35"
      (reference "#PWR?") (unit 1) (value "GND") (footprint "")
    )
    (path "/87de0029-62b0-4d50-a282-35d60fcdf853/42caf228-04cc-408f-84ff-35c0abea1767"
      (reference "#PWR?") (unit 1) (value "+3V3") (footprint "")
    )
    (path "/5db6ab01-4abd-43ae-970c-634a29fe1dc9/42f84edb-d88e-4a56-b5cb-052eb6bd9eb6"
      (reference "#PWR?") (unit 1) (value "GND") (footprint "")
    )
    (path "/12c1c2ee-7e1f-4688-810b-d69fb6626b8a/4493b9ab-7980-4d5b-a253-e38f9695a5c1"
      (reference "#PWR?") (unit 1) (value "GND") (footprint "")
    )
    (path "/87de0029-62b0-4d50-a282-35d60fcdf853/4b37820c-946d-470e-82d9-d08e4a21b9ee"
      (reference "#PWR?") (unit 1) (value "+12V") (footprint "")
    )
    (path "/12c1c2ee-7e1f-4688-810b-d69fb6626b8a/4b5e0ca1-e2ca-4d50-81e7-d2c09fcbf569"
      (reference "#PWR?") (unit 1) (value "GND") (footprint "")
    )
    (path "/87de0029-62b0-4d50-a282-35d60fcdf853/4c7997a0-c76c-4012-b8e6-a0fe5d3e120d"
      (reference "#PWR?") (unit 1) (value "GND") (footprint "")
    )
    (path "/87de0029-62b0-4d50-a282-35d60fcdf853/4ced9868-3265-40b3-8c83-deb2ff72e48b"
      (reference "#PWR?") (unit 1) (value "GND") (footprint "")
    )
    (path "/87de0029-62b0-4d50-a282-35d60fcdf853/4faeb349-207d-46c3-932d-1b0b6be3929b"
      (reference "#PWR?") (unit 1) (value "GND") (footprint "")
    )
    (path "/12c1c2ee-7e1f-4688-810b-d69fb6626b8a/50c167ab-a6da-41a6-8095-05285db6dc76"
      (reference "#PWR?") (unit 1) (value "+3V3") (footprint "")
    )
    (path "/87de0029-62b0-4d50-a282-35d60fcdf853/51794689-f1bb-463e-82ce-a1277eae2468"
      (reference "#PWR?") (unit 1) (value "GND") (footprint "")
    )
    (path "/5db6ab01-4abd-43ae-970c-634a29fe1dc9/522140de-94cd-4b89-86e0-e2bda59c2c35"
      (reference "#PWR?") (unit 1) (value "GND") (footprint "")
    )
    (path "/5db6ab01-4abd-43ae-970c-634a29fe1dc9/5354f0f5-1fd8-4136-a52c-e7332d421d97"
      (reference "#PWR?") (unit 1) (value "GND") (footprint "")
    )
    (path "/87de0029-62b0-4d50-a282-35d60fcdf853/66690437-31b0-4f45-b8b2-c8fe355c0aa6"
      (reference "#PWR?") (unit 1) (value "GND") (footprint "")
    )
    (path "/87de0029-62b0-4d50-a282-35d60fcdf853/75cbb37e-d103-4268-a3c1-7af3c97ebab2"
      (reference "#PWR?") (unit 1) (value "+3.3V") (footprint "")
    )
    (path "/87de0029-62b0-4d50-a282-35d60fcdf853/81797539-2022-46a6-89cb-fc1610502c93"
      (reference "#PWR?") (unit 1) (value "GND") (footprint "")
    )
    (path "/87de0029-62b0-4d50-a282-35d60fcdf853/97e0f039-ecdf-458b-a909-7d1c9fe048d0"
      (reference "#PWR?") (unit 1) (value "GND") (footprint "")
    )
    (path "/12c1c2ee-7e1f-4688-810b-d69fb6626b8a/9e600cf1-2d97-4db5-bda2-bb0f0a09ede6"
      (reference "#PWR?") (unit 1) (value "+3V3") (footprint "")
    )
    (path "/5db6ab01-4abd-43ae-970c-634a29fe1dc9/a1060530-5c05-4434-9c6e-b2285c3d1096"
      (reference "#PWR?") (unit 1) (value "+3V3") (footprint "")
    )
    (path "/5db6ab01-4abd-43ae-970c-634a29fe1dc9/a4f7f636-aed2-4c81-9c9e-5d0b138dda8b"
      (reference "#PWR?") (unit 1) (value "GND") (footprint "")
    )
    (path "/87de0029-62b0-4d50-a282-35d60fcdf853/acefb6fd-c6d3-477e-8b3e-6280f27b4b95"
      (reference "#PWR?") (unit 1) (value "+3V3") (footprint "")
    )
    (path "/87de0029-62b0-4d50-a282-35d60fcdf853/b4b6697f-28fa-4c14-bae5-fd7e89b51589"
      (reference "#PWR?") (unit 1) (value "GND") (footprint "")
    )
    (path "/12c1c2ee-7e1f-4688-810b-d69fb6626b8a/c0a68859-5e8c-411b-9fe8-2113f2b57a2d"
      (reference "#PWR?") (unit 1) (value "+3V3") (footprint "")
    )
    (path "/87de0029-62b0-4d50-a282-35d60fcdf853/c84f4f4f-ecf7-49e5-b7cd-984310eff256"
      (reference "#PWR?") (unit 1) (value "+3V3") (footprint "")
    )
    (path "/87de0029-62b0-4d50-a282-35d60fcdf853/c9fc856b-39ec-44ed-a0ff-7761a4f30bee"
      (reference "#PWR?") (unit 1) (value "+3V3") (footprint "")
    )
    (path "/5db6ab01-4abd-43ae-970c-634a29fe1dc9/cad4ca38-d609-4140-9b32-ec85fa54725c"
      (reference "#PWR?") (unit 1) (value "GND") (footprint "")
    )
    (path "/87de0029-62b0-4d50-a282-35d60fcdf853/d8604a8d-7e01-4758-805f-8de66ffdea05"
      (reference "#PWR?") (unit 1) (value "GND") (footprint "")
    )
    (path "/87de0029-62b0-4d50-a282-35d60fcdf853/e91f996e-130c-4fe2-928d-0593fe8ae128"
      (reference "#PWR?") (unit 1) (value "+3V3") (footprint "")
    )
    (path "/87de0029-62b0-4d50-a282-35d60fcdf853/f0c12802-66b4-4bf6-ace2-ef58b696be7a"
      (reference "#PWR?") (unit 1) (value "+12V") (footprint "")
    )
    (path "/1d6bd551-6503-43fe-a12e-5443b441d2e6/a8f4a2cf-e0f8-4c98-a1e4-d1d023489adc"
      (reference "3V3") (unit 1) (value "LD59100SON") (footprint "Package_TO_SOT_SMD:SOT-23-5")
    )
    (path "/6302d820-d6f5-4305-ad0d-e8c5809a3b5b/233c10ec-3967-4387-aa96-15881f775cab"
      (reference "10u1") (unit 1) (value "XAL2") (footprint "Inductor_SMD:L_0603_1608Metric_Pad1.05x0.95mm_HandSolder")
    )
    (path "/6302d820-d6f5-4305-ad0d-e8c5809a3b5b/d647d205-caad-4b5e-b540-51af612fd5a8"
      (reference "10u2") (unit 1) (value "XAL1") (footprint "Inductor_SMD:L_0603_1608Metric_Pad1.05x0.95mm_HandSolder")
    )
    (path "/926ce822-3149-43b3-a69b-199c0dc97a2a/8fe68278-39b6-4092-b6dd-6152ccfbe540"
      (reference "ADC1") (unit 1) (value "MAX11633EEG") (footprint "Package_SO:QSOP-24_3.9x8.7mm_P0.635mm")
    )
    (path "/926ce822-3149-43b3-a69b-199c0dc97a2a/615f9d12-0bba-46ca-95fe-a7631df1525a"
      (reference "ADC2") (unit 1) (value "MAX11639EEE") (footprint "Package_SO:QSOP-16_3.9x4.9mm_P0.635mm")
    )
    (path "/3e32bed3-156e-4e7f-832d-c5691d7bb983/dfa63172-e378-43b3-aec1-aaa660f3a4a9"
      (reference "BT1") (unit 1) (value "CR2032") (footprint "Battery:BatteryHolder_Keystone_1060_1x2032")
    )
    (path "/3e32bed3-156e-4e7f-832d-c5691d7bb983/c8e4c8cb-ca50-489c-8337-230822e2b309"
      (reference "C1") (unit 1) (value "100n") (footprint "Capacitor_SMD:C_0603_1608Metric")
    )
    (path "/6302d820-d6f5-4305-ad0d-e8c5809a3b5b/44a8498f-b6b6-4c5b-9689-931732b67ba1"
      (reference "C2") (unit 1) (value "100n") (footprint "Capacitor_SMD:C_0603_1608Metric")
    )
    (path "/6302d820-d6f5-4305-ad0d-e8c5809a3b5b/b95f4966-d79c-4244-8d25-6f5a1bc40917"
      (reference "C3") (unit 1) (value "1n") (footprint "Capacitor_SMD:C_0603_1608Metric")
    )
    (path "/6302d820-d6f5-4305-ad0d-e8c5809a3b5b/bfb3c74d-498f-4633-8db6-2ad6efd3a848"
      (reference "C4") (unit 1) (value "1u") (footprint "Capacitor_SMD:C_0603_1608Metric")
    )
    (path "/3e32bed3-156e-4e7f-832d-c5691d7bb983/b274eab1-2afd-460a-aa16-fa9b5555f5b5"
      (reference "C5") (unit 1) (value "100n") (footprint "Capacitor_SMD:C_0603_1608Metric")
    )
    (path "/6302d820-d6f5-4305-ad0d-e8c5809a3b5b/f71d590c-31ec-4e64-922c-6d4897e6ad15"
      (reference "C6") (unit 1) (value "4,7u") (footprint "Capacitor_SMD:C_0603_1608Metric")
    )
    (path "/6302d820-d6f5-4305-ad0d-e8c5809a3b5b/90b499a5-d07f-4e8a-a438-4425cddbce23"
      (reference "C7") (unit 1) (value "4,7u") (footprint "Capacitor_SMD:C_0603_1608Metric")
    )
    (path "/6302d820-d6f5-4305-ad0d-e8c5809a3b5b/9a8502a8-19cb-4e36-8d55-0fc4140de250"
      (reference "C8") (unit 1) (value "6,8u") (footprint "Capacitor_SMD:C_0603_1608Metric")
    )
    (path "/6302d820-d6f5-4305-ad0d-e8c5809a3b5b/9b1e7884-0123-4e0a-a3ad-626924d56134"
      (reference "C9") (unit 1) (value "100n") (footprint "Capacitor_SMD:C_0603_1608Metric")
    )
    (path "/6302d820-d6f5-4305-ad0d-e8c5809a3b5b/c85c1252-e041-4436-a716-dced03ce6f10"
      (reference "C10") (unit 1) (value "1n") (footprint "Capacitor_SMD:C_0603_1608Metric")
    )
    (path "/6302d820-d6f5-4305-ad0d-e8c5809a3b5b/ad5fc985-94d3-4e83-b444-f427ae8e0238"
      (reference "C11") (unit 1) (value "1u") (footprint "Capacitor_SMD:C_0603_1608Metric")
    )
    (path "/3e32bed3-156e-4e7f-832d-c5691d7bb983/42273c90-c34e-4f20-a085-d94aa3d891e6"
      (reference "C12") (unit 1) (value "100n") (footprint "Capacitor_SMD:C_0603_1608Metric")
    )
    (path "/6302d820-d6f5-4305-ad0d-e8c5809a3b5b/19f90d5f-12ad-4c8c-ae96-d828a8d8d807"
      (reference "C13") (unit 1) (value "4,7u") (footprint "Capacitor_SMD:C_0603_1608Metric")
    )
    (path "/6302d820-d6f5-4305-ad0d-e8c5809a3b5b/d5340a61-b050-428e-b1fa-880d252e4b72"
      (reference "C14") (unit 1) (value "4,7u") (footprint "Capacitor_SMD:C_0603_1608Metric")
    )
    (path "/6302d820-d6f5-4305-ad0d-e8c5809a3b5b/d466a466-1865-4fab-a491-9a7649629026"
      (reference "C15") (unit 1) (value "6,8u") (footprint "Capacitor_SMD:C_0603_1608Metric")
    )
    (path "/3e32bed3-156e-4e7f-832d-c5691d7bb983/cdbb936a-02bc-44d8-9309-c2d5ae4d2d12"
      (reference "C16") (unit 1) (value "100n") (footprint "Capacitor_SMD:C_0603_1608Metric")
    )
    (path "/3e32bed3-156e-4e7f-832d-c5691d7bb983/c5573556-d25f-4485-b2b6-2e84934b670d"
      (reference "C17") (unit 1) (value "4.3p") (footprint "Capacitor_SMD:C_0603_1608Metric")
    )
    (path "/3e32bed3-156e-4e7f-832d-c5691d7bb983/a3023827-6016-4756-987c-3714e92151f1"
      (reference "C18") (unit 1) (value "4.3p") (footprint "Capacitor_SMD:C_0603_1608Metric")
    )
    (path "/1d6bd551-6503-43fe-a12e-5443b441d2e6/b21f2ae1-6e5d-429e-806e-7b4d2c44b152"
      (reference "C19") (unit 1) (value "1u") (footprint "Capacitor_SMD:C_0603_1608Metric")
    )
    (path "/1d6bd551-6503-43fe-a12e-5443b441d2e6/a2e47c8c-091d-47ca-9707-6aab8a22f9b3"
      (reference "C20") (unit 1) (value "1u") (footprint "Capacitor_SMD:C_0603_1608Metric")
    )
    (path "/3e32bed3-156e-4e7f-832d-c5691d7bb983/846d72b2-f954-4798-b824-933ea828208c"
      (reference "C21") (unit 1) (value "22p") (footprint "Capacitor_SMD:C_0603_1608Metric")
    )
    (path "/6302d820-d6f5-4305-ad0d-e8c5809a3b5b/d150c5dc-9f1f-4347-b881-771dc7718a09"
      (reference "C22") (unit 1) (value "10u") (footprint "Capacitor_SMD:C_0603_1608Metric")
    )
    (path "/1d6bd551-6503-43fe-a12e-5443b441d2e6/0ba04a6c-15d0-4574-a7ae-9fc47a426d14"
      (reference "C23") (unit 1) (value "100n") (footprint "Capacitor_SMD:C_0603_1608Metric")
    )
    (path "/6302d820-d6f5-4305-ad0d-e8c5809a3b5b/7e3cab97-c5f7-4c03-a4f7-07ff4db088cf"
      (reference "C24") (unit 1) (value "4,7u") (footprint "Capacitor_SMD:C_0603_1608Metric")
    )
    (path "/554613b0-a55e-4fdb-9901-3167f4bdeae2/2d9abffa-2077-4802-8df1-2dc275a6a2d2"
      (reference "C25") (unit 1) (value "10u") (footprint "Capacitor_SMD:C_0603_1608Metric")
    )
    (path "/554613b0-a55e-4fdb-9901-3167f4bdeae2/628b929c-20de-487a-9849-90109419f956"
      (reference "C26") (unit 1) (value "22u") (footprint "Capacitor_SMD:C_0603_1608Metric")
    )
    (path "/3e32bed3-156e-4e7f-832d-c5691d7bb983/a5486a51-eb28-40ab-8d8e-15f9ab2a351f"
      (reference "C27") (unit 1) (value "22p") (footprint "Capacitor_SMD:C_0603_1608Metric")
    )
    (path "/3e32bed3-156e-4e7f-832d-c5691d7bb983/4a0abb11-20b3-4f78-8e23-24daf9536c03"
      (reference "C28") (unit 1) (value "100n") (footprint "Capacitor_SMD:C_0603_1608Metric")
    )
    (path "/3e32bed3-156e-4e7f-832d-c5691d7bb983/6c40e97d-3f32-4fbc-b73a-e6695afde105"
      (reference "C30") (unit 1) (value "100n") (footprint "Capacitor_SMD:C_0603_1608Metric")
    )
    (path "/554613b0-a55e-4fdb-9901-3167f4bdeae2/8f1b0832-1c7f-47e0-a53a-a8349763117f"
      (reference "C31") (unit 1) (value "22u") (footprint "Capacitor_SMD:C_0603_1608Metric")
    )
    (path "/554613b0-a55e-4fdb-9901-3167f4bdeae2/107aa69a-7117-4aca-9058-01fe74811e9d"
      (reference "C32") (unit 1) (value "22u") (footprint "Capacitor_SMD:C_0603_1608Metric")
    )
    (path "/554613b0-a55e-4fdb-9901-3167f4bdeae2/2d8cbf5e-518e-4dd4-8c29-61778b5721a7"
      (reference "C33") (unit 1) (value "100n") (footprint "Capacitor_SMD:C_0603_1608Metric")
    )
    (path "/554613b0-a55e-4fdb-9901-3167f4bdeae2/39540465-0d6f-4e18-bdf8-128b6cef2af1"
      (reference "C34") (unit 1) (value "100n") (footprint "Capacitor_SMD:C_0603_1608Metric")
    )
    (path "/554613b0-a55e-4fdb-9901-3167f4bdeae2/0b05b9de-cf9b-40c0-a55c-4efea62aa5e8"
      (reference "C35") (unit 1) (value "47u") (footprint "Capacitor_SMD:C_0603_1608Metric")
    )
    (path "/554613b0-a55e-4fdb-9901-3167f4bdeae2/ca0897c9-37f0-4d81-8233-4fbffbdfc689"
      (reference "C36") (unit 1) (value "1u") (footprint "Capacitor_SMD:C_0603_1608Metric")
    )
    (path "/554613b0-a55e-4fdb-9901-3167f4bdeae2/2fd69be7-f832-4ec1-91a6-5c9e322fd34b"
      (reference "C37") (unit 1) (value "10u") (footprint "Capacitor_SMD:C_0603_1608Metric")
    )
    (path "/554613b0-a55e-4fdb-9901-3167f4bdeae2/8fb71c59-a193-4301-8d50-8e1767eb1d6b"
      (reference "C38") (unit 1) (value "1n") (footprint "Capacitor_SMD:C_0603_1608Metric")
    )
    (path "/554613b0-a55e-4fdb-9901-3167f4bdeae2/70dc5ed0-bdf5-4b5b-a0ac-8199213ca0ab"
      (reference "C39") (unit 1) (value "8.2n") (footprint "Capacitor_SMD:C_0603_1608Metric")
    )
    (path "/5db6ab01-4abd-43ae-970c-634a29fe1dc9/2bd15c8f-25c5-4f95-af16-2e73c38a2757"
      (reference "C40") (unit 1) (value "4.7u") (footprint "Capacitor_SMD:C_0603_1608Metric")
    )
    (path "/5db6ab01-4abd-43ae-970c-634a29fe1dc9/09ad6428-d776-452a-9d00-2c2628a8188b"
      (reference "C41") (unit 1) (value "10u") (footprint "Capacitor_SMD:C_0603_1608Metric")
    )
    (path "/1d6bd551-6503-43fe-a12e-5443b441d2e6/edf0cd82-b92d-4865-998d-c616015832b0"
      (reference "C42") (unit 1) (value "100n") (footprint "Capacitor_SMD:C_0603_1608Metric")
    )
    (path "/1d6bd551-6503-43fe-a12e-5443b441d2e6/8926251b-0e63-4c70-b4fe-968c474533b4"
      (reference "C43") (unit 1) (value "100n") (footprint "Capacitor_SMD:C_0603_1608Metric")
    )
    (path "/926ce822-3149-43b3-a69b-199c0dc97a2a/a34f040e-8103-44f9-8ac7-3db3e460274d"
      (reference "C44") (unit 1) (value "0.1u") (footprint "Capacitor_SMD:C_0603_1608Metric")
    )
    (path "/5db6ab01-4abd-43ae-970c-634a29fe1dc9/a1d7854b-c731-4cb8-af15-461b9cfa4680"
      (reference "C45") (unit 1) (value "10u") (footprint "Capacitor_SMD:C_0603_1608Metric")
    )
    (path "/5db6ab01-4abd-43ae-970c-634a29fe1dc9/52ea3f43-9be0-4875-81f8-96c648fd341d"
      (reference "C46") (unit 1) (value "120p") (footprint "Capacitor_SMD:C_0603_1608Metric")
    )
    (path "/5db6ab01-4abd-43ae-970c-634a29fe1dc9/0fafd860-ed3b-42fd-8bed-448ba9b73b0d"
      (reference "C47") (unit 1) (value "10u") (footprint "Capacitor_SMD:C_0603_1608Metric")
    )
    (path "/554613b0-a55e-4fdb-9901-3167f4bdeae2/939684c7-4f66-496b-9487-d1af5414c38a"
      (reference "C48") (unit 1) (value "47p") (footprint "Capacitor_SMD:C_0603_1608Metric")
    )
    (path "/554613b0-a55e-4fdb-9901-3167f4bdeae2/ba13bb5d-ae3d-48c2-8620-7fa55a72ef4c"
      (reference "C49") (unit 1) (value "1u") (footprint "Capacitor_SMD:C_0603_1608Metric")
    )
    (path "/926ce822-3149-43b3-a69b-199c0dc97a2a/d0a1b75b-2c30-4449-8f12-2fbf586623ff"
      (reference "C50") (unit 1) (value "0.1u") (footprint "Capacitor_SMD:C_0603_1608Metric")
    )
    (path "/12c1c2ee-7e1f-4688-810b-d69fb6626b8a/7d487fa6-47bf-4093-b130-05ddea606653"
      (reference "C51") (unit 1) (value "2,2u") (footprint "Capacitor_SMD:C_0603_1608Metric")
    )
    (path "/926ce822-3149-43b3-a69b-199c0dc97a2a/29fcfe99-928b-4770-a2ea-11e481674739"
      (reference "C52") (unit 1) (value "0.1u") (footprint "Capacitor_SMD:C_0603_1608Metric")
    )
    (path "/926ce822-3149-43b3-a69b-199c0dc97a2a/c5a1205f-0287-414e-974d-fe7627ec21fb"
      (reference "C53") (unit 1) (value "0.1u") (footprint "Capacitor_SMD:C_0603_1608Metric")
    )
    (path "/87de0029-62b0-4d50-a282-35d60fcdf853/699cc9e9-0d06-4500-ba01-5ce65f57ed41"
      (reference "C54") (unit 1) (value "0,1u") (footprint "Capacitor_SMD:C_0603_1608Metric")
    )
    (path "/87de0029-62b0-4d50-a282-35d60fcdf853/62408e02-ba95-45b6-a898-993a696b6892"
      (reference "C55") (unit 1) (value "0,1u") (footprint "Capacitor_SMD:C_0603_1608Metric")
    )
    (path "/87de0029-62b0-4d50-a282-35d60fcdf853/99e0fe5a-3d02-47f5-8c1a-9972d9541a6a"
      (reference "C56") (unit 1) (value "0,1u") (footprint "Capacitor_SMD:C_0603_1608Metric")
    )
    (path "/12c1c2ee-7e1f-4688-810b-d69fb6626b8a/27055241-fffe-4a01-a40c-f5a060746fba"
      (reference "C57") (unit 1) (value "10u") (footprint "Capacitor_SMD:C_0603_1608Metric")
    )
    (path "/12c1c2ee-7e1f-4688-810b-d69fb6626b8a/04b82d34-00e7-4044-9223-a29cdaa76c9a"
      (reference "C58") (unit 1) (value "10u") (footprint "Capacitor_SMD:C_0603_1608Metric")
    )
    (path "/6302d820-d6f5-4305-ad0d-e8c5809a3b5b/fcef141b-8391-4427-af9b-e986402c0932"
      (reference "C59") (unit 1) (value "2,2u") (footprint "Capacitor_SMD:C_0603_1608Metric")
    )
    (path "/1d6bd551-6503-43fe-a12e-5443b441d2e6/432c7ffa-4096-41f3-9299-952e0e65e2f2"
      (reference "C60") (unit 1) (value "0.1u") (footprint "Capacitor_SMD:C_0603_1608Metric")
    )
    (path "/1d6bd551-6503-43fe-a12e-5443b441d2e6/40756c77-d9be-464c-bb2a-e3ed22e78da7"
      (reference "C61") (unit 1) (value "0.1u") (footprint "Capacitor_SMD:C_0603_1608Metric")
    )
    (path "/12c1c2ee-7e1f-4688-810b-d69fb6626b8a/764bddcc-aa05-4358-8890-54729da0855b"
      (reference "C62") (unit 1) (value "10U") (footprint "Capacitor_SMD:C_0201_0603Metric")
    )
    (path "/12c1c2ee-7e1f-4688-810b-d69fb6626b8a/78bf2225-b27f-44ce-84fb-0087691aa0b0"
      (reference "C63") (unit 1) (value "10U") (footprint "Capacitor_SMD:C_0201_0603Metric")
    )
    (path "/12c1c2ee-7e1f-4688-810b-d69fb6626b8a/2a4aac29-2ee8-40ab-a596-e34d1746bb1f"
      (reference "C64") (unit 1) (value "10U") (footprint "Capacitor_SMD:C_0201_0603Metric")
    )
    (path "/926ce822-3149-43b3-a69b-199c0dc97a2a/dfcc9679-da2b-4886-bb0a-57498dd4db00"
      (reference "C65") (unit 1) (value "100n") (footprint "Capacitor_SMD:C_0603_1608Metric")
    )
    (path "/1d6bd551-6503-43fe-a12e-5443b441d2e6/f4149800-ee0c-47f4-903d-a52db3dcb69b"
      (reference "C67") (unit 1) (value "0.1u") (footprint "Capacitor_SMD:C_0603_1608Metric")
    )
    (path "/6302d820-d6f5-4305-ad0d-e8c5809a3b5b/17f3ddbc-fd73-42ce-a3da-9ea9fc67d43a"
      (reference "C68") (unit 1) (value "2,2u") (footprint "Capacitor_SMD:C_0603_1608Metric")
    )
    (path "/af95d319-466c-4b4f-822e-6257b41c2e95/002d6a97-2b14-4ccd-9f3b-5bfe02aaf094"
      (reference "C69") (unit 1) (value "0.1u") (footprint "Capacitor_SMD:C_0603_1608Metric")
    )
    (path "/af95d319-466c-4b4f-822e-6257b41c2e95/8f36434e-ee80-45fc-b12a-7d13f4ae704e"
      (reference "C70") (unit 1) (value "0.1u") (footprint "Capacitor_SMD:C_0603_1608Metric")
    )
    (path "/af95d319-466c-4b4f-822e-6257b41c2e95/9c7da8b5-5d85-42b5-9347-55b02ebd49a8"
      (reference "C71") (unit 1) (value "0.1u") (footprint "Capacitor_SMD:C_0603_1608Metric")
    )
    (path "/af95d319-466c-4b4f-822e-6257b41c2e95/ad8153b9-5e05-4107-9cf7-236bebbfddbc"
      (reference "C72") (unit 1) (value "0.1u") (footprint "Capacitor_SMD:C_0603_1608Metric")
    )
    (path "/af95d319-466c-4b4f-822e-6257b41c2e95/41675488-70e5-477c-b177-1e0da735b30c"
      (reference "C73") (unit 1) (value "0.1u") (footprint "Capacitor_SMD:C_0603_1608Metric")
    )
    (path "/af95d319-466c-4b4f-822e-6257b41c2e95/c4efaff4-21db-475b-b2a2-6aec4825b803"
      (reference "C74") (unit 1) (value "0.1u") (footprint "Capacitor_SMD:C_0603_1608Metric")
    )
    (path "/af95d319-466c-4b4f-822e-6257b41c2e95/ab7082b4-00ce-41e0-9017-982fe7d23a3a"
      (reference "C75") (unit 1) (value "0.1u") (footprint "Capacitor_SMD:C_0603_1608Metric")
    )
    (path "/12c1c2ee-7e1f-4688-810b-d69fb6626b8a/478c9ec0-c28c-4187-9aa8-afb3d3d189de"
      (reference "C76") (unit 1) (value "2,2u") (footprint "Capacitor_SMD:C_0603_1608Metric")
    )
    (path "/12c1c2ee-7e1f-4688-810b-d69fb6626b8a/34fbcd6d-0496-4bb0-ac27-5cec066c1561"
      (reference "C77") (unit 1) (value "2,2u") (footprint "Capacitor_SMD:C_0603_1608Metric")
    )
    (path "/12c1c2ee-7e1f-4688-810b-d69fb6626b8a/d704ac09-5a71-493f-8ded-9b06194d2571"
      (reference "C78") (unit 1) (value "10u") (footprint "Capacitor_SMD:C_0603_1608Metric")
    )
    (path "/3e32bed3-156e-4e7f-832d-c5691d7bb983/1821117f-d018-4b91-85a1-3adc9d74be34"
      (reference "CubeSat_Connector2") (unit 1) (value "14529") (footprint "EPS:Cube Sat connector")
    )
    (path "/1d6bd551-6503-43fe-a12e-5443b441d2e6/56cec504-621f-4d98-856a-45f46ee2f4e4"
      (reference "F-RAM1") (unit 1) (value "F-RAM") (footprint "Package_SO:SOIC-8_3.9x4.9mm_P1.27mm")
    )
    (path "/1d6bd551-6503-43fe-a12e-5443b441d2e6/27e88e10-6f5e-434d-8186-18e167c6136d"
      (reference "INA12") (unit 1) (value "INA190") (footprint "Package_TO_SOT_SMD:TSOT-23-6_HandSoldering")
    )
    (path "/1d6bd551-6503-43fe-a12e-5443b441d2e6/e2d6506e-5a3d-44d0-8a09-37d78c35c314"
      (reference "INA13") (unit 1) (value "INA190") (footprint "Package_TO_SOT_SMD:TSOT-23-6_HandSoldering")
    )
    (path "/1d6bd551-6503-43fe-a12e-5443b441d2e6/ea40cf21-6667-4331-ab4c-50cc660a19ce"
      (reference "INA14") (unit 1) (value "INA190") (footprint "Package_TO_SOT_SMD:TSOT-23-6_HandSoldering")
    )
    (path "/af95d319-466c-4b4f-822e-6257b41c2e95/f99235be-e38e-4e19-99da-55259131f492"
      (reference "INA16") (unit 1) (value "INA190") (footprint "Package_TO_SOT_SMD:TSOT-23-6_HandSoldering")
    )
    (path "/af95d319-466c-4b4f-822e-6257b41c2e95/70d08b56-d706-402e-a9e6-bb7779687321"
      (reference "INA17") (unit 1) (value "INA190") (footprint "Package_TO_SOT_SMD:TSOT-23-6_HandSoldering")
    )
    (path "/af95d319-466c-4b4f-822e-6257b41c2e95/b7e27b2b-a064-4589-a154-da0722d7fa25"
      (reference "INA18") (unit 1) (value "INA190") (footprint "Package_TO_SOT_SMD:TSOT-23-6_HandSoldering")
    )
    (path "/af95d319-466c-4b4f-822e-6257b41c2e95/109820ba-1777-48cd-bbc4-f700d316d9fe"
      (reference "INA19") (unit 1) (value "INA190") (footprint "Package_TO_SOT_SMD:TSOT-23-6_HandSoldering")
    )
    (path "/af95d319-466c-4b4f-822e-6257b41c2e95/8836aaa8-d264-4087-bd93-62394614fdfc"
      (reference "INA20") (unit 1) (value "INA190") (footprint "Package_TO_SOT_SMD:TSOT-23-6_HandSoldering")
    )
    (path "/af95d319-466c-4b4f-822e-6257b41c2e95/b1600741-9a01-4d74-be61-56505fa0a7f7"
      (reference "INA21") (unit 1) (value "INA190") (footprint "Package_TO_SOT_SMD:TSOT-23-6_HandSoldering")
    )
    (path "/af95d319-466c-4b4f-822e-6257b41c2e95/b5c938fd-f411-4648-80b0-fe571caba25b"
      (reference "INA22") (unit 1) (value "INA190") (footprint "Package_TO_SOT_SMD:TSOT-23-6_HandSoldering")
    )
    (path "/3e32bed3-156e-4e7f-832d-c5691d7bb983/6cf259fc-ddb0-4693-96d4-ddfa3f03fce8"
      (reference "JP1") (unit 1) (value "BOOT0") (footprint "EPS:JP")
    )
    (path "/1d6bd551-6503-43fe-a12e-5443b441d2e6/ec795667-ec1b-4b29-a4e0-079fdfd75021"
      (reference "JP2") (unit 1) (value "FRAM_WR") (footprint "EPS:JP")
    )
    (path "/554613b0-a55e-4fdb-9901-3167f4bdeae2/6ac86ace-cceb-429a-a947-d32a7c70b8b1"
      (reference "L2") (unit 1) (value "1u") (footprint "Inductor_SMD:L_0603_1608Metric")
    )
    (path "/554613b0-a55e-4fdb-9901-3167f4bdeae2/9ec7b9a7-6ddb-450a-8756-c654ff25d519"
      (reference "L3") (unit 1) (value "1u") (footprint "Inductor_SMD:L_0603_1608Metric")
    )
    (path "/5db6ab01-4abd-43ae-970c-634a29fe1dc9/862a58ea-2492-4657-b359-99b1ce778db6"
      (reference "L4") (unit 1) (value "0.47u") (footprint "Inductor_SMD:L_0603_1608Metric")
    )
    (path "/926ce822-3149-43b3-a69b-199c0dc97a2a/c98f0781-94f3-4e4f-89fa-2d8b063e1afa"
      (reference "L5") (unit 1) (value "0R5/500mA") (footprint "Inductor_SMD:L_0603_1608Metric")
    )
    (path "/926ce822-3149-43b3-a69b-199c0dc97a2a/c1cdad0b-af1b-45cd-bb52-cd44df4e2edb"
      (reference "LED2") (unit 1) (value "GREEN") (footprint "LED_SMD:LED_0805_2012Metric")
    )
    (path "/926ce822-3149-43b3-a69b-199c0dc97a2a/2233cacd-1118-47bc-96b9-ccee3072932f"
      (reference "LED8") (unit 1) (value "RED") (footprint "LED_SMD:LED_0805_2012Metric")
    )
    (path "/6302d820-d6f5-4305-ad0d-e8c5809a3b5b/61f8a02b-bab0-4a0a-954c-ed904ed9156d"
      (reference "M2-1") (unit 1) (value "MOLEX2") (footprint "Connector_Molex:Molex_CLIK-Mate_502382-0270_1x02-1MP_P1.25mm_Vertical")
    )
    (path "/6302d820-d6f5-4305-ad0d-e8c5809a3b5b/092ea271-5cdc-4013-880c-81621e2b30f9"
      (reference "M2-2") (unit 1) (value "MOLEX2") (footprint "Connector_Molex:Molex_CLIK-Mate_502382-0270_1x02-1MP_P1.25mm_Vertical")
    )
    (path "/6302d820-d6f5-4305-ad0d-e8c5809a3b5b/cdacef9d-a9a4-4792-9cf0-97b98ed60aa2"
      (reference "M2-3") (unit 1) (value "MOLEX2") (footprint "Connector_Molex:Molex_CLIK-Mate_502382-0270_1x02-1MP_P1.25mm_Vertical")
    )
    (path "/6302d820-d6f5-4305-ad0d-e8c5809a3b5b/f8027b08-0786-4c88-b8de-2e31f8a834f7"
      (reference "M2-4") (unit 1) (value "MOLEX2") (footprint "Connector_Molex:Molex_CLIK-Mate_502382-0270_1x02-1MP_P1.25mm_Vertical")
    )
    (path "/12c1c2ee-7e1f-4688-810b-d69fb6626b8a/cc553dd2-0c06-457e-8226-06412d345669"
      (reference "M2-6") (unit 1) (value "MOLEX2") (footprint "Molex_CLIK-Mate_502382-0270_1x02-1MP_P1.25mm_Vertical")
    )
    (path "/12c1c2ee-7e1f-4688-810b-d69fb6626b8a/0349b66e-5e6c-4a2a-a98f-ee440603de5d"
      (reference "M2-7") (unit 1) (value "MOLEX2") (footprint "Molex_CLIK-Mate_502382-0270_1x02-1MP_P1.25mm_Vertical")
    )
    (path "/12c1c2ee-7e1f-4688-810b-d69fb6626b8a/3f967d12-f300-44ca-a9a9-d7ac3d332194"
      (reference "M2-8") (unit 1) (value "MOLEX2") (footprint "Molex_CLIK-Mate_502382-0270_1x02-1MP_P1.25mm_Vertical")
    )
    (path "/5db6ab01-4abd-43ae-970c-634a29fe1dc9/85524257-bf80-4b38-8de6-6bbf0a28244f"
      (reference "M2-10") (unit 1) (value "MOLEX2") (footprint "Connector_Molex:Molex_CLIK-Mate_502382-0270_1x02-1MP_P1.25mm_Vertical")
    )
    (path "/af95d319-466c-4b4f-822e-6257b41c2e95/d1d5bec0-4652-4ef3-a24f-fb9eecdf696c"
      (reference "M6-3") (unit 1) (value "MOLEX6") (footprint "Connector_Molex:Molex_CLIK-Mate_502386-0670_1x06-1MP_P1.25mm_Horizontal")
    )
    (path "/af95d319-466c-4b4f-822e-6257b41c2e95/fd429dc5-52dd-4888-94fc-2f7a2db447d6"
      (reference "M6-4") (unit 1) (value "MOLEX6") (footprint "Connector_Molex:Molex_CLIK-Mate_502386-0670_1x06-1MP_P1.25mm_Horizontal")
    )
    (path "/12c1c2ee-7e1f-4688-810b-d69fb6626b8a/4629bcc2-b158-46fc-ad9f-89544365d06a"
      (reference "MCP4") (unit 1) (value "MCP73871") (footprint "Package_DFN_QFN:QFN-20-1EP_4x4mm_P0.5mm_EP2.5x2.5mm")
    )
    (path "/12c1c2ee-7e1f-4688-810b-d69fb6626b8a/44b9e86a-3f5d-498a-a6e7-1ddd058c5c27"
      (reference "MCP5") (unit 1) (value "MCP73871") (footprint "Package_DFN_QFN:QFN-20-1EP_4x4mm_P0.5mm_EP2.5x2.5mm")
    )
    (path "/12c1c2ee-7e1f-4688-810b-d69fb6626b8a/47549fd6-c628-4f30-abbd-1d39454442de"
      (reference "MCP6") (unit 1) (value "MCP73871") (footprint "Package_DFN_QFN:QFN-20-1EP_4x4mm_P0.5mm_EP2.5x2.5mm")
    )
    (path "/6302d820-d6f5-4305-ad0d-e8c5809a3b5b/19c10173-7edd-4e2c-ae7b-3cddf60dd704"
      (reference "MOLEX2-5") (unit 1) (value "14529") (footprint "Connector_Molex:Molex_CLIK-Mate_502382-0270_1x02-1MP_P1.25mm_Vertical")
    )
    (path "/87de0029-62b0-4d50-a282-35d60fcdf853/00e53092-bd1c-498f-8197-6266055fe609"
      (reference "MOLEX2-14") (unit 1) (value "14529") (footprint "Connector_Molex:Molex_CLIK-Mate_502386-0270_1x02-1MP_P1.25mm_Horizontal")
    )
    (path "/6302d820-d6f5-4305-ad0d-e8c5809a3b5b/31af1727-65c0-4640-a4ec-e7f65a1990d7"
      (reference "MOLEX5-3") (unit 1) (value "14529") (footprint "Connector_Molex:Molex_CLIK-Mate_502386-0570_1x05-1MP_P1.25mm_Horizontal")
    )
    (path "/3e32bed3-156e-4e7f-832d-c5691d7bb983/b95503e0-b399-41bf-99b3-74ff575fa64b"
      (reference "OSC1") (unit 1) (value "32.768kHz") (footprint "Crystal:Crystal_SMD_Abracon_ABS25-4Pin_8.0x3.8mm")
    )
    (path "/87de0029-62b0-4d50-a282-35d60fcdf853/388c3728-75c2-4043-9172-33fe092d430c"
      (reference "Q1") (unit 1) (value "SI15423DQ") (footprint "Package_TO_SOT_SMD:SOT-363_SC-70-6")
    )
    (path "/3e32bed3-156e-4e7f-832d-c5691d7bb983/c6c23588-ea0b-4cfe-a239-a04754b5e2e3"
      (reference "Q2") (unit 1) (value "ABM8W-CRYSTALSMD") (footprint "Crystal:Crystal_SMD_Abracon_ABM8G-4Pin_3.2x2.5mm")
    )
    (path "/554613b0-a55e-4fdb-9901-3167f4bdeae2/7246606c-fdc4-4af9-9623-da97fb60af8e"
      (reference "Q3") (unit 1) (value "SI6423DQ") (footprint "Package_SO:SOIC-8_3.9x4.9mm_P1.27mm")
    )
    (path "/554613b0-a55e-4fdb-9901-3167f4bdeae2/d1be5d35-f28e-4824-8c3d-f2a03248645d"
      (reference "Q4") (unit 1) (value "SI6423DQ") (footprint "Package_SO:SOIC-8_3.9x4.9mm_P1.27mm")
    )
    (path "/5db6ab01-4abd-43ae-970c-634a29fe1dc9/30d4cf30-c283-4fda-9986-da53c3195d28"
      (reference "Q5A1") (unit 1) (value "SI6423DQ") (footprint "Package_TO_SOT_SMD:SOT-23")
    )
    (path "/5db6ab01-4abd-43ae-970c-634a29fe1dc9/c724f95b-ad35-4a31-a6a8-ccff88e640df"
      (reference "Q6A1") (unit 1) (value "SI6423DQ") (footprint "Package_TO_SOT_SMD:SOT-23")
    )
    (path "/5db6ab01-4abd-43ae-970c-634a29fe1dc9/9fded633-aa56-4f1a-b82e-abb26c214fea"
      (reference "Q7A1") (unit 1) (value "SI6423DQ") (footprint "Package_TO_SOT_SMD:SOT-23")
    )
    (path "/554613b0-a55e-4fdb-9901-3167f4bdeae2/c7819e4d-524e-41d8-bb01-32647c59b13f"
      (reference "Q8") (unit 1) (value "SI6423DQ") (footprint "Package_SO:SOIC-8_3.9x4.9mm_P1.27mm")
    )
    (path "/5db6ab01-4abd-43ae-970c-634a29fe1dc9/9f64e571-9df6-4d52-b888-13aee46151e5"
      (reference "Q9A1") (unit 1) (value "SI6423DQ") (footprint "Package_TO_SOT_SMD:SOT-23")
    )
    (path "/87de0029-62b0-4d50-a282-35d60fcdf853/95c30d03-e370-4aed-a9ce-511686024aec"
      (reference "Q10") (unit 1) (value "SI15423DQ") (footprint "Package_TO_SOT_SMD:SOT-363_SC-70-6")
    )
    (path "/6302d820-d6f5-4305-ad0d-e8c5809a3b5b/c89b726e-fc3f-4d93-ad4d-159b004bcf31"
      (reference "Q11") (unit 1) (value "SQ4184EY") (footprint "Package_TO_SOT_SMD:SOT-23")
    )
    (path "/6302d820-d6f5-4305-ad0d-e8c5809a3b5b/f05ad0e3-11f8-4733-b1bc-baca9a66fb6b"
      (reference "Q12") (unit 1) (value "SQ4184EY") (footprint "Package_TO_SOT_SMD:SOT-23")
    )
    (path "/12c1c2ee-7e1f-4688-810b-d69fb6626b8a/b5f07eba-4836-49b5-adc6-0d1256bef98c"
      (reference "Q13") (unit 1) (value "SQ418EY") (footprint "Package_TO_SOT_THT:TO-92_Inline")
    )
    (path "/12c1c2ee-7e1f-4688-810b-d69fb6626b8a/27e158ff-cc33-4b99-a566-c8ab9e6e757e"
      (reference "Q14") (unit 1) (value "SQ418EY") (footprint "Package_TO_SOT_THT:TO-92_Inline")
    )
    (path "/12c1c2ee-7e1f-4688-810b-d69fb6626b8a/dca51eef-1944-43cd-80b6-788eda937e7e"
      (reference "Q15") (unit 1) (value "SQ418EY") (footprint "Package_TO_SOT_THT:TO-92_Inline")
    )
    (path "/1d6bd551-6503-43fe-a12e-5443b441d2e6/a5e9df17-d4f3-43cf-a087-f1ae04f9d6e3"
      (reference "R3") (unit 1) (value "60") (footprint "Resistor_SMD:R_0603_1608Metric")
    )
    (path "/6302d820-d6f5-4305-ad0d-e8c5809a3b5b/52391c33-00ba-487c-b69b-f2e753cccf8e"
      (reference "R4") (unit 1) (value "375k") (footprint "Resistor_SMD:R_0603_1608Metric")
    )
    (path "/6302d820-d6f5-4305-ad0d-e8c5809a3b5b/dbff27ca-d343-44d2-b452-b386b3a2c97f"
      (reference "R5") (unit 1) (value "120k") (footprint "Resistor_SMD:R_0603_1608Metric")
    )
    (path "/6302d820-d6f5-4305-ad0d-e8c5809a3b5b/9baa2cf3-5c78-4529-b223-46f2ed509ad4"
      (reference "R8") (unit 1) (value "1k") (footprint "Resistor_SMD:R_0603_1608Metric")
    )
    (path "/6302d820-d6f5-4305-ad0d-e8c5809a3b5b/af76dee7-1ed8-40e8-8939-50bb9d45bb88"
      (reference "R9") (unit 1) (value "1k") (footprint "Resistor_SMD:R_0603_1608Metric")
    )
    (path "/6302d820-d6f5-4305-ad0d-e8c5809a3b5b/9506f4d2-a423-491c-a6ac-df027fe37460"
      (reference "R10") (unit 1) (value "25m") (footprint "Resistor_SMD:R_0603_1608Metric")
    )
    (path "/6302d820-d6f5-4305-ad0d-e8c5809a3b5b/e3368c5b-348f-4b22-b36f-50009b489bd5"
      (reference "R12") (unit 1) (value "1k") (footprint "Resistor_SMD:R_0603_1608Metric")
    )
    (path "/6302d820-d6f5-4305-ad0d-e8c5809a3b5b/ab16e400-906d-4773-9c4f-5a467633d03a"
      (reference "R13") (unit 1) (value "1k") (footprint "Resistor_SMD:R_0603_1608Metric")
    )
    (path "/6302d820-d6f5-4305-ad0d-e8c5809a3b5b/ddb5bd43-989d-4aee-a019-3f556d2c8a33"
      (reference "R14") (unit 1) (value "375k") (footprint "Resistor_SMD:R_0603_1608Metric")
    )
    (path "/6302d820-d6f5-4305-ad0d-e8c5809a3b5b/e3040c8e-a6e6-4c37-9a85-52c94a0e7521"
      (reference "R15") (unit 1) (value "120k") (footprint "Resistor_SMD:R_0603_1608Metric")
    )
    (path "/6302d820-d6f5-4305-ad0d-e8c5809a3b5b/4f6077b6-72ab-478b-9675-ad712347f486"
      (reference "R16") (unit 1) (value "25m") (footprint "Resistor_SMD:R_0603_1608Metric")
    )
    (path "/1d6bd551-6503-43fe-a12e-5443b441d2e6/a8d4bed3-61c9-424b-8ac6-438b2f1e2879"
      (reference "R17") (unit 1) (value "52k") (footprint "Resistor_SMD:R_0603_1608Metric")
    )
    (path "/6302d820-d6f5-4305-ad0d-e8c5809a3b5b/ce8cdaaa-3821-4dc1-b2c6-647a961e8552"
      (reference "R18") (unit 1) (value "1k") (footprint "Resistor_SMD:R_0603_1608Metric")
    )
    (path "/6302d820-d6f5-4305-ad0d-e8c5809a3b5b/57d61aeb-3105-4694-b043-e1a14d7c3729"
      (reference "R19") (unit 1) (value "1k") (footprint "Resistor_SMD:R_0603_1608Metric")
    )
    (path "/1d6bd551-6503-43fe-a12e-5443b441d2e6/20eaa6c1-e6ee-43c0-a669-24bf53f7255f"
      (reference "R20") (unit 1) (value "30k") (footprint "Resistor_SMD:R_0603_1608Metric")
    )
    (path "/1d6bd551-6503-43fe-a12e-5443b441d2e6/a4d70b41-c403-45ed-9e40-8ea62f926f1c"
      (reference "R21") (unit 1) (value "60") (footprint "Resistor_SMD:R_0603_1608Metric")
    )
    (path "/87de0029-62b0-4d50-a282-35d60fcdf853/5c83e36c-9296-41a5-958d-f8e5e4c02126"
      (reference "R22") (unit 1) (value "100k") (footprint "Resistor_SMD:R_0603_1608Metric")
    )
    (path "/87de0029-62b0-4d50-a282-35d60fcdf853/da26a432-2eda-4704-af4b-5520d9d4ff1b"
      (reference "R23") (unit 1) (value "0") (footprint "Resistor_SMD:R_0603_1608Metric")
    )
    (path "/3e32bed3-156e-4e7f-832d-c5691d7bb983/172d02a0-2585-499a-a100-4bd1ace83b6f"
      (reference "R24") (unit 1) (value "4.7k") (footprint "Resistor_SMD:R_0603_1608Metric")
    )
    (path "/3e32bed3-156e-4e7f-832d-c5691d7bb983/34f0f9f4-0b1a-47f5-a8db-81e0a985269e"
      (reference "R25") (unit 1) (value "1k") (footprint "Resistor_SMD:R_0603_1608Metric")
    )
    (path "/87de0029-62b0-4d50-a282-35d60fcdf853/a6fc9db3-a2a1-46bf-a62a-4f8dbe349cc3"
      (reference "R26") (unit 1) (value "100k") (footprint "Resistor_SMD:R_0603_1608Metric")
    )
    (path "/87de0029-62b0-4d50-a282-35d60fcdf853/fb76a5a7-1ff7-45d2-9d02-577cbeeafed9"
      (reference "R27") (unit 1) (value "0") (footprint "Resistor_SMD:R_0603_1608Metric")
    )
    (path "/926ce822-3149-43b3-a69b-199c0dc97a2a/72380746-149d-402b-b5ac-c86adf7bc5d1"
      (reference "R28") (unit 1) (value "10k") (footprint "Resistor_SMD:R_0603_1608Metric")
    )
    (path "/1d6bd551-6503-43fe-a12e-5443b441d2e6/8bb210cc-3640-4fd5-8159-6394fc8fb9b7"
      (reference "R30") (unit 1) (value "1k") (footprint "Resistor_SMD:R_0603_1608Metric")
    )
    (path "/554613b0-a55e-4fdb-9901-3167f4bdeae2/47202496-4e83-4a9f-921e-a65b1fe83e17"
      (reference "R31") (unit 1) (value "732k") (footprint "Resistor_SMD:R_0603_1608Metric")
    )
    (path "/554613b0-a55e-4fdb-9901-3167f4bdeae2/8394ec74-1388-415f-96a0-2b01686d3d79"
      (reference "R32") (unit 1) (value "100k") (footprint "Resistor_SMD:R_0603_1608Metric")
    )
    (path "/554613b0-a55e-4fdb-9901-3167f4bdeae2/86d0d25d-a1be-4ae1-a58a-ea5db1440da3"
      (reference "R33") (unit 1) (value "250k") (footprint "Resistor_SMD:R_0603_1608Metric")
    )
    (path "/926ce822-3149-43b3-a69b-199c0dc97a2a/ad20cd1b-118e-4c94-b6b5-84dabe7c6966"
      (reference "R34") (unit 1) (value "10k") (footprint "Resistor_SMD:R_0603_1608Metric")
    )
    (path "/554613b0-a55e-4fdb-9901-3167f4bdeae2/21c4c7d6-b2c2-4eae-9b5e-d9e420e77c96"
      (reference "R35") (unit 1) (value "92K") (footprint "Resistor_SMD:R_0603_1608Metric")
    )
    (path "/554613b0-a55e-4fdb-9901-3167f4bdeae2/4bbb80c5-9bcb-43f1-aade-cdf6be851fcb"
      (reference "R36") (unit 1) (value "28.7k") (footprint "Resistor_SMD:R_0603_1608Metric")
    )
    (path "/554613b0-a55e-4fdb-9901-3167f4bdeae2/a7de0b22-f150-4cd8-9143-d1e0ffa58938"
      (reference "R37") (unit 1) (value "137k") (footprint "Resistor_SMD:R_0603_1608Metric")
    )
    (path "/554613b0-a55e-4fdb-9901-3167f4bdeae2/5d1daa73-7d95-4536-aae6-7f498977a2c4"
      (reference "R38") (unit 1) (value "825k") (footprint "Resistor_SMD:R_0603_1608Metric")
    )
    (path "/ddc9d9b1-9b59-4944-87d2-e723be4f8e25/6529b792-152a-4c79-9134-b5a60850788a"
      (reference "R39") (unit 1) (value "100k") (footprint "Resistor_SMD:R_0603_1608Metric")
    )
    (path "/ddc9d9b1-9b59-4944-87d2-e723be4f8e25/159b5f49-f5b7-4a4b-ad10-17e448f5bb52"
      (reference "R40") (unit 1) (value "90k") (footprint "Resistor_SMD:R_0603_1608Metric")
    )
    (path "/ddc9d9b1-9b59-4944-87d2-e723be4f8e25/391f6822-a41a-4d25-a06a-0de0698dde49"
      (reference "R41") (unit 1) (value "100k") (footprint "Resistor_SMD:R_0603_1608Metric")
    )
    (path "/5db6ab01-4abd-43ae-970c-634a29fe1dc9/5741615f-e616-4fc1-a42f-262f8dd33a92"
      (reference "R42") (unit 1) (value "450k") (footprint "Resistor_SMD:R_0603_1608Metric")
    )
    (path "/5db6ab01-4abd-43ae-970c-634a29fe1dc9/0a99f22f-d064-4125-9998-7301f759a9d8"
      (reference "R43") (unit 1) (value "100k") (footprint "Resistor_SMD:R_0603_1608Metric")
    )
    (path "/ddc9d9b1-9b59-4944-87d2-e723be4f8e25/3e3691e9-854f-40f3-9960-ad7f388830bc"
      (reference "R44") (unit 1) (value "66k") (footprint "Resistor_SMD:R_0603_1608Metric")
    )
    (path "/87de0029-62b0-4d50-a282-35d60fcdf853/5ff58e37-06c9-4582-b1f8-dd4793a5679a"
      (reference "R45") (unit 1) (value "0") (footprint "Resistor_SMD:R_0603_1608Metric")
    )
    (path "/87de0029-62b0-4d50-a282-35d60fcdf853/e5573058-ea66-4f20-9e1c-475ccb23a0e0"
      (reference "R46") (unit 1) (value "100k") (footprint "Resistor_SMD:R_0603_1608Metric")
    )
    (path "/926ce822-3149-43b3-a69b-199c0dc97a2a/ea0e4060-1317-43e3-bfc5-cfe34e17b85f"
      (reference "R47") (unit 1) (value "0") (footprint "Resistor_SMD:R_0603_1608Metric")
    )
    (path "/926ce822-3149-43b3-a69b-199c0dc97a2a/f6ac17aa-2ab5-408b-9fe5-032b279fe27b"
      (reference "R48") (unit 1) (value "0") (footprint "Resistor_SMD:R_0603_1608Metric")
    )
    (path "/87de0029-62b0-4d50-a282-35d60fcdf853/3a7457b9-9da6-437e-8be4-8e9f0792eb6c"
      (reference "R49") (unit 1) (value "10k") (footprint "Resistor_SMD:R_0603_1608Metric")
    )
    (path "/87de0029-62b0-4d50-a282-35d60fcdf853/d8189f75-fe0f-4070-9e64-8ff686cd6929"
      (reference "R50") (unit 1) (value "10k") (footprint "Resistor_SMD:R_0603_1608Metric")
    )
    (path "/87de0029-62b0-4d50-a282-35d60fcdf853/7de45e95-f8ca-4a69-85aa-e0f0467fe563"
      (reference "R51") (unit 1) (value "10k") (footprint "Resistor_SMD:R_0603_1608Metric")
    )
    (path "/ddc9d9b1-9b59-4944-87d2-e723be4f8e25/84a05ef3-0905-4613-a2a9-e492eeaa4cb2"
      (reference "R52") (unit 1) (value "100k") (footprint "Resistor_SMD:R_0603_1608Metric")
    )
    (path "/ddc9d9b1-9b59-4944-87d2-e723be4f8e25/eb0f2cd8-2bba-4ce2-94df-e820f74ffaaa"
      (reference "R53") (unit 1) (value "20k") (footprint "Resistor_SMD:R_0603_1608Metric")
    )
    (path "/ddc9d9b1-9b59-4944-87d2-e723be4f8e25/102fde7d-117b-4cfa-b270-31a1f2d9a02b"
      (reference "R54") (unit 1) (value "100K") (footprint "Resistor_SMD:R_0603_1608Metric")
    )
    (path "/ddc9d9b1-9b59-4944-87d2-e723be4f8e25/f5051ae4-5b23-4903-ab0f-35466555524a"
      (reference "R55") (unit 1) (value "66k") (footprint "Resistor_SMD:R_0603_1608Metric")
    )
    (path "/ddc9d9b1-9b59-4944-87d2-e723be4f8e25/cf3fece2-f4a1-45fd-b88d-7dc11587dc25"
      (reference "R56") (unit 1) (value "100k") (footprint "Resistor_SMD:R_0603_1608Metric")
    )
    (path "/ddc9d9b1-9b59-4944-87d2-e723be4f8e25/55c9657c-0a61-4f95-a2c6-e7b51daae03e"
      (reference "R57") (unit 1) (value "66k") (footprint "Resistor_SMD:R_0603_1608Metric")
    )
    (path "/ddc9d9b1-9b59-4944-87d2-e723be4f8e25/c396849d-4fc3-4200-8deb-3d13a61aa9ab"
      (reference "R58") (unit 1) (value "100K") (footprint "Resistor_SMD:R_0603_1608Metric")
    )
    (path "/12c1c2ee-7e1f-4688-810b-d69fb6626b8a/bb9bd878-0d98-4cd7-af60-8c77669ebbf1"
      (reference "R59") (unit 1) (value "1k") (footprint "Resistor_SMD:R_0603_1608Metric")
    )
    (path "/12c1c2ee-7e1f-4688-810b-d69fb6626b8a/591d40a9-7e44-45fc-b757-6c0d7cce287f"
      (reference "R60") (unit 1) (value "100k") (footprint "Resistor_SMD:R_0603_1608Metric")
    )
    (path "/12c1c2ee-7e1f-4688-810b-d69fb6626b8a/044b8665-c36b-478b-a7bb-15465b093fb3"
      (reference "R61") (unit 1) (value "10K") (footprint "Resistor_SMD:R_0603_1608Metric")
    )
    (path "/ddc9d9b1-9b59-4944-87d2-e723be4f8e25/5f9e843a-3a60-49db-b539-928c6c38a070"
      (reference "R62") (unit 1) (value "154k") (footprint "Resistor_SMD:R_0603_1608Metric")
    )
    (path "/ddc9d9b1-9b59-4944-87d2-e723be4f8e25/eec27c41-7245-4703-9701-e2e22877f63f"
      (reference "R63") (unit 1) (value "100k") (footprint "Resistor_SMD:R_0603_1608Metric")
    )
    (path "/ddc9d9b1-9b59-4944-87d2-e723be4f8e25/50a6d484-67ff-40c3-9d58-2a088e0ae124"
      (reference "R64") (unit 1) (value "154k") (footprint "Resistor_SMD:R_0603_1608Metric")
    )
    (path "/12c1c2ee-7e1f-4688-810b-d69fb6626b8a/3bdaa391-0c47-418d-8019-b0cc211fe045"
      (reference "R65") (unit 1) (value "1k") (footprint "Resistor_SMD:R_0603_1608Metric")
    )
    (path "/12c1c2ee-7e1f-4688-810b-d69fb6626b8a/2446cef5-4cfb-4207-9acb-530ad2d564fa"
      (reference "R66") (unit 1) (value "100k") (footprint "Resistor_SMD:R_0603_1608Metric")
    )
    (path "/12c1c2ee-7e1f-4688-810b-d69fb6626b8a/37cbfbc7-47f3-4229-b5b7-b032e952666e"
      (reference "R67") (unit 1) (value "10K") (footprint "Resistor_SMD:R_0603_1608Metric")
    )
    (path "/12c1c2ee-7e1f-4688-810b-d69fb6626b8a/c29d62c6-f6af-410c-8ff8-0fa4bf5774c7"
      (reference "R68") (unit 1) (value "1k") (footprint "Resistor_SMD:R_0603_1608Metric")
    )
    (path "/12c1c2ee-7e1f-4688-810b-d69fb6626b8a/72892a32-a2db-4702-8803-d21cc726cc12"
      (reference "R69") (unit 1) (value "100k") (footprint "Resistor_SMD:R_0603_1608Metric")
    )
    (path "/12c1c2ee-7e1f-4688-810b-d69fb6626b8a/13bb9f9b-b19a-474d-9baf-fb5befa2cdf8"
      (reference "R70") (unit 1) (value "10K") (footprint "Resistor_SMD:R_0603_1608Metric")
    )
    (path "/87de0029-62b0-4d50-a282-35d60fcdf853/f13bec6e-fdeb-4eaf-8f01-4cc08796dfc4"
      (reference "R71") (unit 1) (value "10k") (footprint "Resistor_SMD:R_0603_1608Metric")
    )
    (path "/5db6ab01-4abd-43ae-970c-634a29fe1dc9/aa36473a-c941-4757-aee5-7ff9416e717a"
      (reference "R72") (unit 1) (value "10k") (footprint "Resistor_SMD:R_0603_1608Metric")
    )
    (path "/ddc9d9b1-9b59-4944-87d2-e723be4f8e25/b7b62e94-5d5b-4701-a65c-000de611ebcd"
      (reference "R73") (unit 1) (value "100k") (footprint "Resistor_SMD:R_0603_1608Metric")
    )
    (path "/ddc9d9b1-9b59-4944-87d2-e723be4f8e25/2b2b48b1-6c8d-4e5a-baea-2d00ee9bd769"
      (reference "R74") (unit 1) (value "154k") (footprint "Resistor_SMD:R_0603_1608Metric")
    )
    (path "/ddc9d9b1-9b59-4944-87d2-e723be4f8e25/baa5c6a2-a6b7-4783-95ea-0b26f54dbafd"
      (reference "R75") (unit 1) (value "100k") (footprint "Resistor_SMD:R_0603_1608Metric")
    )
    (path "/ddc9d9b1-9b59-4944-87d2-e723be4f8e25/44137a50-4300-48b2-94e9-ac3039c9b564"
      (reference "R76") (unit 1) (value "154k") (footprint "Resistor_SMD:R_0603_1608Metric")
    )
    (path "/1d6bd551-6503-43fe-a12e-5443b441d2e6/be4fbb25-fa6a-45a4-a97d-7f95bff4d0b4"
      (reference "R77") (unit 1) (value "10m") (footprint "Resistor_SMD:R_0603_1608Metric")
    )
    (path "/1d6bd551-6503-43fe-a12e-5443b441d2e6/c208e1c9-a53e-4ae3-baf1-c0c016a232ae"
      (reference "R78") (unit 1) (value "10m") (footprint "Resistor_SMD:R_0603_1608Metric")
    )
    (path "/1d6bd551-6503-43fe-a12e-5443b441d2e6/e1d6e986-9c8f-43c4-9fec-88f69fceec5c"
      (reference "R79") (unit 1) (value "10m") (footprint "Resistor_SMD:R_0603_1608Metric")
    )
    (path "/5db6ab01-4abd-43ae-970c-634a29fe1dc9/bbea9874-6fa2-4cb6-b3c6-28a125ca55c3"
      (reference "R80") (unit 1) (value "10k") (footprint "Resistor_SMD:R_0603_1608Metric")
    )
    (path "/af95d319-466c-4b4f-822e-6257b41c2e95/6a412508-d456-4f95-8540-945a8752bf40"
      (reference "R81") (unit 1) (value "10m") (footprint "Resistor_SMD:R_0603_1608Metric")
    )
    (path "/af95d319-466c-4b4f-822e-6257b41c2e95/a41bf585-cacf-41d0-a18c-4f71daf29ae7"
      (reference "R82") (unit 1) (value "10m") (footprint "Resistor_SMD:R_0603_1608Metric")
    )
    (path "/af95d319-466c-4b4f-822e-6257b41c2e95/7a45a2b9-24d0-470f-b654-d492f05a8bdd"
      (reference "R83") (unit 1) (value "10m") (footprint "Resistor_SMD:R_0603_1608Metric")
    )
    (path "/af95d319-466c-4b4f-822e-6257b41c2e95/d024fb14-c866-4f47-a937-66a09f1b9f86"
      (reference "R84") (unit 1) (value "10m") (footprint "Resistor_SMD:R_0603_1608Metric")
    )
    (path "/af95d319-466c-4b4f-822e-6257b41c2e95/f6f88938-11c6-4adf-86dc-578b2c9f7eeb"
      (reference "R85") (unit 1) (value "10m") (footprint "Resistor_SMD:R_0603_1608Metric")
    )
    (path "/af95d319-466c-4b4f-822e-6257b41c2e95/f6b1bd7c-ed1d-4c94-a572-ed5df5f0ba08"
      (reference "R86") (unit 1) (value "10m") (footprint "Resistor_SMD:R_0603_1608Metric")
    )
    (path "/af95d319-466c-4b4f-822e-6257b41c2e95/023fd520-521e-4ddf-9988-25ad1451bdbf"
      (reference "R87") (unit 1) (value "10m") (footprint "Resistor_SMD:R_0603_1608Metric")
    )
    (path "/5db6ab01-4abd-43ae-970c-634a29fe1dc9/78e2c92b-4f04-4e12-97c4-7133402885b7"
      (reference "R88") (unit 1) (value "10k") (footprint "Resistor_SMD:R_0603_1608Metric")
    )
    (path "/5db6ab01-4abd-43ae-970c-634a29fe1dc9/67b35ec5-c9bd-4e0a-a6f5-9757bf93fdb0"
      (reference "R89") (unit 1) (value "10k") (footprint "Resistor_SMD:R_0603_1608Metric")
    )
    (path "/87de0029-62b0-4d50-a282-35d60fcdf853/3a8625c4-cac5-408b-8b19-4eea7cebdada"
      (reference "R90") (unit 1) (value "0") (footprint "Resistor_SMD:R_0603_1608Metric")
    )
    (path "/87de0029-62b0-4d50-a282-35d60fcdf853/637e6ba4-0f5c-4ecd-b630-6399783462cd"
      (reference "R91") (unit 1) (value "100k") (footprint "Resistor_SMD:R_0603_1608Metric")
    )
    (path "/87de0029-62b0-4d50-a282-35d60fcdf853/f782f442-d2a6-4642-8406-b217c95ae0a4"
      (reference "R92") (unit 1) (value "0") (footprint "Resistor_SMD:R_0603_1608Metric")
    )
    (path "/87de0029-62b0-4d50-a282-35d60fcdf853/fc0af7ca-384d-4070-aae1-ecd1bec3b9c9"
      (reference "R93") (unit 1) (value "100k") (footprint "Resistor_SMD:R_0603_1608Metric")
    )
    (path "/554613b0-a55e-4fdb-9901-3167f4bdeae2/79e9dfbc-bf81-4407-83b1-734f6fbfaa74"
      (reference "R94") (unit 1) (value "10k") (footprint "Resistor_SMD:R_0603_1608Metric")
    )
    (path "/5db6ab01-4abd-43ae-970c-634a29fe1dc9/bcf93a1c-9ad1-4721-8ac7-53096936f972"
      (reference "R95") (unit 1) (value "10k") (footprint "Resistor_SMD:R_0603_1608Metric")
    )
    (path "/12c1c2ee-7e1f-4688-810b-d69fb6626b8a/f8e5fba8-f439-4929-b49f-53efa5189914"
      (reference "R96") (unit 1) (value "10K") (footprint "Resistor_SMD:R_0201_0603Metric")
    )
    (path "/12c1c2ee-7e1f-4688-810b-d69fb6626b8a/b944264c-f3e0-4e71-9f9f-2dba079ef7dc"
      (reference "R97") (unit 1) (value "10K") (footprint "Resistor_SMD:R_0201_0603Metric")
    )
    (path "/12c1c2ee-7e1f-4688-810b-d69fb6626b8a/200acf2c-7978-47e5-9c2f-f7088dd4d91b"
      (reference "R98") (unit 1) (value "10K") (footprint "Resistor_SMD:R_0201_0603Metric")
    )
    (path "/5db6ab01-4abd-43ae-970c-634a29fe1dc9/62c8566b-d07f-4533-b72d-bde6d8b63ae8"
      (reference "R99") (unit 1) (value "384K") (footprint "Resistor_SMD:R_0603_1608Metric")
    )
    (path "/5db6ab01-4abd-43ae-970c-634a29fe1dc9/9df39831-e958-431e-8b7e-4bfd4bfbb61c"
      (reference "R100") (unit 1) (value "127K") (footprint "Resistor_SMD:R_0603_1608Metric")
    )
    (path "/926ce822-3149-43b3-a69b-199c0dc97a2a/f7138def-b504-422d-8e04-f4c022208b9d"
      (reference "R101") (unit 1) (value "100k") (footprint "Resistor_SMD:R_0603_1608Metric")
    )
    (path "/926ce822-3149-43b3-a69b-199c0dc97a2a/a51d0ca1-104b-42db-84bf-0495240f6049"
      (reference "R102") (unit 1) (value "100k") (footprint "Resistor_SMD:R_0603_1608Metric")
    )
    (path "/926ce822-3149-43b3-a69b-199c0dc97a2a/9df7805e-9cfd-4ba9-9209-5b3e04f2f8c9"
      (reference "R103") (unit 1) (value "100") (footprint "Resistor_SMD:R_0603_1608Metric")
    )
    (path "/926ce822-3149-43b3-a69b-199c0dc97a2a/c530b465-522b-4cd9-b502-3ce82401a0e7"
      (reference "R104") (unit 1) (value "100") (footprint "Resistor_SMD:R_0603_1608Metric")
    )
    (path "/6302d820-d6f5-4305-ad0d-e8c5809a3b5b/7b30c3ed-159d-4ff7-9228-bed2baf955a5"
      (reference "SPV1") (unit 1) (value "SPV1040") (footprint "Package_SO:TSSOP-8_4.4x3mm_P0.65mm")
    )
    (path "/6302d820-d6f5-4305-ad0d-e8c5809a3b5b/bda4c519-7143-4713-a582-a178964d8951"
      (reference "SPV2") (unit 1) (value "SPV1040") (footprint "Package_SO:TSSOP-8_4.4x3mm_P0.65mm")
    )
    (path "/3e32bed3-156e-4e7f-832d-c5691d7bb983/87c0aaaa-b622-456e-b21e-37d739335d74"
      (reference "STM1") (unit 1) (value "STM32") (footprint "Package_DFN_QFN:QFN-64-1EP_9x9mm_P0.5mm_EP7.65x7.65mm")
    )
    (path "/3e32bed3-156e-4e7f-832d-c5691d7bb983/ba417b87-3a07-4180-9185-664620e1b03a"
      (reference "SW1") (unit 1) (value "SW_DIP_x01") (footprint "Button_Switch_SMD:SW_SPST_B3U-1000P")
    )
    (path "/1d6bd551-6503-43fe-a12e-5443b441d2e6/b6802e6d-e5b8-45da-9900-042a93a8c62f"
      (reference "TCAN1") (unit 1) (value "TCAN332") (footprint "Package_SO:SOIC-8-1EP_3.9x4.9mm_P1.27mm_EP2.29x3mm")
    )
    (path "/87de0029-62b0-4d50-a282-35d60fcdf853/0ca82761-e7dd-43b6-8f5e-ce87d065e5dd"
      (reference "TEMP7") (unit 1) (value "LM75BD") (footprint "Package_SO:SOIC-8_3.9x4.9mm_P1.27mm")
    )
    (path "/87de0029-62b0-4d50-a282-35d60fcdf853/bb558416-9f96-4a7c-9813-f8d6ef25f985"
      (reference "TEMP8") (unit 1) (value "LM75B") (footprint "Package_SO:SOIC-8_3.9x4.9mm_P1.27mm")
    )
    (path "/87de0029-62b0-4d50-a282-35d60fcdf853/884c8bf1-c47f-41a7-bada-588d402aefba"
      (reference "TEMP9") (unit 1) (value "LM75B") (footprint "Package_SO:SOIC-8_3.9x4.9mm_P1.27mm")
    )
    (path "/6302d820-d6f5-4305-ad0d-e8c5809a3b5b/cfa0f46c-d3b3-46f1-b52f-24f6100b5be8"
      (reference "U$2") (unit 1) (value "PMEG3020EP") (footprint "Diode_SMD:D_SOD-128")
    )
    (path "/6302d820-d6f5-4305-ad0d-e8c5809a3b5b/b49ad396-a47f-44e7-8870-e1a503667100"
      (reference "U$3") (unit 1) (value "PMEG3020EP") (footprint "Diode_SMD:D_SOD-128")
    )
    (path "/6302d820-d6f5-4305-ad0d-e8c5809a3b5b/37f2580b-9c14-4d37-89b8-c49387eb7af8"
      (reference "U$4") (unit 1) (value "PMEG3020EP") (footprint "Diode_SMD:D_SOD-128")
    )
    (path "/6302d820-d6f5-4305-ad0d-e8c5809a3b5b/02423c01-8143-4de9-aad0-57e4ee431a79"
      (reference "U$5") (unit 1) (value "PMEG3020EP") (footprint "Diode_SMD:D_SOD-128")
    )
    (path "/6302d820-d6f5-4305-ad0d-e8c5809a3b5b/b5996a11-427f-4ccd-af44-cefcd1f630ce"
      (reference "U$6") (unit 1) (value "PMEG3020EP") (footprint "Diode_SMD:D_SOD-128")
    )
    (path "/6302d820-d6f5-4305-ad0d-e8c5809a3b5b/b0712178-1cb2-42e5-b9ee-a4c53be36d2a"
      (reference "U$7") (unit 1) (value "PMEG3020EP") (footprint "Diode_SMD:D_SOD-128")
    )
    (path "/87de0029-62b0-4d50-a282-35d60fcdf853/7abbcec2-e865-49e6-9b43-74db9ae19365"
      (reference "U$11") (unit 1) (value "2N7002NX") (footprint "Package_TO_SOT_SMD:SOT-23")
    )
    (path "/6302d820-d6f5-4305-ad0d-e8c5809a3b5b/fd4da49c-73ce-4062-b052-ca64a010b8eb"
      (reference "U$13") (unit 1) (value "ZENER52V") (footprint "Diode_SMD:D_SOD-110")
    )
    (path "/6302d820-d6f5-4305-ad0d-e8c5809a3b5b/9c0b67f5-a08e-49d0-b273-0320a8a01842"
      (reference "U$14") (unit 1) (value "ZENER52V") (footprint "Diode_SMD:D_SOD-110")
    )
    (path "/87de0029-62b0-4d50-a282-35d60fcdf853/49ecfe70-37c9-4483-ae92-8b9394bf0c1c"
      (reference "U$15") (unit 1) (value "SN74AHC1G02") (footprint "Package_SO:TSOP-5_1.65x3.05mm_P0.95mm")
    )
    (path "/87de0029-62b0-4d50-a282-35d60fcdf853/3c6ba0df-a44a-46c2-895b-9f6b1708a725"
      (reference "U$16") (unit 1) (value "2N7002NX") (footprint "Package_TO_SOT_SMD:SOT-23")
    )
    (path "/12c1c2ee-7e1f-4688-810b-d69fb6626b8a/caad7f8d-9ef5-43a4-a8f4-7967a050e573"
      (reference "U$17") (unit 1) (value "LM74610SOP-8") (footprint "SOIC-8-1EP_3.9x4.9mm_P1.27mm_EP2.41x3.3mm")
    )
    (path "/12c1c2ee-7e1f-4688-810b-d69fb6626b8a/18178162-9d6a-4e30-a823-33196038379e"
      (reference "U$18") (unit 1) (value "LM74610SOP-8") (footprint "SOIC-8-1EP_3.9x4.9mm_P1.27mm_EP2.41x3.3mm")
    )
    (path "/12c1c2ee-7e1f-4688-810b-d69fb6626b8a/692273ac-f890-42ad-a6f1-57cf11faa6f3"
      (reference "U$19") (unit 1) (value "LM74610SOP-8") (footprint "SOIC-8-1EP_3.9x4.9mm_P1.27mm_EP2.41x3.3mm")
    )
    (path "/87de0029-62b0-4d50-a282-35d60fcdf853/45f376f9-274b-47b9-b397-62fcec60c22a"
      (reference "U$22") (unit 1) (value "2N7002NX") (footprint "Package_TO_SOT_SMD:SOT-23")
    )
    (path "/87de0029-62b0-4d50-a282-35d60fcdf853/791bcefd-2467-480a-9b86-baa371e13360"
      (reference "U$27") (unit 1) (value "2N7002NX") (footprint "Package_TO_SOT_SMD:SOT-23")
    )
    (path "/87de0029-62b0-4d50-a282-35d60fcdf853/0f404aeb-f65a-494d-a766-c1621bf231a5"
      (reference "U$28") (unit 1) (value "2N7002NX") (footprint "Package_TO_SOT_SMD:SOT-23")
    )
    (path "/6302d820-d6f5-4305-ad0d-e8c5809a3b5b/a7001cad-f172-4192-bb86-264c1f6a6b84"
      (reference "U1") (unit 1) (value "LM74610SOP-8") (footprint "Package_SO:VSSOP-8_3.0x3.0mm_P0.65mm")
    )
    (path "/6302d820-d6f5-4305-ad0d-e8c5809a3b5b/3733e69a-55de-48a6-ae5c-036040f24e19"
      (reference "U2") (unit 1) (value "LM74610SOP-8") (footprint "Package_SO:VSSOP-8_3.0x3.0mm_P0.65mm")
    )
    (path "/5db6ab01-4abd-43ae-970c-634a29fe1dc9/2e3e6470-472a-4934-8f52-560a02447266"
      (reference "U3") (unit 1) (value "TPS62827") (footprint "Audio_Module:Reverb_BTDR-1H")
    )
    (path "/554613b0-a55e-4fdb-9901-3167f4bdeae2/ebcb95ba-11cd-48c5-9d33-813813a8c6f3"
      (reference "U4") (unit 1) (value "TPS61022") (footprint "VQFN-HR")
    )
    (path "/554613b0-a55e-4fdb-9901-3167f4bdeae2/92a934a6-2a0d-43b5-848d-3adaa312c8a0"
      (reference "U5") (unit 1) (value "TPS61088") (footprint "Package_DFN_QFN:Texas_VQFN-RHL-20")
    )
    (path "/926ce822-3149-43b3-a69b-199c0dc97a2a/98924df2-215d-42f9-88da-42607b76b511"
      (reference "U7") (unit 1) (value "SD CARD") (footprint "Connector_Card:microSD_HC_Molex_104031-0811")
    )
    (path "/1d6bd551-6503-43fe-a12e-5443b441d2e6/ca8f2b19-10e3-4f08-92ab-7b0967c5b068"
      (reference "U10") (unit 1) (value "ESD-DIODESOT-23") (footprint "Package_TO_SOT_SMD:SOT-23")
    )
  )
)
