(kicad_symbol_lib (version 20211014) (generator kicad_symbol_editor)
  (symbol "FRAM_WR" (in_bom yes) (on_board yes)
    (property "Reference" "JP" (id 0) (at 2.54 0 0)
      (effects (font (size 1.27 1.27)))
    )
    (property "Value" "FRAM_WR" (id 1) (at -5.08 0 0)
      (effects (font (size 1.27 1.27)))
    )
    (property "Footprint" "" (id 2) (at 0 0 0)
      (effects (font (size 1.27 1.27)) hide)
    )
    (property "Datasheet" "" (id 3) (at 0 0 0)
      (effects (font (size 1.27 1.27)) hide)
    )
    (symbol "FRAM_WR_0_0"
      (rectangle (start -5.08 -5.08) (end 1.27 -7.62)
        (stroke (width 0) (type default) (color 0 0 0 0))
        (fill (type none))
      )
      (polyline
        (pts
          (xy -3.81 -3.81)
          (xy -3.81 -10.16)
        )
        (stroke (width 0) (type default) (color 0 0 0 0))
        (fill (type none))
      )
      (polyline
        (pts
          (xy 0 -3.81)
          (xy 0 -10.16)
        )
        (stroke (width 0) (type default) (color 0 0 0 0))
        (fill (type none))
      )
    )
    (symbol "FRAM_WR_1_1"
      (pin input line (at -3.81 -12.7 90) (length 2.54)
        (name "" (effects (font (size 1.27 1.27))))
        (number "1" (effects (font (size 1.27 1.27))))
      )
      (pin input line (at 0 -12.7 90) (length 2.54)
        (name "" (effects (font (size 1.27 1.27))))
        (number "2" (effects (font (size 1.27 1.27))))
      )
    )
  )
  (symbol "INA190" (in_bom yes) (on_board yes)
    (property "Reference" "INA" (id 0) (at -7.62 0 0)
      (effects (font (size 1.27 1.27)))
    )
    (property "Value" "INA190" (id 1) (at 3.81 0 0)
      (effects (font (size 1.27 1.27)))
    )
    (property "Footprint" "" (id 2) (at -1.27 0 0)
      (effects (font (size 1.27 1.27)) hide)
    )
    (property "Datasheet" "" (id 3) (at -1.27 0 0)
      (effects (font (size 1.27 1.27)) hide)
    )
    (symbol "INA190_0_1"
      (rectangle (start -8.89 -1.27) (end 6.35 -13.97)
        (stroke (width 0) (type default) (color 0 0 0 0))
        (fill (type none))
      )
    )
    (symbol "INA190_1_1"
      (pin input line (at 8.89 -10.16 180) (length 2.54)
        (name "REF" (effects (font (size 1.27 1.27))))
        (number "1" (effects (font (size 1.27 1.27))))
      )
      (pin input line (at -1.27 -16.51 90) (length 2.54)
        (name "GND" (effects (font (size 1.27 1.27))))
        (number "2" (effects (font (size 1.27 1.27))))
      )
      (pin input line (at -1.27 1.27 270) (length 2.54)
        (name "VS" (effects (font (size 1.27 1.27))))
        (number "3" (effects (font (size 1.27 1.27))))
      )
      (pin input line (at -11.43 -10.16 0) (length 2.54)
        (name "IN+" (effects (font (size 1.27 1.27))))
        (number "4" (effects (font (size 1.27 1.27))))
      )
      (pin input line (at -11.43 -5.08 0) (length 2.54)
        (name "IN-" (effects (font (size 1.27 1.27))))
        (number "5" (effects (font (size 1.27 1.27))))
      )
      (pin input line (at 8.89 -5.08 180) (length 2.54)
        (name "OUT" (effects (font (size 1.27 1.27))))
        (number "6" (effects (font (size 1.27 1.27))))
      )
    )
  )
  (symbol "L-EUL2012C" (pin_numbers hide) (in_bom yes) (on_board yes)
    (property "Reference" "L" (id 0) (at -5.08 -12.7 0)
      (effects (font (size 1.27 1.27)))
    )
    (property "Value" "L-EUL2012C" (id 1) (at 0 -8.89 0)
      (effects (font (size 1.27 1.27)))
    )
    (property "Footprint" "" (id 2) (at 0 0 0)
      (effects (font (size 1.27 1.27)) hide)
    )
    (property "Datasheet" "" (id 3) (at 0 0 0)
      (effects (font (size 1.27 1.27)) hide)
    )
    (symbol "L-EUL2012C_0_1"
      (rectangle (start -8.89 -7.62) (end -6.35 -16.51)
        (stroke (width 0) (type default) (color 0 0 0 0))
        (fill (type background))
      )
    )
    (symbol "L-EUL2012C_1_1"
      (pin input line (at -7.62 -5.08 270) (length 2.54)
        (name "" (effects (font (size 1.27 1.27))))
        (number "1" (effects (font (size 1.27 1.27))))
      )
      (pin input line (at -7.62 -19.05 90) (length 2.54)
        (name "" (effects (font (size 1.27 1.27))))
        (number "2" (effects (font (size 1.27 1.27))))
      )
    )
  )
  (symbol "LM74610SOP-8" (pin_numbers hide) (in_bom yes) (on_board yes)
    (property "Reference" "U" (id 0) (at 7.62 -10.16 0)
      (effects (font (size 1.27 1.27)))
    )
    (property "Value" "LM74610SOP-8" (id 1) (at 13.97 -7.62 0)
      (effects (font (size 1.27 1.27)))
    )
    (property "Footprint" "" (id 2) (at 0 0 0)
      (effects (font (size 1.27 1.27)) hide)
    )
    (property "Datasheet" "" (id 3) (at 0 0 0)
      (effects (font (size 1.27 1.27)) hide)
    )
    (symbol "LM74610SOP-8_0_1"
      (rectangle (start -6.35 -6.35) (end 6.35 -21.59)
        (stroke (width 0) (type default) (color 0 0 0 0))
        (fill (type none))
      )
    )
    (symbol "LM74610SOP-8_1_1"
      (pin input line (at 3.81 -24.13 90) (length 2.54)
        (name "CL" (effects (font (size 1.27 1.27))))
        (number "1" (effects (font (size 1.27 1.27))))
      )
      (pin input line (at 3.81 -3.81 270) (length 2.54)
        (name "GPD" (effects (font (size 1.27 1.27))))
        (number "2" (effects (font (size 1.27 1.27))))
      )
      (pin input line (at -8.89 -13.97 0) (length 2.54)
        (name "A" (effects (font (size 1.27 1.27))))
        (number "4" (effects (font (size 1.27 1.27))))
      )
      (pin input line (at -3.81 -3.81 270) (length 2.54)
        (name "GATE" (effects (font (size 1.27 1.27))))
        (number "6" (effects (font (size 1.27 1.27))))
      )
      (pin input line (at -3.81 -24.13 90) (length 2.54)
        (name "CH" (effects (font (size 1.27 1.27))))
        (number "7" (effects (font (size 1.27 1.27))))
      )
      (pin input line (at 8.89 -13.97 180) (length 2.54)
        (name "C" (effects (font (size 1.27 1.27))))
        (number "8" (effects (font (size 1.27 1.27))))
      )
    )
  )
  (symbol "MAX11633EEG" (in_bom yes) (on_board yes)
    (property "Reference" "ADC" (id 0) (at 6.35 0 0)
      (effects (font (size 1.27 1.27)))
    )
    (property "Value" "MAX11633EEG" (id 1) (at -5.08 0 0)
      (effects (font (size 1.27 1.27)))
    )
    (property "Footprint" "" (id 2) (at 0 0 0)
      (effects (font (size 1.27 1.27)) hide)
    )
    (property "Datasheet" "" (id 3) (at 0 0 0)
      (effects (font (size 1.27 1.27)) hide)
    )
    (symbol "MAX11633EEG_0_1"
      (rectangle (start -12.7 -2.54) (end 6.35 -45.72)
        (stroke (width 0) (type default) (color 0 0 0 0))
        (fill (type none))
      )
    )
    (symbol "MAX11633EEG_1_1"
      (pin input line (at 8.89 -5.08 180) (length 2.54)
        (name "A0" (effects (font (size 1.27 1.27))))
        (number "1" (effects (font (size 1.27 1.27))))
      )
      (pin input line (at 8.89 -27.94 180) (length 2.54)
        (name "A9" (effects (font (size 1.27 1.27))))
        (number "10" (effects (font (size 1.27 1.27))))
      )
      (pin input line (at 8.89 -30.48 180) (length 2.54)
        (name "A10" (effects (font (size 1.27 1.27))))
        (number "11" (effects (font (size 1.27 1.27))))
      )
      (pin input line (at 8.89 -33.02 180) (length 2.54)
        (name "A11" (effects (font (size 1.27 1.27))))
        (number "12" (effects (font (size 1.27 1.27))))
      )
      (pin input line (at 8.89 -35.56 180) (length 2.54)
        (name "A12" (effects (font (size 1.27 1.27))))
        (number "13" (effects (font (size 1.27 1.27))))
      )
      (pin input line (at 8.89 -38.1 180) (length 2.54)
        (name "A13" (effects (font (size 1.27 1.27))))
        (number "14" (effects (font (size 1.27 1.27))))
      )
      (pin input line (at 8.89 -40.64 180) (length 2.54)
        (name "A14" (effects (font (size 1.27 1.27))))
        (number "15" (effects (font (size 1.27 1.27))))
      )
      (pin input line (at 8.89 -43.18 180) (length 2.54)
        (name "CNVST/A15" (effects (font (size 1.27 1.27))))
        (number "16" (effects (font (size 1.27 1.27))))
      )
      (pin input line (at -15.24 -7.62 0) (length 2.54)
        (name "REF" (effects (font (size 1.27 1.27))))
        (number "17" (effects (font (size 1.27 1.27))))
      )
      (pin input line (at -15.24 -10.16 0) (length 2.54)
        (name "GND" (effects (font (size 1.27 1.27))))
        (number "18" (effects (font (size 1.27 1.27))))
      )
      (pin input line (at -15.24 -5.08 0) (length 2.54)
        (name "VDD" (effects (font (size 1.27 1.27))))
        (number "19" (effects (font (size 1.27 1.27))))
      )
      (pin input line (at 8.89 -7.62 180) (length 2.54)
        (name "A1" (effects (font (size 1.27 1.27))))
        (number "2" (effects (font (size 1.27 1.27))))
      )
      (pin input line (at -15.24 -15.24 0) (length 2.54)
        (name "CS" (effects (font (size 1.27 1.27))))
        (number "20" (effects (font (size 1.27 1.27))))
      )
      (pin input line (at -15.24 -17.78 0) (length 2.54)
        (name "SCLK" (effects (font (size 1.27 1.27))))
        (number "21" (effects (font (size 1.27 1.27))))
      )
      (pin input line (at -15.24 -20.32 0) (length 2.54)
        (name "DIN" (effects (font (size 1.27 1.27))))
        (number "22" (effects (font (size 1.27 1.27))))
      )
      (pin input line (at -15.24 -22.86 0) (length 2.54)
        (name "DOUT" (effects (font (size 1.27 1.27))))
        (number "23" (effects (font (size 1.27 1.27))))
      )
      (pin input line (at -15.24 -25.4 0) (length 2.54)
        (name "EOC" (effects (font (size 1.27 1.27))))
        (number "24" (effects (font (size 1.27 1.27))))
      )
      (pin input line (at 8.89 -10.16 180) (length 2.54)
        (name "A2" (effects (font (size 1.27 1.27))))
        (number "3" (effects (font (size 1.27 1.27))))
      )
      (pin input line (at 8.89 -12.7 180) (length 2.54)
        (name "A3" (effects (font (size 1.27 1.27))))
        (number "4" (effects (font (size 1.27 1.27))))
      )
      (pin input line (at 8.89 -15.24 180) (length 2.54)
        (name "A4" (effects (font (size 1.27 1.27))))
        (number "5" (effects (font (size 1.27 1.27))))
      )
      (pin input line (at 8.89 -17.78 180) (length 2.54)
        (name "A5" (effects (font (size 1.27 1.27))))
        (number "6" (effects (font (size 1.27 1.27))))
      )
      (pin input line (at 8.89 -20.32 180) (length 2.54)
        (name "A6" (effects (font (size 1.27 1.27))))
        (number "7" (effects (font (size 1.27 1.27))))
      )
      (pin input line (at 8.89 -22.86 180) (length 2.54)
        (name "A7" (effects (font (size 1.27 1.27))))
        (number "8" (effects (font (size 1.27 1.27))))
      )
      (pin input line (at 8.89 -25.4 180) (length 2.54)
        (name "A8" (effects (font (size 1.27 1.27))))
        (number "9" (effects (font (size 1.27 1.27))))
      )
    )
  )
  (symbol "MAX11639EEE" (in_bom yes) (on_board yes)
    (property "Reference" "ADC" (id 0) (at 2.54 0 0)
      (effects (font (size 1.27 1.27)))
    )
    (property "Value" "MAX11639EEE" (id 1) (at -7.62 0 0)
      (effects (font (size 1.27 1.27)))
    )
    (property "Footprint" "" (id 2) (at 0 0 0)
      (effects (font (size 1.27 1.27)) hide)
    )
    (property "Datasheet" "" (id 3) (at 0 0 0)
      (effects (font (size 1.27 1.27)) hide)
    )
    (symbol "MAX11639EEE_0_1"
      (rectangle (start -13.97 -2.54) (end 6.35 -27.94)
        (stroke (width 0) (type default) (color 0 0 0 0))
        (fill (type none))
      )
    )
    (symbol "MAX11639EEE_1_1"
      (pin input line (at 8.89 -5.08 180) (length 2.54)
        (name "A0" (effects (font (size 1.27 1.27))))
        (number "1" (effects (font (size 1.27 1.27))))
      )
      (pin input line (at -16.51 -10.16 0) (length 2.54)
        (name "GND" (effects (font (size 1.27 1.27))))
        (number "10" (effects (font (size 1.27 1.27))))
      )
      (pin input line (at -16.51 -5.08 0) (length 2.54)
        (name "VDD" (effects (font (size 1.27 1.27))))
        (number "11" (effects (font (size 1.27 1.27))))
      )
      (pin input line (at -16.51 -15.24 0) (length 2.54)
        (name "CS" (effects (font (size 1.27 1.27))))
        (number "12" (effects (font (size 1.27 1.27))))
      )
      (pin input line (at -16.51 -17.78 0) (length 2.54)
        (name "SCLK" (effects (font (size 1.27 1.27))))
        (number "13" (effects (font (size 1.27 1.27))))
      )
      (pin input line (at -16.51 -20.32 0) (length 2.54)
        (name "DIN" (effects (font (size 1.27 1.27))))
        (number "14" (effects (font (size 1.27 1.27))))
      )
      (pin input line (at -16.51 -22.86 0) (length 2.54)
        (name "DOUT" (effects (font (size 1.27 1.27))))
        (number "15" (effects (font (size 1.27 1.27))))
      )
      (pin input line (at -16.51 -25.4 0) (length 2.54)
        (name "EOC" (effects (font (size 1.27 1.27))))
        (number "16" (effects (font (size 1.27 1.27))))
      )
      (pin input line (at 8.89 -7.62 180) (length 2.54)
        (name "A1" (effects (font (size 1.27 1.27))))
        (number "2" (effects (font (size 1.27 1.27))))
      )
      (pin input line (at 8.89 -10.16 180) (length 2.54)
        (name "A2" (effects (font (size 1.27 1.27))))
        (number "3" (effects (font (size 1.27 1.27))))
      )
      (pin input line (at 8.89 -12.7 180) (length 2.54)
        (name "A3" (effects (font (size 1.27 1.27))))
        (number "4" (effects (font (size 1.27 1.27))))
      )
      (pin input line (at 8.89 -15.24 180) (length 2.54)
        (name "A4" (effects (font (size 1.27 1.27))))
        (number "5" (effects (font (size 1.27 1.27))))
      )
      (pin input line (at 8.89 -17.78 180) (length 2.54)
        (name "A5" (effects (font (size 1.27 1.27))))
        (number "6" (effects (font (size 1.27 1.27))))
      )
      (pin input line (at 8.89 -20.32 180) (length 2.54)
        (name "A6" (effects (font (size 1.27 1.27))))
        (number "7" (effects (font (size 1.27 1.27))))
      )
      (pin input line (at 8.89 -22.86 180) (length 2.54)
        (name "CNVST/A7" (effects (font (size 1.27 1.27))))
        (number "8" (effects (font (size 1.27 1.27))))
      )
      (pin input line (at -16.51 -7.62 0) (length 2.54)
        (name "REF" (effects (font (size 1.27 1.27))))
        (number "9" (effects (font (size 1.27 1.27))))
      )
    )
  )
  (symbol "MOLEX2" (in_bom yes) (on_board yes)
    (property "Reference" "M2" (id 0) (at 11.43 -2.54 0)
      (effects (font (size 1.27 1.27)))
    )
    (property "Value" "MOLEX2" (id 1) (at 3.81 -2.54 0)
      (effects (font (size 1.27 1.27)))
    )
    (property "Footprint" "" (id 2) (at 0 0 0)
      (effects (font (size 1.27 1.27)) hide)
    )
    (property "Datasheet" "" (id 3) (at 0 0 0)
      (effects (font (size 1.27 1.27)) hide)
    )
    (symbol "MOLEX2_0_1"
      (rectangle (start 0 -3.81) (end 13.97 -8.89)
        (stroke (width 0) (type default) (color 0 0 0 0))
        (fill (type none))
      )
    )
    (symbol "MOLEX2_1_1"
      (pin input line (at -2.54 -5.08 0) (length 2.54)
        (name "P1" (effects (font (size 1.27 1.27))))
        (number "1" (effects (font (size 1.27 1.27))))
      )
      (pin input line (at -2.54 -7.62 0) (length 2.54)
        (name "P2" (effects (font (size 1.27 1.27))))
        (number "2" (effects (font (size 1.27 1.27))))
      )
    )
  )
  (symbol "MOLEX6" (in_bom yes) (on_board yes)
    (property "Reference" "M6" (id 0) (at 1.27 -2.54 0)
      (effects (font (size 1.27 1.27)))
    )
    (property "Value" "MOLEX6" (id 1) (at -5.08 -2.54 0)
      (effects (font (size 1.27 1.27)))
    )
    (property "Footprint" "" (id 2) (at 0 0 0)
      (effects (font (size 1.27 1.27)) hide)
    )
    (property "Datasheet" "" (id 3) (at 0 0 0)
      (effects (font (size 1.27 1.27)) hide)
    )
    (symbol "MOLEX6_0_1"
      (rectangle (start -7.62 -3.81) (end 1.27 -19.05)
        (stroke (width 0) (type default) (color 0 0 0 0))
        (fill (type none))
      )
    )
    (symbol "MOLEX6_1_1"
      (pin input line (at -10.16 -5.08 0) (length 2.54)
        (name "P1" (effects (font (size 1.27 1.27))))
        (number "1" (effects (font (size 1.27 1.27))))
      )
      (pin input line (at -10.16 -7.62 0) (length 2.54)
        (name "P2" (effects (font (size 1.27 1.27))))
        (number "2" (effects (font (size 1.27 1.27))))
      )
      (pin input line (at -10.16 -10.16 0) (length 2.54)
        (name "P3" (effects (font (size 1.27 1.27))))
        (number "3" (effects (font (size 1.27 1.27))))
      )
      (pin input line (at -10.16 -12.7 0) (length 2.54)
        (name "P4" (effects (font (size 1.27 1.27))))
        (number "4" (effects (font (size 1.27 1.27))))
      )
      (pin input line (at -10.16 -15.24 0) (length 2.54)
        (name "P5" (effects (font (size 1.27 1.27))))
        (number "5" (effects (font (size 1.27 1.27))))
      )
      (pin input line (at -10.16 -17.78 0) (length 2.54)
        (name "P6" (effects (font (size 1.27 1.27))))
        (number "6" (effects (font (size 1.27 1.27))))
      )
    )
  )
  (symbol "PMEG3020EP" (pin_numbers hide) (in_bom yes) (on_board yes)
    (property "Reference" "U" (id 0) (at 0 0 0)
      (effects (font (size 1.27 1.27)))
    )
    (property "Value" "PMEG3020EP" (id 1) (at 0 2.54 0)
      (effects (font (size 1.27 1.27)))
    )
    (property "Footprint" "" (id 2) (at 0 0 0)
      (effects (font (size 1.27 1.27)) hide)
    )
    (property "Datasheet" "" (id 3) (at 0 0 0)
      (effects (font (size 1.27 1.27)) hide)
    )
    (symbol "PMEG3020EP_0_1"
      (polyline
        (pts
          (xy -2.54 -3.81)
          (xy -6.35 -3.81)
        )
        (stroke (width 0) (type default) (color 0 0 0 0))
        (fill (type none))
      )
      (polyline
        (pts
          (xy 1.27 -3.81)
          (xy 5.08 -3.81)
        )
        (stroke (width 0) (type default) (color 0 0 0 0))
        (fill (type none))
      )
      (polyline
        (pts
          (xy -2.54 -1.27)
          (xy -2.54 -6.35)
          (xy 1.27 -3.81)
          (xy -2.54 -1.27)
          (xy 1.27 -3.81)
          (xy 1.27 -1.27)
          (xy 2.54 -1.27)
          (xy 1.27 -1.27)
          (xy 1.27 -6.35)
          (xy 0 -6.35)
          (xy 1.27 -6.35)
        )
        (stroke (width 0) (type default) (color 0 0 0 0))
        (fill (type none))
      )
    )
    (symbol "PMEG3020EP_1_1"
      (pin input line (at -7.62 -3.81 0) (length 2.54)
        (name "" (effects (font (size 1.27 1.27))))
        (number "1" (effects (font (size 1.27 1.27))))
      )
      (pin input line (at 6.35 -3.81 180) (length 2.54)
        (name "" (effects (font (size 1.27 1.27))))
        (number "2" (effects (font (size 1.27 1.27))))
      )
    )
  )
  (symbol "SD CARD" (in_bom yes) (on_board yes)
    (property "Reference" "U" (id 0) (at 2.54 0 0)
      (effects (font (size 1.27 1.27)))
    )
    (property "Value" "SD CARD" (id 1) (at -5.08 0 0)
      (effects (font (size 1.27 1.27)))
    )
    (property "Footprint" "" (id 2) (at 0 0 0)
      (effects (font (size 1.27 1.27)) hide)
    )
    (property "Datasheet" "" (id 3) (at 0 0 0)
      (effects (font (size 1.27 1.27)) hide)
    )
    (symbol "SD CARD_0_0"
      (polyline
        (pts
          (xy -11.43 -2.54)
          (xy -11.43 -45.72)
          (xy 10.16 -45.72)
          (xy 10.16 -5.08)
          (xy 2.54 -5.08)
          (xy 0 -2.54)
          (xy -2.54 -2.54)
          (xy -2.54 -5.08)
          (xy -5.08 -5.08)
          (xy -5.08 -2.54)
          (xy -11.43 -2.54)
        )
        (stroke (width 0) (type default) (color 0 0 0 0))
        (fill (type none))
      )
    )
    (symbol "SD CARD_1_1"
      (pin input line (at 12.7 -24.13 180) (length 2.54)
        (name "DAT2" (effects (font (size 1.27 1.27))))
        (number "1" (effects (font (size 1.27 1.27))))
      )
      (pin input line (at 12.7 -29.21 180) (length 2.54)
        (name "CS" (effects (font (size 1.27 1.27))))
        (number "2" (effects (font (size 1.27 1.27))))
      )
      (pin input line (at 12.7 -34.29 180) (length 2.54)
        (name "DATA_IN" (effects (font (size 1.27 1.27))))
        (number "3" (effects (font (size 1.27 1.27))))
      )
      (pin input line (at 12.7 -19.05 180) (length 2.54)
        (name "VDD" (effects (font (size 1.27 1.27))))
        (number "4" (effects (font (size 1.27 1.27))))
      )
      (pin input line (at 12.7 -31.75 180) (length 2.54)
        (name "SCLK" (effects (font (size 1.27 1.27))))
        (number "5" (effects (font (size 1.27 1.27))))
      )
      (pin input line (at 12.7 -16.51 180) (length 2.54)
        (name "VSS" (effects (font (size 1.27 1.27))))
        (number "6" (effects (font (size 1.27 1.27))))
      )
      (pin input line (at 12.7 -36.83 180) (length 2.54)
        (name "DATA_OUT" (effects (font (size 1.27 1.27))))
        (number "7" (effects (font (size 1.27 1.27))))
      )
      (pin input line (at 12.7 -26.67 180) (length 2.54)
        (name "DAT1" (effects (font (size 1.27 1.27))))
        (number "8" (effects (font (size 1.27 1.27))))
      )
      (pin input line (at 12.7 -43.18 180) (length 2.54)
        (name "CARD_DETECT" (effects (font (size 1.27 1.27))))
        (number "CD1" (effects (font (size 1.27 1.27))))
      )
      (pin input line (at 12.7 -40.64 180) (length 2.54)
        (name "CARD_DETECT1" (effects (font (size 1.27 1.27))))
        (number "CD2" (effects (font (size 1.27 1.27))))
      )
      (pin input line (at 12.7 -8.89 180) (length 2.54)
        (name "GND" (effects (font (size 1.27 1.27))))
        (number "MT1" (effects (font (size 1.27 1.27))))
      )
      (pin input line (at 12.7 -11.43 180) (length 2.54)
        (name "GND1" (effects (font (size 1.27 1.27))))
        (number "MT2" (effects (font (size 1.27 1.27))))
      )
    )
  )
  (symbol "SPV1040" (in_bom yes) (on_board yes)
    (property "Reference" "SPV" (id 0) (at -1.27 -2.54 0)
      (effects (font (size 1.27 1.27)))
    )
    (property "Value" "SPV1040" (id 1) (at 0 0 0)
      (effects (font (size 1.27 1.27)))
    )
    (property "Footprint" "" (id 2) (at 0 0 0)
      (effects (font (size 1.27 1.27)) hide)
    )
    (property "Datasheet" "" (id 3) (at 0 0 0)
      (effects (font (size 1.27 1.27)) hide)
    )
    (symbol "SPV1040_0_1"
      (rectangle (start -8.89 -5.08) (end 10.16 -17.78)
        (stroke (width 0) (type default) (color 0 0 0 0))
        (fill (type none))
      )
    )
    (symbol "SPV1040_1_1"
      (pin input line (at -11.43 -7.62 0) (length 2.54)
        (name "LX" (effects (font (size 1.27 1.27))))
        (number "1" (effects (font (size 1.27 1.27))))
      )
      (pin input line (at -11.43 -10.16 0) (length 2.54)
        (name "XSHUT" (effects (font (size 1.27 1.27))))
        (number "2" (effects (font (size 1.27 1.27))))
      )
      (pin input line (at -11.43 -12.7 0) (length 2.54)
        (name "GND" (effects (font (size 1.27 1.27))))
        (number "3" (effects (font (size 1.27 1.27))))
      )
      (pin input line (at -11.43 -15.24 0) (length 2.54)
        (name "MPP-SET" (effects (font (size 1.27 1.27))))
        (number "4" (effects (font (size 1.27 1.27))))
      )
      (pin input line (at 12.7 -15.24 180) (length 2.54)
        (name "VC" (effects (font (size 1.27 1.27))))
        (number "5" (effects (font (size 1.27 1.27))))
      )
      (pin input line (at 12.7 -12.7 180) (length 2.54)
        (name "IC-" (effects (font (size 1.27 1.27))))
        (number "6" (effects (font (size 1.27 1.27))))
      )
      (pin input line (at 12.7 -10.16 180) (length 2.54)
        (name "IC+" (effects (font (size 1.27 1.27))))
        (number "7" (effects (font (size 1.27 1.27))))
      )
      (pin input line (at 12.7 -7.62 180) (length 2.54)
        (name "VOUT" (effects (font (size 1.27 1.27))))
        (number "8" (effects (font (size 1.27 1.27))))
      )
    )
  )
  (symbol "STM32" (pin_numbers hide) (in_bom yes) (on_board yes)
    (property "Reference" "STM" (id 0) (at 0 -22.86 0)
      (effects (font (size 1.27 1.27)))
    )
    (property "Value" "STM32" (id 1) (at -5.08 16.51 0)
      (effects (font (size 1.27 1.27)))
    )
    (property "Footprint" "" (id 2) (at -5.08 16.51 0)
      (effects (font (size 1.27 1.27)) hide)
    )
    (property "Datasheet" "" (id 3) (at -5.08 16.51 0)
      (effects (font (size 1.27 1.27)) hide)
    )
    (symbol "STM32_0_1"
      (polyline
        (pts
          (xy -27.94 -1.27)
          (xy -27.94 -46.99)
        )
        (stroke (width 0) (type default) (color 0 0 0 0))
        (fill (type none))
      )
      (polyline
        (pts
          (xy -22.86 -52.07)
          (xy -27.94 -46.99)
        )
        (stroke (width 0) (type default) (color 0 0 0 0))
        (fill (type none))
      )
      (polyline
        (pts
          (xy -22.86 3.81)
          (xy -27.94 -1.27)
        )
        (stroke (width 0) (type default) (color 0 0 0 0))
        (fill (type none))
      )
      (polyline
        (pts
          (xy -22.86 3.81)
          (xy 22.86 3.81)
        )
        (stroke (width 0) (type default) (color 0 0 0 0))
        (fill (type none))
      )
      (polyline
        (pts
          (xy 22.86 -52.07)
          (xy -22.86 -52.07)
        )
        (stroke (width 0) (type default) (color 0 0 0 0))
        (fill (type none))
      )
      (polyline
        (pts
          (xy 22.86 -52.07)
          (xy 27.94 -46.99)
        )
        (stroke (width 0) (type default) (color 0 0 0 0))
        (fill (type none))
      )
      (polyline
        (pts
          (xy 22.86 3.81)
          (xy 27.94 -1.27)
        )
        (stroke (width 0) (type default) (color 0 0 0 0))
        (fill (type none))
      )
      (polyline
        (pts
          (xy 27.94 -46.99)
          (xy 27.94 -1.27)
        )
        (stroke (width 0) (type default) (color 0 0 0 0))
        (fill (type none))
      )
    )
    (symbol "STM32_1_1"
      (pin input line (at -19.05 6.35 270) (length 2.54)
        (name "VDD_3" (effects (font (size 1.27 1.27))))
        (number "1" (effects (font (size 1.27 1.27))))
      )
      (pin input line (at 3.81 6.35 270) (length 2.54)
        (name "PB3" (effects (font (size 1.27 1.27))))
        (number "10" (effects (font (size 1.27 1.27))))
      )
      (pin input line (at 6.35 6.35 270) (length 2.54)
        (name "PD2" (effects (font (size 1.27 1.27))))
        (number "11" (effects (font (size 1.27 1.27))))
      )
      (pin input line (at 8.89 6.35 270) (length 2.54)
        (name "PC12" (effects (font (size 1.27 1.27))))
        (number "12" (effects (font (size 1.27 1.27))))
      )
      (pin input line (at 11.43 6.35 270) (length 2.54)
        (name "PC11" (effects (font (size 1.27 1.27))))
        (number "13" (effects (font (size 1.27 1.27))))
      )
      (pin input line (at 13.97 6.35 270) (length 2.54)
        (name "PC10" (effects (font (size 1.27 1.27))))
        (number "14" (effects (font (size 1.27 1.27))))
      )
      (pin input line (at 16.51 6.35 270) (length 2.54)
        (name "PA15" (effects (font (size 1.27 1.27))))
        (number "15" (effects (font (size 1.27 1.27))))
      )
      (pin input line (at 19.05 6.35 270) (length 2.54)
        (name "PA14" (effects (font (size 1.27 1.27))))
        (number "16" (effects (font (size 1.27 1.27))))
      )
      (pin input line (at 30.48 -5.08 180) (length 2.54)
        (name "VDDUSB" (effects (font (size 1.27 1.27))))
        (number "17" (effects (font (size 1.27 1.27))))
      )
      (pin input line (at 30.48 -7.62 180) (length 2.54)
        (name "VSS_2" (effects (font (size 1.27 1.27))))
        (number "18" (effects (font (size 1.27 1.27))))
      )
      (pin input line (at 30.48 -10.16 180) (length 2.54)
        (name "PA13" (effects (font (size 1.27 1.27))))
        (number "19" (effects (font (size 1.27 1.27))))
      )
      (pin input line (at -16.51 6.35 270) (length 2.54)
        (name "VSS_3" (effects (font (size 1.27 1.27))))
        (number "2" (effects (font (size 1.27 1.27))))
      )
      (pin input line (at 30.48 -12.7 180) (length 2.54)
        (name "PA12" (effects (font (size 1.27 1.27))))
        (number "20" (effects (font (size 1.27 1.27))))
      )
      (pin input line (at 30.48 -15.24 180) (length 2.54)
        (name "PA11" (effects (font (size 1.27 1.27))))
        (number "21" (effects (font (size 1.27 1.27))))
      )
      (pin input line (at 30.48 -17.78 180) (length 2.54)
        (name "PA10" (effects (font (size 1.27 1.27))))
        (number "22" (effects (font (size 1.27 1.27))))
      )
      (pin input line (at 30.48 -20.32 180) (length 2.54)
        (name "PA9" (effects (font (size 1.27 1.27))))
        (number "23" (effects (font (size 1.27 1.27))))
      )
      (pin input line (at 30.48 -22.86 180) (length 2.54)
        (name "PA8" (effects (font (size 1.27 1.27))))
        (number "24" (effects (font (size 1.27 1.27))))
      )
      (pin input line (at 30.48 -25.4 180) (length 2.54)
        (name "PC9" (effects (font (size 1.27 1.27))))
        (number "25" (effects (font (size 1.27 1.27))))
      )
      (pin input line (at 30.48 -27.94 180) (length 2.54)
        (name "PC8" (effects (font (size 1.27 1.27))))
        (number "26" (effects (font (size 1.27 1.27))))
      )
      (pin input line (at 30.48 -30.48 180) (length 2.54)
        (name "PC7" (effects (font (size 1.27 1.27))))
        (number "27" (effects (font (size 1.27 1.27))))
      )
      (pin input line (at 30.48 -33.02 180) (length 2.54)
        (name "PC6" (effects (font (size 1.27 1.27))))
        (number "28" (effects (font (size 1.27 1.27))))
      )
      (pin input line (at 30.48 -35.56 180) (length 2.54)
        (name "PB15" (effects (font (size 1.27 1.27))))
        (number "29" (effects (font (size 1.27 1.27))))
      )
      (pin input line (at -13.97 6.35 270) (length 2.54)
        (name "PB9" (effects (font (size 1.27 1.27))))
        (number "3" (effects (font (size 1.27 1.27))))
      )
      (pin input line (at 30.48 -38.1 180) (length 2.54)
        (name "PB14" (effects (font (size 1.27 1.27))))
        (number "30" (effects (font (size 1.27 1.27))))
      )
      (pin input line (at 30.48 -40.64 180) (length 2.54)
        (name "PB13" (effects (font (size 1.27 1.27))))
        (number "31" (effects (font (size 1.27 1.27))))
      )
      (pin input line (at 30.48 -43.18 180) (length 2.54)
        (name "PB12" (effects (font (size 1.27 1.27))))
        (number "32" (effects (font (size 1.27 1.27))))
      )
      (pin input line (at 19.05 -54.61 90) (length 2.54)
        (name "VDD_1" (effects (font (size 1.27 1.27))))
        (number "33" (effects (font (size 1.27 1.27))))
      )
      (pin input line (at 16.51 -54.61 90) (length 2.54)
        (name "VSS_1" (effects (font (size 1.27 1.27))))
        (number "34" (effects (font (size 1.27 1.27))))
      )
      (pin input line (at 13.97 -54.61 90) (length 2.54)
        (name "PB11" (effects (font (size 1.27 1.27))))
        (number "35" (effects (font (size 1.27 1.27))))
      )
      (pin input line (at 11.43 -54.61 90) (length 2.54)
        (name "PB10" (effects (font (size 1.27 1.27))))
        (number "36" (effects (font (size 1.27 1.27))))
      )
      (pin input line (at 8.89 -54.61 90) (length 2.54)
        (name "PB2" (effects (font (size 1.27 1.27))))
        (number "37" (effects (font (size 1.27 1.27))))
      )
      (pin input line (at 6.35 -54.61 90) (length 2.54)
        (name "PB1" (effects (font (size 1.27 1.27))))
        (number "38" (effects (font (size 1.27 1.27))))
      )
      (pin input line (at 3.81 -54.61 90) (length 2.54)
        (name "PB0" (effects (font (size 1.27 1.27))))
        (number "39" (effects (font (size 1.27 1.27))))
      )
      (pin input line (at -11.43 6.35 270) (length 2.54)
        (name "PB8" (effects (font (size 1.27 1.27))))
        (number "4" (effects (font (size 1.27 1.27))))
      )
      (pin input line (at 1.27 -54.61 90) (length 2.54)
        (name "PC5" (effects (font (size 1.27 1.27))))
        (number "40" (effects (font (size 1.27 1.27))))
      )
      (pin input line (at -1.27 -54.61 90) (length 2.54)
        (name "PC4" (effects (font (size 1.27 1.27))))
        (number "41" (effects (font (size 1.27 1.27))))
      )
      (pin input line (at -3.81 -54.61 90) (length 2.54)
        (name "PA7" (effects (font (size 1.27 1.27))))
        (number "42" (effects (font (size 1.27 1.27))))
      )
      (pin input line (at -6.35 -54.61 90) (length 2.54)
        (name "PA6" (effects (font (size 1.27 1.27))))
        (number "43" (effects (font (size 1.27 1.27))))
      )
      (pin input line (at -8.89 -54.61 90) (length 2.54)
        (name "PA5" (effects (font (size 1.27 1.27))))
        (number "44" (effects (font (size 1.27 1.27))))
      )
      (pin input line (at -11.43 -54.61 90) (length 2.54)
        (name "PA4" (effects (font (size 1.27 1.27))))
        (number "45" (effects (font (size 1.27 1.27))))
      )
      (pin input line (at -13.97 -54.61 90) (length 2.54)
        (name "VDD_0" (effects (font (size 1.27 1.27))))
        (number "46" (effects (font (size 1.27 1.27))))
      )
      (pin input line (at -16.51 -54.61 90) (length 2.54)
        (name "VSS_0" (effects (font (size 1.27 1.27))))
        (number "47" (effects (font (size 1.27 1.27))))
      )
      (pin input line (at -19.05 -54.61 90) (length 2.54)
        (name "PA3" (effects (font (size 1.27 1.27))))
        (number "48" (effects (font (size 1.27 1.27))))
      )
      (pin input line (at -30.48 -43.18 0) (length 2.54)
        (name "PA2" (effects (font (size 1.27 1.27))))
        (number "49" (effects (font (size 1.27 1.27))))
      )
      (pin input line (at -8.89 6.35 270) (length 2.54)
        (name "PH3-BOOT0" (effects (font (size 1.27 1.27))))
        (number "5" (effects (font (size 1.27 1.27))))
      )
      (pin input line (at -30.48 -40.64 0) (length 2.54)
        (name "PA1" (effects (font (size 1.27 1.27))))
        (number "50" (effects (font (size 1.27 1.27))))
      )
      (pin input line (at -30.48 -38.1 0) (length 2.54)
        (name "PA0" (effects (font (size 1.27 1.27))))
        (number "51" (effects (font (size 1.27 1.27))))
      )
      (pin input line (at -30.48 -35.56 0) (length 2.54)
        (name "VDDA/VREF+" (effects (font (size 1.27 1.27))))
        (number "52" (effects (font (size 1.27 1.27))))
      )
      (pin input line (at -30.48 -33.02 0) (length 2.54)
        (name "VSSA/VREF-" (effects (font (size 1.27 1.27))))
        (number "53" (effects (font (size 1.27 1.27))))
      )
      (pin input line (at -30.48 -30.48 0) (length 2.54)
        (name "PC3" (effects (font (size 1.27 1.27))))
        (number "54" (effects (font (size 1.27 1.27))))
      )
      (pin input line (at -30.48 -27.94 0) (length 2.54)
        (name "PC2" (effects (font (size 1.27 1.27))))
        (number "55" (effects (font (size 1.27 1.27))))
      )
      (pin input line (at -30.48 -25.4 0) (length 2.54)
        (name "PC1" (effects (font (size 1.27 1.27))))
        (number "56" (effects (font (size 1.27 1.27))))
      )
      (pin input line (at -30.48 -22.86 0) (length 2.54)
        (name "PC0" (effects (font (size 1.27 1.27))))
        (number "57" (effects (font (size 1.27 1.27))))
      )
      (pin input line (at -30.48 -20.32 0) (length 2.54)
        (name "NRST" (effects (font (size 1.27 1.27))))
        (number "58" (effects (font (size 1.27 1.27))))
      )
      (pin input line (at -30.48 -17.78 0) (length 2.54)
        (name "PH1-OSC_OUT" (effects (font (size 1.27 1.27))))
        (number "59" (effects (font (size 1.27 1.27))))
      )
      (pin input line (at -6.35 6.35 270) (length 2.54)
        (name "PB7" (effects (font (size 1.27 1.27))))
        (number "6" (effects (font (size 1.27 1.27))))
      )
      (pin input line (at -30.48 -15.24 0) (length 2.54)
        (name "PH0-OSC_IN" (effects (font (size 1.27 1.27))))
        (number "60" (effects (font (size 1.27 1.27))))
      )
      (pin input line (at -30.48 -12.7 0) (length 2.54)
        (name "PC15-OSC32_OUT" (effects (font (size 1.27 1.27))))
        (number "61" (effects (font (size 1.27 1.27))))
      )
      (pin input line (at -30.48 -10.16 0) (length 2.54)
        (name "PC14-OSC32_IN" (effects (font (size 1.27 1.27))))
        (number "62" (effects (font (size 1.27 1.27))))
      )
      (pin input line (at -30.48 -7.62 0) (length 2.54)
        (name "PC13" (effects (font (size 1.27 1.27))))
        (number "63" (effects (font (size 1.27 1.27))))
      )
      (pin input line (at -30.48 -5.08 0) (length 2.54)
        (name "VBAT" (effects (font (size 1.27 1.27))))
        (number "64" (effects (font (size 1.27 1.27))))
      )
      (pin input line (at -3.81 6.35 270) (length 2.54)
        (name "PB6" (effects (font (size 1.27 1.27))))
        (number "7" (effects (font (size 1.27 1.27))))
      )
      (pin input line (at -1.27 6.35 270) (length 2.54)
        (name "PB5" (effects (font (size 1.27 1.27))))
        (number "8" (effects (font (size 1.27 1.27))))
      )
      (pin input line (at 1.27 6.35 270) (length 2.54)
        (name "PB4" (effects (font (size 1.27 1.27))))
        (number "9" (effects (font (size 1.27 1.27))))
      )
    )
  )
  (symbol "TPS61022" (in_bom yes) (on_board yes)
    (property "Reference" "U" (id 0) (at 6.35 1.27 0)
      (effects (font (size 1.27 1.27)))
    )
    (property "Value" "TPS61022" (id 1) (at 0 1.27 0)
      (effects (font (size 1.27 1.27)))
    )
    (property "Footprint" "" (id 2) (at 0 0 0)
      (effects (font (size 1.27 1.27)) hide)
    )
    (property "Datasheet" "" (id 3) (at 0 0 0)
      (effects (font (size 1.27 1.27)) hide)
    )
    (symbol "TPS61022_0_1"
      (rectangle (start -7.62 0) (end 11.43 -13.97)
        (stroke (width 0) (type default) (color 0 0 0 0))
        (fill (type none))
      )
    )
    (symbol "TPS61022_1_1"
      (pin input line (at -10.16 -11.43 0) (length 2.54)
        (name "EN" (effects (font (size 1.27 1.27))))
        (number "" (effects (font (size 1.27 1.27))))
      )
      (pin input line (at 13.97 -11.43 180) (length 2.54)
        (name "FB" (effects (font (size 1.27 1.27))))
        (number "" (effects (font (size 1.27 1.27))))
      )
      (pin input line (at -10.16 -5.08 0) (length 2.54)
        (name "GND" (effects (font (size 1.27 1.27))))
        (number "" (effects (font (size 1.27 1.27))))
      )
      (pin input line (at -10.16 -8.89 0) (length 2.54)
        (name "MODE" (effects (font (size 1.27 1.27))))
        (number "" (effects (font (size 1.27 1.27))))
      )
      (pin input line (at 13.97 -2.54 180) (length 2.54)
        (name "SW" (effects (font (size 1.27 1.27))))
        (number "" (effects (font (size 1.27 1.27))))
      )
      (pin input line (at -10.16 -2.54 0) (length 2.54)
        (name "VIN" (effects (font (size 1.27 1.27))))
        (number "" (effects (font (size 1.27 1.27))))
      )
      (pin input line (at 13.97 -5.08 180) (length 2.54)
        (name "VOUT" (effects (font (size 1.27 1.27))))
        (number "" (effects (font (size 1.27 1.27))))
      )
    )
  )
  (symbol "TPS61088" (in_bom yes) (on_board yes)
    (property "Reference" "U" (id 0) (at 2.54 0 0)
      (effects (font (size 1.27 1.27)))
    )
    (property "Value" "TPS61088" (id 1) (at -3.81 0 0)
      (effects (font (size 1.27 1.27)))
    )
    (property "Footprint" "" (id 2) (at 0 0 0)
      (effects (font (size 1.27 1.27)) hide)
    )
    (property "Datasheet" "" (id 3) (at 0 0 0)
      (effects (font (size 1.27 1.27)) hide)
    )
    (symbol "TPS61088_0_1"
      (rectangle (start -8.89 -1.27) (end 8.89 -26.67)
        (stroke (width 0) (type default) (color 0 0 0 0))
        (fill (type none))
      )
    )
    (symbol "TPS61088_1_1"
      (pin input line (at -11.43 -22.86 0) (length 2.54)
        (name "AGND" (effects (font (size 1.27 1.27))))
        (number "" (effects (font (size 1.27 1.27))))
      )
      (pin input line (at -11.43 -5.08 0) (length 2.54)
        (name "BOOT" (effects (font (size 1.27 1.27))))
        (number "" (effects (font (size 1.27 1.27))))
      )
      (pin input line (at 11.43 -12.7 180) (length 2.54)
        (name "COMP" (effects (font (size 1.27 1.27))))
        (number "" (effects (font (size 1.27 1.27))))
      )
      (pin input line (at -11.43 -17.78 0) (length 2.54)
        (name "EN" (effects (font (size 1.27 1.27))))
        (number "" (effects (font (size 1.27 1.27))))
      )
      (pin input line (at 11.43 -10.16 180) (length 2.54)
        (name "FB" (effects (font (size 1.27 1.27))))
        (number "" (effects (font (size 1.27 1.27))))
      )
      (pin input line (at -11.43 -10.16 0) (length 2.54)
        (name "FSW" (effects (font (size 1.27 1.27))))
        (number "" (effects (font (size 1.27 1.27))))
      )
      (pin input line (at 11.43 -15.24 180) (length 2.54)
        (name "ILIM" (effects (font (size 1.27 1.27))))
        (number "" (effects (font (size 1.27 1.27))))
      )
      (pin input line (at 11.43 -20.32 180) (length 2.54)
        (name "MODE" (effects (font (size 1.27 1.27))))
        (number "" (effects (font (size 1.27 1.27))))
      )
      (pin input line (at -11.43 -20.32 0) (length 2.54)
        (name "PGND" (effects (font (size 1.27 1.27))))
        (number "" (effects (font (size 1.27 1.27))))
      )
      (pin input line (at 11.43 -17.78 180) (length 2.54)
        (name "SS" (effects (font (size 1.27 1.27))))
        (number "" (effects (font (size 1.27 1.27))))
      )
      (pin input line (at -11.43 -7.62 0) (length 2.54)
        (name "SW" (effects (font (size 1.27 1.27))))
        (number "" (effects (font (size 1.27 1.27))))
      )
      (pin input line (at -11.43 -15.24 0) (length 2.54)
        (name "VCC" (effects (font (size 1.27 1.27))))
        (number "" (effects (font (size 1.27 1.27))))
      )
      (pin input line (at -11.43 -12.7 0) (length 2.54)
        (name "VIN" (effects (font (size 1.27 1.27))))
        (number "" (effects (font (size 1.27 1.27))))
      )
      (pin input line (at 11.43 -7.62 180) (length 2.54)
        (name "VOUT" (effects (font (size 1.27 1.27))))
        (number "" (effects (font (size 1.27 1.27))))
      )
    )
  )
  (symbol "TPS62827" (in_bom yes) (on_board yes)
    (property "Reference" "U" (id 0) (at 7.62 -1.27 0)
      (effects (font (size 1.27 1.27)))
    )
    (property "Value" "TPS62827" (id 1) (at -1.27 -1.27 0)
      (effects (font (size 1.27 1.27)))
    )
    (property "Footprint" "" (id 2) (at 0 0 0)
      (effects (font (size 1.27 1.27)) hide)
    )
    (property "Datasheet" "" (id 3) (at 0 0 0)
      (effects (font (size 1.27 1.27)) hide)
    )
    (symbol "TPS62827_0_1"
      (rectangle (start -6.35 -2.54) (end 6.35 -15.24)
        (stroke (width 0) (type default) (color 0 0 0 0))
        (fill (type none))
      )
    )
    (symbol "TPS62827_1_1"
      (pin input line (at -8.89 -8.89 0) (length 2.54)
        (name "EN" (effects (font (size 1.27 1.27))))
        (number "" (effects (font (size 1.27 1.27))))
      )
      (pin input line (at 8.89 -8.89 180) (length 2.54)
        (name "FB" (effects (font (size 1.27 1.27))))
        (number "" (effects (font (size 1.27 1.27))))
      )
      (pin input line (at 0 -17.78 90) (length 2.54)
        (name "GND" (effects (font (size 1.27 1.27))))
        (number "" (effects (font (size 1.27 1.27))))
      )
      (pin input line (at -8.89 -12.7 0) (length 2.54)
        (name "PG" (effects (font (size 1.27 1.27))))
        (number "" (effects (font (size 1.27 1.27))))
      )
      (pin input line (at 8.89 -5.08 180) (length 2.54)
        (name "SW" (effects (font (size 1.27 1.27))))
        (number "" (effects (font (size 1.27 1.27))))
      )
      (pin input line (at -8.89 -5.08 0) (length 2.54)
        (name "VIN" (effects (font (size 1.27 1.27))))
        (number "" (effects (font (size 1.27 1.27))))
      )
    )
  )
  (symbol "XAL6060" (in_bom yes) (on_board yes)
    (property "Reference" "XAL" (id 0) (at -6.35 -8.89 0)
      (effects (font (size 1.27 1.27)))
    )
    (property "Value" "XAL6060" (id 1) (at -3.81 -5.08 0)
      (effects (font (size 1.27 1.27)))
    )
    (property "Footprint" "" (id 2) (at 0 0 0)
      (effects (font (size 1.27 1.27)) hide)
    )
    (property "Datasheet" "" (id 3) (at 0 0 0)
      (effects (font (size 1.27 1.27)) hide)
    )
    (symbol "XAL6060_0_1"
      (arc (start -6.35 -6.35) (mid -7.248 -6.722) (end -7.62 -7.62)
        (stroke (width 0) (type default) (color 0 0 0 0))
        (fill (type none))
      )
      (arc (start -5.08 -7.62) (mid -5.452 -6.722) (end -6.35 -6.35)
        (stroke (width 0) (type default) (color 0 0 0 0))
        (fill (type none))
      )
      (arc (start -3.81 -6.35) (mid -4.708 -6.722) (end -5.08 -7.62)
        (stroke (width 0) (type default) (color 0 0 0 0))
        (fill (type none))
      )
      (arc (start -2.54 -7.62) (mid -2.912 -6.722) (end -3.81 -6.35)
        (stroke (width 0) (type default) (color 0 0 0 0))
        (fill (type none))
      )
      (arc (start -1.27 -6.35) (mid -2.168 -6.722) (end -2.54 -7.62)
        (stroke (width 0) (type default) (color 0 0 0 0))
        (fill (type none))
      )
      (arc (start -1.27 -6.35) (mid -2.168 -8.518) (end 0 -7.62)
        (stroke (width 0) (type default) (color 0 0 0 0))
        (fill (type none))
      )
      (polyline
        (pts
          (xy -7.62 -7.62)
          (xy -10.16 -7.62)
        )
        (stroke (width 0) (type default) (color 0 0 0 0))
        (fill (type none))
      )
      (polyline
        (pts
          (xy 0 -7.62)
          (xy 2.54 -7.62)
        )
        (stroke (width 0) (type default) (color 0 0 0 0))
        (fill (type none))
      )
    )
    (symbol "XAL6060_1_1"
      (pin input line (at -10.16 -7.62 0) (length 2.54)
        (name "" (effects (font (size 1.27 1.27))))
        (number "" (effects (font (size 1.27 1.27))))
      )
      (pin input line (at 2.54 -7.62 180) (length 2.54)
        (name "" (effects (font (size 1.27 1.27))))
        (number "" (effects (font (size 1.27 1.27))))
      )
    )
  )
)
