(kicad_sch (version 20211123) (generator eeschema)

  (uuid f5e5f0af-cccc-441d-8c0f-a97f8eff2600)

  (paper "A4")

  (lib_symbols
    (symbol "Battery_Management:MCP73871" (pin_names (offset 1.016)) (in_bom yes) (on_board yes)
      (property "Reference" "U" (id 0) (at -7.62 24.13 0)
        (effects (font (size 1.27 1.27)) (justify left))
      )
      (property "Value" "MCP73871" (id 1) (at -15.24 21.59 0)
        (effects (font (size 1.27 1.27)) (justify left))
      )
      (property "Footprint" "Package_DFN_QFN:QFN-20-1EP_4x4mm_P0.5mm_EP2.5x2.5mm" (id 2) (at 5.08 -22.86 0)
        (effects (font (size 1.27 1.27) italic) (justify left) hide)
      )
      (property "Datasheet" "http://www.mouser.com/ds/2/268/22090a-52174.pdf" (id 3) (at -3.81 13.97 0)
        (effects (font (size 1.27 1.27)) hide)
      )
      (property "ki_keywords" "battery charger lithium" (id 4) (at 0 0 0)
        (effects (font (size 1.27 1.27)) hide)
      )
      (property "ki_description" "Single cell, Li-Ion/Li-Po charge management controller" (id 5) (at 0 0 0)
        (effects (font (size 1.27 1.27)) hide)
      )
      (property "ki_fp_filters" "QFN*4x4mm*P0.5mm*" (id 6) (at 0 0 0)
        (effects (font (size 1.27 1.27)) hide)
      )
      (symbol "MCP73871_0_1"
        (rectangle (start -15.24 20.32) (end 15.24 -20.32)
          (stroke (width 0.254) (type default) (color 0 0 0 0))
          (fill (type background))
        )
      )
      (symbol "MCP73871_1_1"
        (pin power_out line (at 17.78 15.24 180) (length 2.54)
          (name "OUT" (effects (font (size 1.27 1.27))))
          (number "1" (effects (font (size 1.27 1.27))))
        )
        (pin power_in line (at 0 -22.86 90) (length 2.54)
          (name "VSS" (effects (font (size 1.27 1.27))))
          (number "10" (effects (font (size 1.27 1.27))))
        )
        (pin passive line (at 0 -22.86 90) (length 2.54) hide
          (name "VSS" (effects (font (size 1.27 1.27))))
          (number "11" (effects (font (size 1.27 1.27))))
        )
        (pin bidirectional line (at -17.78 0 0) (length 2.54)
          (name "PROG3" (effects (font (size 1.27 1.27))))
          (number "12" (effects (font (size 1.27 1.27))))
        )
        (pin bidirectional line (at -17.78 5.08 0) (length 2.54)
          (name "PROG1" (effects (font (size 1.27 1.27))))
          (number "13" (effects (font (size 1.27 1.27))))
        )
        (pin power_out line (at 17.78 7.62 180) (length 2.54)
          (name "VBAT" (effects (font (size 1.27 1.27))))
          (number "14" (effects (font (size 1.27 1.27))))
        )
        (pin passive line (at 17.78 7.62 180) (length 2.54) hide
          (name "VBAT" (effects (font (size 1.27 1.27))))
          (number "15" (effects (font (size 1.27 1.27))))
        )
        (pin input line (at 17.78 2.54 180) (length 2.54)
          (name "Vbat_SENSE" (effects (font (size 1.27 1.27))))
          (number "16" (effects (font (size 1.27 1.27))))
        )
        (pin input line (at -17.78 -15.24 0) (length 2.54)
          (name "CE" (effects (font (size 1.27 1.27))))
          (number "17" (effects (font (size 1.27 1.27))))
        )
        (pin power_in line (at 0 22.86 270) (length 2.54)
          (name "IN" (effects (font (size 1.27 1.27))))
          (number "18" (effects (font (size 1.27 1.27))))
        )
        (pin passive line (at 0 22.86 270) (length 2.54) hide
          (name "IN" (effects (font (size 1.27 1.27))))
          (number "19" (effects (font (size 1.27 1.27))))
        )
        (pin input line (at -17.78 15.24 0) (length 2.54)
          (name "VPCC" (effects (font (size 1.27 1.27))))
          (number "2" (effects (font (size 1.27 1.27))))
        )
        (pin passive line (at 17.78 15.24 180) (length 2.54) hide
          (name "OUT" (effects (font (size 1.27 1.27))))
          (number "20" (effects (font (size 1.27 1.27))))
        )
        (pin passive line (at 0 -22.86 90) (length 2.54) hide
          (name "VSS" (effects (font (size 1.27 1.27))))
          (number "21" (effects (font (size 1.27 1.27))))
        )
        (pin input line (at -17.78 10.16 0) (length 2.54)
          (name "SEL" (effects (font (size 1.27 1.27))))
          (number "3" (effects (font (size 1.27 1.27))))
        )
        (pin input line (at -17.78 2.54 0) (length 2.54)
          (name "PROG2" (effects (font (size 1.27 1.27))))
          (number "4" (effects (font (size 1.27 1.27))))
        )
        (pin bidirectional line (at -17.78 -5.08 0) (length 2.54)
          (name "THERM" (effects (font (size 1.27 1.27))))
          (number "5" (effects (font (size 1.27 1.27))))
        )
        (pin open_collector line (at 17.78 -5.08 180) (length 2.54)
          (name "~{PG}" (effects (font (size 1.27 1.27))))
          (number "6" (effects (font (size 1.27 1.27))))
        )
        (pin open_collector line (at 17.78 -12.7 180) (length 2.54)
          (name "STAT2" (effects (font (size 1.27 1.27))))
          (number "7" (effects (font (size 1.27 1.27))))
        )
        (pin open_collector line (at 17.78 -10.16 180) (length 2.54)
          (name "STAT1/~{LBO}" (effects (font (size 1.27 1.27))))
          (number "8" (effects (font (size 1.27 1.27))))
        )
        (pin input line (at -17.78 -10.16 0) (length 2.54)
          (name "~{TE}" (effects (font (size 1.27 1.27))))
          (number "9" (effects (font (size 1.27 1.27))))
        )
      )
    )
    (symbol "CubeSat1 Library:LM74610SOP-8" (pin_numbers hide) (in_bom yes) (on_board yes)
      (property "Reference" "U" (id 0) (at 7.62 -10.16 0)
        (effects (font (size 1.27 1.27)))
      )
      (property "Value" "LM74610SOP-8" (id 1) (at 13.97 -7.62 0)
        (effects (font (size 1.27 1.27)))
      )
      (property "Footprint" "" (id 2) (at 0 0 0)
        (effects (font (size 1.27 1.27)) hide)
      )
      (property "Datasheet" "" (id 3) (at 0 0 0)
        (effects (font (size 1.27 1.27)) hide)
      )
      (symbol "LM74610SOP-8_0_1"
        (rectangle (start -6.35 -6.35) (end 6.35 -21.59)
          (stroke (width 0) (type default) (color 0 0 0 0))
          (fill (type none))
        )
      )
      (symbol "LM74610SOP-8_1_1"
        (pin input line (at 3.81 -24.13 90) (length 2.54)
          (name "CL" (effects (font (size 1.27 1.27))))
          (number "1" (effects (font (size 1.27 1.27))))
        )
        (pin input line (at 3.81 -3.81 270) (length 2.54)
          (name "GPD" (effects (font (size 1.27 1.27))))
          (number "2" (effects (font (size 1.27 1.27))))
        )
        (pin input line (at -8.89 -13.97 0) (length 2.54)
          (name "A" (effects (font (size 1.27 1.27))))
          (number "4" (effects (font (size 1.27 1.27))))
        )
        (pin input line (at -3.81 -3.81 270) (length 2.54)
          (name "GATE" (effects (font (size 1.27 1.27))))
          (number "6" (effects (font (size 1.27 1.27))))
        )
        (pin input line (at -3.81 -24.13 90) (length 2.54)
          (name "CH" (effects (font (size 1.27 1.27))))
          (number "7" (effects (font (size 1.27 1.27))))
        )
        (pin input line (at 8.89 -13.97 180) (length 2.54)
          (name "C" (effects (font (size 1.27 1.27))))
          (number "8" (effects (font (size 1.27 1.27))))
        )
      )
    )
    (symbol "CubeSat1 Library:MOLEX2" (in_bom yes) (on_board yes)
      (property "Reference" "M2" (id 0) (at 11.43 -2.54 0)
        (effects (font (size 1.27 1.27)))
      )
      (property "Value" "MOLEX2" (id 1) (at 3.81 -2.54 0)
        (effects (font (size 1.27 1.27)))
      )
      (property "Footprint" "" (id 2) (at 0 0 0)
        (effects (font (size 1.27 1.27)) hide)
      )
      (property "Datasheet" "" (id 3) (at 0 0 0)
        (effects (font (size 1.27 1.27)) hide)
      )
      (symbol "MOLEX2_0_1"
        (rectangle (start 0 -3.81) (end 13.97 -8.89)
          (stroke (width 0) (type default) (color 0 0 0 0))
          (fill (type none))
        )
      )
      (symbol "MOLEX2_1_1"
        (pin input line (at -2.54 -5.08 0) (length 2.54)
          (name "P1" (effects (font (size 1.27 1.27))))
          (number "1" (effects (font (size 1.27 1.27))))
        )
        (pin input line (at -2.54 -7.62 0) (length 2.54)
          (name "P2" (effects (font (size 1.27 1.27))))
          (number "2" (effects (font (size 1.27 1.27))))
        )
      )
    )
    (symbol "Device:C" (pin_numbers hide) (pin_names (offset 0.254)) (in_bom yes) (on_board yes)
      (property "Reference" "C" (id 0) (at 0.635 2.54 0)
        (effects (font (size 1.27 1.27)) (justify left))
      )
      (property "Value" "C" (id 1) (at 0.635 -2.54 0)
        (effects (font (size 1.27 1.27)) (justify left))
      )
      (property "Footprint" "" (id 2) (at 0.9652 -3.81 0)
        (effects (font (size 1.27 1.27)) hide)
      )
      (property "Datasheet" "~" (id 3) (at 0 0 0)
        (effects (font (size 1.27 1.27)) hide)
      )
      (property "ki_keywords" "cap capacitor" (id 4) (at 0 0 0)
        (effects (font (size 1.27 1.27)) hide)
      )
      (property "ki_description" "Unpolarized capacitor" (id 5) (at 0 0 0)
        (effects (font (size 1.27 1.27)) hide)
      )
      (property "ki_fp_filters" "C_*" (id 6) (at 0 0 0)
        (effects (font (size 1.27 1.27)) hide)
      )
      (symbol "C_0_1"
        (polyline
          (pts
            (xy -2.032 -0.762)
            (xy 2.032 -0.762)
          )
          (stroke (width 0.508) (type default) (color 0 0 0 0))
          (fill (type none))
        )
        (polyline
          (pts
            (xy -2.032 0.762)
            (xy 2.032 0.762)
          )
          (stroke (width 0.508) (type default) (color 0 0 0 0))
          (fill (type none))
        )
      )
      (symbol "C_1_1"
        (pin passive line (at 0 3.81 270) (length 2.794)
          (name "~" (effects (font (size 1.27 1.27))))
          (number "1" (effects (font (size 1.27 1.27))))
        )
        (pin passive line (at 0 -3.81 90) (length 2.794)
          (name "~" (effects (font (size 1.27 1.27))))
          (number "2" (effects (font (size 1.27 1.27))))
        )
      )
    )
    (symbol "Device:R" (pin_numbers hide) (pin_names (offset 0)) (in_bom yes) (on_board yes)
      (property "Reference" "R" (id 0) (at 2.032 0 90)
        (effects (font (size 1.27 1.27)))
      )
      (property "Value" "R" (id 1) (at 0 0 90)
        (effects (font (size 1.27 1.27)))
      )
      (property "Footprint" "" (id 2) (at -1.778 0 90)
        (effects (font (size 1.27 1.27)) hide)
      )
      (property "Datasheet" "~" (id 3) (at 0 0 0)
        (effects (font (size 1.27 1.27)) hide)
      )
      (property "ki_keywords" "R res resistor" (id 4) (at 0 0 0)
        (effects (font (size 1.27 1.27)) hide)
      )
      (property "ki_description" "Resistor" (id 5) (at 0 0 0)
        (effects (font (size 1.27 1.27)) hide)
      )
      (property "ki_fp_filters" "R_*" (id 6) (at 0 0 0)
        (effects (font (size 1.27 1.27)) hide)
      )
      (symbol "R_0_1"
        (rectangle (start -1.016 -2.54) (end 1.016 2.54)
          (stroke (width 0.254) (type default) (color 0 0 0 0))
          (fill (type none))
        )
      )
      (symbol "R_1_1"
        (pin passive line (at 0 3.81 270) (length 1.27)
          (name "~" (effects (font (size 1.27 1.27))))
          (number "1" (effects (font (size 1.27 1.27))))
        )
        (pin passive line (at 0 -3.81 90) (length 1.27)
          (name "~" (effects (font (size 1.27 1.27))))
          (number "2" (effects (font (size 1.27 1.27))))
        )
      )
    )
    (symbol "LM74610SOP-8_1" (pin_numbers hide) (in_bom yes) (on_board yes)
      (property "Reference" "U" (id 0) (at 7.62 -10.16 0)
        (effects (font (size 1.27 1.27)))
      )
      (property "Value" "LM74610SOP-8_1" (id 1) (at 13.97 -7.62 0)
        (effects (font (size 1.27 1.27)))
      )
      (property "Footprint" "" (id 2) (at 0 0 0)
        (effects (font (size 1.27 1.27)) hide)
      )
      (property "Datasheet" "" (id 3) (at 0 0 0)
        (effects (font (size 1.27 1.27)) hide)
      )
      (symbol "LM74610SOP-8_1_0_1"
        (rectangle (start -6.35 -6.35) (end 6.35 -21.59)
          (stroke (width 0) (type default) (color 0 0 0 0))
          (fill (type none))
        )
      )
      (symbol "LM74610SOP-8_1_1_1"
        (pin input line (at 3.81 -24.13 90) (length 2.54)
          (name "CL" (effects (font (size 1.27 1.27))))
          (number "1" (effects (font (size 1.27 1.27))))
        )
        (pin input line (at 3.81 -3.81 270) (length 2.54)
          (name "GPD" (effects (font (size 1.27 1.27))))
          (number "2" (effects (font (size 1.27 1.27))))
        )
        (pin input line (at -8.89 -13.97 0) (length 2.54)
          (name "A" (effects (font (size 1.27 1.27))))
          (number "4" (effects (font (size 1.27 1.27))))
        )
        (pin input line (at -3.81 -3.81 270) (length 2.54)
          (name "GATE" (effects (font (size 1.27 1.27))))
          (number "6" (effects (font (size 1.27 1.27))))
        )
        (pin input line (at -3.81 -24.13 90) (length 2.54)
          (name "CH" (effects (font (size 1.27 1.27))))
          (number "7" (effects (font (size 1.27 1.27))))
        )
        (pin input line (at 8.89 -13.97 180) (length 2.54)
          (name "C" (effects (font (size 1.27 1.27))))
          (number "8" (effects (font (size 1.27 1.27))))
        )
      )
    )
    (symbol "LM74610SOP-8_2" (pin_numbers hide) (in_bom yes) (on_board yes)
      (property "Reference" "U" (id 0) (at 7.62 -10.16 0)
        (effects (font (size 1.27 1.27)))
      )
      (property "Value" "LM74610SOP-8_2" (id 1) (at 13.97 -7.62 0)
        (effects (font (size 1.27 1.27)))
      )
      (property "Footprint" "" (id 2) (at 0 0 0)
        (effects (font (size 1.27 1.27)) hide)
      )
      (property "Datasheet" "" (id 3) (at 0 0 0)
        (effects (font (size 1.27 1.27)) hide)
      )
      (symbol "LM74610SOP-8_2_0_1"
        (rectangle (start -6.35 -6.35) (end 6.35 -21.59)
          (stroke (width 0) (type default) (color 0 0 0 0))
          (fill (type none))
        )
      )
      (symbol "LM74610SOP-8_2_1_1"
        (pin input line (at 3.81 -24.13 90) (length 2.54)
          (name "CL" (effects (font (size 1.27 1.27))))
          (number "1" (effects (font (size 1.27 1.27))))
        )
        (pin input line (at 3.81 -3.81 270) (length 2.54)
          (name "GPD" (effects (font (size 1.27 1.27))))
          (number "2" (effects (font (size 1.27 1.27))))
        )
        (pin input line (at -8.89 -13.97 0) (length 2.54)
          (name "A" (effects (font (size 1.27 1.27))))
          (number "4" (effects (font (size 1.27 1.27))))
        )
        (pin input line (at -3.81 -3.81 270) (length 2.54)
          (name "GATE" (effects (font (size 1.27 1.27))))
          (number "6" (effects (font (size 1.27 1.27))))
        )
        (pin input line (at -3.81 -24.13 90) (length 2.54)
          (name "CH" (effects (font (size 1.27 1.27))))
          (number "7" (effects (font (size 1.27 1.27))))
        )
        (pin input line (at 8.89 -13.97 180) (length 2.54)
          (name "C" (effects (font (size 1.27 1.27))))
          (number "8" (effects (font (size 1.27 1.27))))
        )
      )
    )
    (symbol "Transistor_FET:2N7000" (pin_names hide) (in_bom yes) (on_board yes)
      (property "Reference" "Q" (id 0) (at 5.08 1.905 0)
        (effects (font (size 1.27 1.27)) (justify left))
      )
      (property "Value" "2N7000" (id 1) (at 5.08 0 0)
        (effects (font (size 1.27 1.27)) (justify left))
      )
      (property "Footprint" "Package_TO_SOT_THT:TO-92_Inline" (id 2) (at 5.08 -1.905 0)
        (effects (font (size 1.27 1.27) italic) (justify left) hide)
      )
      (property "Datasheet" "https://www.vishay.com/docs/70226/70226.pdf" (id 3) (at 0 0 0)
        (effects (font (size 1.27 1.27)) (justify left) hide)
      )
      (property "ki_keywords" "N-Channel MOSFET Logic-Level" (id 4) (at 0 0 0)
        (effects (font (size 1.27 1.27)) hide)
      )
      (property "ki_description" "0.2A Id, 200V Vds, N-Channel MOSFET, 2.6V Logic Level, TO-92" (id 5) (at 0 0 0)
        (effects (font (size 1.27 1.27)) hide)
      )
      (property "ki_fp_filters" "TO?92*" (id 6) (at 0 0 0)
        (effects (font (size 1.27 1.27)) hide)
      )
      (symbol "2N7000_0_1"
        (polyline
          (pts
            (xy 0.254 0)
            (xy -2.54 0)
          )
          (stroke (width 0) (type default) (color 0 0 0 0))
          (fill (type none))
        )
        (polyline
          (pts
            (xy 0.254 1.905)
            (xy 0.254 -1.905)
          )
          (stroke (width 0.254) (type default) (color 0 0 0 0))
          (fill (type none))
        )
        (polyline
          (pts
            (xy 0.762 -1.27)
            (xy 0.762 -2.286)
          )
          (stroke (width 0.254) (type default) (color 0 0 0 0))
          (fill (type none))
        )
        (polyline
          (pts
            (xy 0.762 0.508)
            (xy 0.762 -0.508)
          )
          (stroke (width 0.254) (type default) (color 0 0 0 0))
          (fill (type none))
        )
        (polyline
          (pts
            (xy 0.762 2.286)
            (xy 0.762 1.27)
          )
          (stroke (width 0.254) (type default) (color 0 0 0 0))
          (fill (type none))
        )
        (polyline
          (pts
            (xy 2.54 2.54)
            (xy 2.54 1.778)
          )
          (stroke (width 0) (type default) (color 0 0 0 0))
          (fill (type none))
        )
        (polyline
          (pts
            (xy 2.54 -2.54)
            (xy 2.54 0)
            (xy 0.762 0)
          )
          (stroke (width 0) (type default) (color 0 0 0 0))
          (fill (type none))
        )
        (polyline
          (pts
            (xy 0.762 -1.778)
            (xy 3.302 -1.778)
            (xy 3.302 1.778)
            (xy 0.762 1.778)
          )
          (stroke (width 0) (type default) (color 0 0 0 0))
          (fill (type none))
        )
        (polyline
          (pts
            (xy 1.016 0)
            (xy 2.032 0.381)
            (xy 2.032 -0.381)
            (xy 1.016 0)
          )
          (stroke (width 0) (type default) (color 0 0 0 0))
          (fill (type outline))
        )
        (polyline
          (pts
            (xy 2.794 0.508)
            (xy 2.921 0.381)
            (xy 3.683 0.381)
            (xy 3.81 0.254)
          )
          (stroke (width 0) (type default) (color 0 0 0 0))
          (fill (type none))
        )
        (polyline
          (pts
            (xy 3.302 0.381)
            (xy 2.921 -0.254)
            (xy 3.683 -0.254)
            (xy 3.302 0.381)
          )
          (stroke (width 0) (type default) (color 0 0 0 0))
          (fill (type none))
        )
        (circle (center 1.651 0) (radius 2.794)
          (stroke (width 0.254) (type default) (color 0 0 0 0))
          (fill (type none))
        )
        (circle (center 2.54 -1.778) (radius 0.254)
          (stroke (width 0) (type default) (color 0 0 0 0))
          (fill (type outline))
        )
        (circle (center 2.54 1.778) (radius 0.254)
          (stroke (width 0) (type default) (color 0 0 0 0))
          (fill (type outline))
        )
      )
      (symbol "2N7000_1_1"
        (pin passive line (at 2.54 -5.08 90) (length 2.54)
          (name "S" (effects (font (size 1.27 1.27))))
          (number "1" (effects (font (size 1.27 1.27))))
        )
        (pin input line (at -5.08 0 0) (length 2.54)
          (name "G" (effects (font (size 1.27 1.27))))
          (number "2" (effects (font (size 1.27 1.27))))
        )
        (pin passive line (at 2.54 5.08 270) (length 2.54)
          (name "D" (effects (font (size 1.27 1.27))))
          (number "3" (effects (font (size 1.27 1.27))))
        )
      )
    )
    (symbol "power:+3V3" (power) (pin_names (offset 0)) (in_bom yes) (on_board yes)
      (property "Reference" "#PWR" (id 0) (at 0 -3.81 0)
        (effects (font (size 1.27 1.27)) hide)
      )
      (property "Value" "+3V3" (id 1) (at 0 3.556 0)
        (effects (font (size 1.27 1.27)))
      )
      (property "Footprint" "" (id 2) (at 0 0 0)
        (effects (font (size 1.27 1.27)) hide)
      )
      (property "Datasheet" "" (id 3) (at 0 0 0)
        (effects (font (size 1.27 1.27)) hide)
      )
      (property "ki_keywords" "power-flag" (id 4) (at 0 0 0)
        (effects (font (size 1.27 1.27)) hide)
      )
      (property "ki_description" "Power symbol creates a global label with name \"+3V3\"" (id 5) (at 0 0 0)
        (effects (font (size 1.27 1.27)) hide)
      )
      (symbol "+3V3_0_1"
        (polyline
          (pts
            (xy -0.762 1.27)
            (xy 0 2.54)
          )
          (stroke (width 0) (type default) (color 0 0 0 0))
          (fill (type none))
        )
        (polyline
          (pts
            (xy 0 0)
            (xy 0 2.54)
          )
          (stroke (width 0) (type default) (color 0 0 0 0))
          (fill (type none))
        )
        (polyline
          (pts
            (xy 0 2.54)
            (xy 0.762 1.27)
          )
          (stroke (width 0) (type default) (color 0 0 0 0))
          (fill (type none))
        )
      )
      (symbol "+3V3_1_1"
        (pin power_in line (at 0 0 90) (length 0) hide
          (name "+3V3" (effects (font (size 1.27 1.27))))
          (number "1" (effects (font (size 1.27 1.27))))
        )
      )
    )
    (symbol "power:GND" (power) (pin_names (offset 0)) (in_bom yes) (on_board yes)
      (property "Reference" "#PWR" (id 0) (at 0 -6.35 0)
        (effects (font (size 1.27 1.27)) hide)
      )
      (property "Value" "GND" (id 1) (at 0 -3.81 0)
        (effects (font (size 1.27 1.27)))
      )
      (property "Footprint" "" (id 2) (at 0 0 0)
        (effects (font (size 1.27 1.27)) hide)
      )
      (property "Datasheet" "" (id 3) (at 0 0 0)
        (effects (font (size 1.27 1.27)) hide)
      )
      (property "ki_keywords" "power-flag" (id 4) (at 0 0 0)
        (effects (font (size 1.27 1.27)) hide)
      )
      (property "ki_description" "Power symbol creates a global label with name \"GND\" , ground" (id 5) (at 0 0 0)
        (effects (font (size 1.27 1.27)) hide)
      )
      (symbol "GND_0_1"
        (polyline
          (pts
            (xy 0 0)
            (xy 0 -1.27)
            (xy 1.27 -1.27)
            (xy 0 -2.54)
            (xy -1.27 -1.27)
            (xy 0 -1.27)
          )
          (stroke (width 0) (type default) (color 0 0 0 0))
          (fill (type none))
        )
      )
      (symbol "GND_1_1"
        (pin power_in line (at 0 0 270) (length 0) hide
          (name "GND" (effects (font (size 1.27 1.27))))
          (number "1" (effects (font (size 1.27 1.27))))
        )
      )
    )
  )

  (junction (at 106.68 110.49) (diameter 0) (color 0 0 0 0)
    (uuid 08fef505-fa83-466a-99d3-b4cfd6520dee)
  )
  (junction (at 248.92 38.1) (diameter 0) (color 0 0 0 0)
    (uuid 0cee4af1-bd02-4d5e-8c5d-eef19e12e0d5)
  )
  (junction (at 223.52 39.37) (diameter 0) (color 0 0 0 0)
    (uuid 1d0d1280-6986-4ae0-a565-b0a764bfa5dc)
  )
  (junction (at 49.53 52.07) (diameter 0) (color 0 0 0 0)
    (uuid 1fd7c45e-8544-4d7c-9be1-5d95d3e5b7f3)
  )
  (junction (at 107.95 82.55) (diameter 0) (color 0 0 0 0)
    (uuid 201c8cc7-2f5e-44f1-9514-3969adc20f8d)
  )
  (junction (at 146.05 110.49) (diameter 0) (color 0 0 0 0)
    (uuid 246d4cd2-50f8-4b01-b7f2-a2c5ba93ced8)
  )
  (junction (at 254 135.89) (diameter 0) (color 0 0 0 0)
    (uuid 29311743-1e48-4e25-b1b0-511fdda48cdf)
  )
  (junction (at 187.96 34.29) (diameter 0) (color 0 0 0 0)
    (uuid 295fa074-98a5-440d-99fe-813423e6a0eb)
  )
  (junction (at 71.12 82.55) (diameter 0) (color 0 0 0 0)
    (uuid 2c624c66-7ca6-4715-8803-0284887ee49b)
  )
  (junction (at 186.69 110.49) (diameter 0) (color 0 0 0 0)
    (uuid 2de653b4-c1ec-4b1f-9e30-59281dd57973)
  )
  (junction (at 160.02 44.45) (diameter 0) (color 0 0 0 0)
    (uuid 2df382d6-8e04-4fbe-8908-ad518b6f72fa)
  )
  (junction (at 34.29 82.55) (diameter 0) (color 0 0 0 0)
    (uuid 3fb7e6b8-150d-4967-9975-4115058b5b2a)
  )
  (junction (at 236.22 38.1) (diameter 0) (color 0 0 0 0)
    (uuid 429db936-829d-4b43-a08e-b5f2842dc264)
  )
  (junction (at 39.37 158.75) (diameter 0) (color 0 0 0 0)
    (uuid 44fddbd8-d585-4995-af6e-6e8147bb0648)
  )
  (junction (at 254 96.52) (diameter 0) (color 0 0 0 0)
    (uuid 4a6732dd-e384-4b3b-ae4a-f1e28b526260)
  )
  (junction (at 48.26 115.57) (diameter 0) (color 0 0 0 0)
    (uuid 4cf1c183-97df-42c8-9ad8-291a417d4fbb)
  )
  (junction (at 107.95 34.29) (diameter 0) (color 0 0 0 0)
    (uuid 6197cfd9-f33c-4f63-a641-cb8a20637736)
  )
  (junction (at 116.84 82.55) (diameter 0) (color 0 0 0 0)
    (uuid 62d42d9a-6ae6-4ef2-a572-17126caac476)
  )
  (junction (at 50.8 64.77) (diameter 0) (color 0 0 0 0)
    (uuid 6e93fb9e-5dca-4813-baff-eadbbe0e09d1)
  )
  (junction (at 151.13 34.29) (diameter 0) (color 0 0 0 0)
    (uuid 6f2fe0a2-c2a9-4120-8dd1-9b6b4aaace2f)
  )
  (junction (at 205.74 105.41) (diameter 0) (color 0 0 0 0)
    (uuid 70909a83-4f31-49f6-8807-6a7867f831b7)
  )
  (junction (at 254 139.7) (diameter 0) (color 0 0 0 0)
    (uuid 7baf0cac-81ea-4765-b245-e6b16fd48f36)
  )
  (junction (at 33.02 158.75) (diameter 0) (color 0 0 0 0)
    (uuid 82262542-379b-46e5-8543-83a7714f2002)
  )
  (junction (at 205.74 96.52) (diameter 0) (color 0 0 0 0)
    (uuid 827a8a60-e987-47ed-8d7d-b324a6d1ec82)
  )
  (junction (at 205.74 16.51) (diameter 0) (color 0 0 0 0)
    (uuid 842ee2af-ce8b-4412-99a2-67f6b9a126e8)
  )
  (junction (at 158.75 120.65) (diameter 0) (color 0 0 0 0)
    (uuid 86062690-cd68-43c8-8901-f5b37fa30f1b)
  )
  (junction (at 205.74 59.69) (diameter 0) (color 0 0 0 0)
    (uuid 8c4e97ae-0b7b-4098-8ccf-3925975f6136)
  )
  (junction (at 115.57 110.49) (diameter 0) (color 0 0 0 0)
    (uuid 8c7172e7-b5c0-4bfa-9e9c-647e8db909db)
  )
  (junction (at 116.84 34.29) (diameter 0) (color 0 0 0 0)
    (uuid 956aaea6-2479-499b-9f65-6039d9796639)
  )
  (junction (at 149.86 110.49) (diameter 0) (color 0 0 0 0)
    (uuid 9cb82e64-6704-42a9-a1b8-8ad4c6dae376)
  )
  (junction (at 49.53 140.97) (diameter 0) (color 0 0 0 0)
    (uuid 9ce7641e-0d57-495b-b954-53b5c8e6fe98)
  )
  (junction (at 27.94 82.55) (diameter 0) (color 0 0 0 0)
    (uuid a43388c2-f36c-4362-9154-39cf85ade53a)
  )
  (junction (at 40.64 82.55) (diameter 0) (color 0 0 0 0)
    (uuid a8ff47c8-177c-468a-8681-5bf626bc3c90)
  )
  (junction (at 115.57 158.75) (diameter 0) (color 0 0 0 0)
    (uuid b4712109-11f2-48ce-a046-c2ad35b4744d)
  )
  (junction (at 254 162.56) (diameter 0) (color 0 0 0 0)
    (uuid c05e7d3b-73c1-4581-964e-13f87e116115)
  )
  (junction (at 243.84 148.59) (diameter 0) (color 0 0 0 0)
    (uuid c1b7da9c-0f15-41e5-a036-5feb92919656)
  )
  (junction (at 48.26 128.27) (diameter 0) (color 0 0 0 0)
    (uuid c1e7497e-ff7a-466f-a3ab-6960532c50f8)
  )
  (junction (at 205.74 29.21) (diameter 0) (color 0 0 0 0)
    (uuid ca9815c1-61b5-4aa8-ad1c-959b5b7fa686)
  )
  (junction (at 147.32 34.29) (diameter 0) (color 0 0 0 0)
    (uuid dd423f33-7754-4fba-a75a-810e01572f9d)
  )
  (junction (at 205.74 22.86) (diameter 0) (color 0 0 0 0)
    (uuid de26f250-fc46-4a1b-9156-735010215744)
  )
  (junction (at 49.53 39.37) (diameter 0) (color 0 0 0 0)
    (uuid de667e6e-1e15-416e-a23f-140ca64eab3e)
  )
  (junction (at 26.67 158.75) (diameter 0) (color 0 0 0 0)
    (uuid e0e804f1-405f-4973-861b-ca3454aae22c)
  )
  (junction (at 106.68 158.75) (diameter 0) (color 0 0 0 0)
    (uuid ebefb8de-6672-4fe9-82fa-b67eb69a1aed)
  )
  (junction (at 254 105.41) (diameter 0) (color 0 0 0 0)
    (uuid eee1b2d6-c4d2-4ee3-8575-a1d656d003cb)
  )
  (junction (at 69.85 158.75) (diameter 0) (color 0 0 0 0)
    (uuid ef0b6c3f-5b08-46ac-93a8-adb1e6d2d1dc)
  )

  (wire (pts (xy 49.53 133.35) (xy 49.53 140.97))
    (stroke (width 0) (type default) (color 0 0 0 0))
    (uuid 0000aa8e-390f-4e4a-b3f8-1021f1395b4e)
  )
  (wire (pts (xy 48.26 115.57) (xy 52.07 115.57))
    (stroke (width 0) (type default) (color 0 0 0 0))
    (uuid 002f2da5-e4cc-4552-94db-acccdabbdb66)
  )
  (wire (pts (xy 236.22 38.1) (xy 236.22 41.91))
    (stroke (width 0) (type default) (color 0 0 0 0))
    (uuid 00ad34ce-63a9-441e-945d-f1f539c5c48e)
  )
  (wire (pts (xy 116.84 43.18) (xy 116.84 82.55))
    (stroke (width 0) (type default) (color 0 0 0 0))
    (uuid 047cf9c4-ba68-4f6a-8ffe-ce5fa2ecaeaa)
  )
  (wire (pts (xy 34.29 41.91) (xy 34.29 64.77))
    (stroke (width 0) (type default) (color 0 0 0 0))
    (uuid 04c47212-3165-4f4b-981b-8a9035c4a354)
  )
  (wire (pts (xy 26.67 113.03) (xy 52.07 113.03))
    (stroke (width 0) (type default) (color 0 0 0 0))
    (uuid 050825ca-3406-4394-9a53-5e6ffdc78327)
  )
  (wire (pts (xy 229.87 162.56) (xy 254 162.56))
    (stroke (width 0) (type default) (color 0 0 0 0))
    (uuid 050d15ad-c47a-4b65-88b9-6e112cd97b51)
  )
  (wire (pts (xy 116.84 34.29) (xy 107.95 34.29))
    (stroke (width 0) (type default) (color 0 0 0 0))
    (uuid 051a52c6-3827-4c17-8747-92f8115819d6)
  )
  (wire (pts (xy 160.02 41.91) (xy 160.02 44.45))
    (stroke (width 0) (type default) (color 0 0 0 0))
    (uuid 060e59f4-bf23-48fd-b6da-6f89a84c0b6c)
  )
  (wire (pts (xy 251.46 16.51) (xy 251.46 41.91))
    (stroke (width 0) (type default) (color 0 0 0 0))
    (uuid 07a9811e-505c-4a76-a0d4-d4981fd78e6c)
  )
  (wire (pts (xy 39.37 158.75) (xy 69.85 158.75))
    (stroke (width 0) (type default) (color 0 0 0 0))
    (uuid 0a70a7f1-3a16-45f5-ba98-2a28bb0beffb)
  )
  (wire (pts (xy 53.34 57.15) (xy 50.8 57.15))
    (stroke (width 0) (type default) (color 0 0 0 0))
    (uuid 0d094cb5-e9fa-4c92-96be-be7171db00ce)
  )
  (wire (pts (xy 254 105.41) (xy 254 96.52))
    (stroke (width 0) (type default) (color 0 0 0 0))
    (uuid 0d23050c-96df-4890-b067-e586bd9ac469)
  )
  (wire (pts (xy 245.11 110.49) (xy 245.11 105.41))
    (stroke (width 0) (type default) (color 0 0 0 0))
    (uuid 119fe48d-4abf-4600-94ab-e5e7b69fa750)
  )
  (wire (pts (xy 106.68 147.32) (xy 106.68 158.75))
    (stroke (width 0) (type default) (color 0 0 0 0))
    (uuid 13ab368a-ceb7-4b57-a4ef-0445706721ef)
  )
  (wire (pts (xy 236.22 35.56) (xy 233.68 35.56))
    (stroke (width 0) (type default) (color 0 0 0 0))
    (uuid 154a8740-6830-496e-b8b2-b92f0e040d3d)
  )
  (wire (pts (xy 256.54 41.91) (xy 256.54 38.1))
    (stroke (width 0) (type default) (color 0 0 0 0))
    (uuid 195585c6-2c2f-4dd3-8ce0-1d16f152cda8)
  )
  (wire (pts (xy 45.72 140.97) (xy 49.53 140.97))
    (stroke (width 0) (type default) (color 0 0 0 0))
    (uuid 19e7a09c-e136-46c0-8870-e47c19097831)
  )
  (wire (pts (xy 231.14 41.91) (xy 231.14 39.37))
    (stroke (width 0) (type default) (color 0 0 0 0))
    (uuid 1ad73eb6-c6e1-4ff9-8b31-b79c4b305aa0)
  )
  (wire (pts (xy 27.94 36.83) (xy 53.34 36.83))
    (stroke (width 0) (type default) (color 0 0 0 0))
    (uuid 1adc9f01-32c3-4e40-a5ce-64366d375638)
  )
  (wire (pts (xy 52.07 123.19) (xy 39.37 123.19))
    (stroke (width 0) (type default) (color 0 0 0 0))
    (uuid 1ced8ec6-d92d-480a-b1f4-a0c5889436e9)
  )
  (wire (pts (xy 158.75 120.65) (xy 158.75 124.46))
    (stroke (width 0) (type default) (color 0 0 0 0))
    (uuid 1d4a685f-a32a-40a8-a82d-6d84188a3124)
  )
  (wire (pts (xy 34.29 41.91) (xy 53.34 41.91))
    (stroke (width 0) (type default) (color 0 0 0 0))
    (uuid 1d94291d-aee2-4a78-b8c7-28265771fc34)
  )
  (wire (pts (xy 39.37 148.59) (xy 39.37 158.75))
    (stroke (width 0) (type default) (color 0 0 0 0))
    (uuid 1eded113-09fc-4187-9171-0b427fbe42e0)
  )
  (wire (pts (xy 87.63 123.19) (xy 90.17 123.19))
    (stroke (width 0) (type default) (color 0 0 0 0))
    (uuid 23b50cac-062e-4d00-9c46-ac3a99833d22)
  )
  (wire (pts (xy 231.14 39.37) (xy 223.52 39.37))
    (stroke (width 0) (type default) (color 0 0 0 0))
    (uuid 23c729bb-0f68-4015-bc21-1ed69562df7b)
  )
  (wire (pts (xy 247.65 110.49) (xy 247.65 105.41))
    (stroke (width 0) (type default) (color 0 0 0 0))
    (uuid 24040f79-a798-4a58-9685-e516810bdbd5)
  )
  (wire (pts (xy 247.65 105.41) (xy 254 105.41))
    (stroke (width 0) (type default) (color 0 0 0 0))
    (uuid 2412af55-959d-4246-bbb6-b7efe87a15f9)
  )
  (wire (pts (xy 106.68 158.75) (xy 69.85 158.75))
    (stroke (width 0) (type default) (color 0 0 0 0))
    (uuid 2527cc29-095b-47d7-9881-c3056d2e070b)
  )
  (wire (pts (xy 40.64 82.55) (xy 71.12 82.55))
    (stroke (width 0) (type default) (color 0 0 0 0))
    (uuid 253ff617-520a-4475-950d-d93c75a35224)
  )
  (wire (pts (xy 205.74 22.86) (xy 205.74 29.21))
    (stroke (width 0) (type default) (color 0 0 0 0))
    (uuid 26005c2a-03bc-4fc1-8f5f-b926859264a0)
  )
  (wire (pts (xy 147.32 76.2) (xy 147.32 82.55))
    (stroke (width 0) (type default) (color 0 0 0 0))
    (uuid 29b44ff7-7c20-4fc2-8cff-73a9c3f6e1d7)
  )
  (wire (pts (xy 248.92 34.29) (xy 248.92 38.1))
    (stroke (width 0) (type default) (color 0 0 0 0))
    (uuid 2b84190e-b59f-4798-8330-5d7e29e639f1)
  )
  (wire (pts (xy 151.13 58.42) (xy 151.13 34.29))
    (stroke (width 0) (type default) (color 0 0 0 0))
    (uuid 2be6d152-0ba1-4a5e-a373-d495c71c8661)
  )
  (wire (pts (xy 48.26 128.27) (xy 45.72 128.27))
    (stroke (width 0) (type default) (color 0 0 0 0))
    (uuid 2d68b0e2-46e2-4c49-b121-3dd5550feacb)
  )
  (wire (pts (xy 187.96 34.29) (xy 191.77 34.29))
    (stroke (width 0) (type default) (color 0 0 0 0))
    (uuid 2dd7d5cd-a733-40bb-805c-17bca8e264b9)
  )
  (wire (pts (xy 254 105.41) (xy 254 135.89))
    (stroke (width 0) (type default) (color 0 0 0 0))
    (uuid 328871fe-0059-4ad3-837d-efb70c52ab65)
  )
  (wire (pts (xy 160.02 44.45) (xy 160.02 48.26))
    (stroke (width 0) (type default) (color 0 0 0 0))
    (uuid 32e1b011-8d90-43b3-9060-9c1911a42f63)
  )
  (wire (pts (xy 53.34 31.75) (xy 49.53 31.75))
    (stroke (width 0) (type default) (color 0 0 0 0))
    (uuid 32fb6258-9a19-4acd-b52e-6c258e39dcf8)
  )
  (wire (pts (xy 215.9 29.21) (xy 205.74 29.21))
    (stroke (width 0) (type default) (color 0 0 0 0))
    (uuid 34fbe09a-336d-4fc4-8827-1076e533e3b3)
  )
  (wire (pts (xy 166.37 124.46) (xy 166.37 120.65))
    (stroke (width 0) (type default) (color 0 0 0 0))
    (uuid 357cf660-c3af-4dff-8827-7a32694ae364)
  )
  (wire (pts (xy 167.64 48.26) (xy 167.64 44.45))
    (stroke (width 0) (type default) (color 0 0 0 0))
    (uuid 36f7d0ca-8ae1-4311-8534-5626245de9a8)
  )
  (wire (pts (xy 241.3 41.91) (xy 241.3 29.21))
    (stroke (width 0) (type default) (color 0 0 0 0))
    (uuid 385e0694-fcee-4e34-9267-cad4eb22df78)
  )
  (wire (pts (xy 163.83 110.49) (xy 186.69 110.49))
    (stroke (width 0) (type default) (color 0 0 0 0))
    (uuid 39d179b6-1166-4c75-9c87-d5beded8e7c3)
  )
  (wire (pts (xy 27.94 82.55) (xy 27.94 86.36))
    (stroke (width 0) (type default) (color 0 0 0 0))
    (uuid 3e0d7d2c-ee8a-464f-aff2-736283dbb00c)
  )
  (wire (pts (xy 45.72 39.37) (xy 49.53 39.37))
    (stroke (width 0) (type default) (color 0 0 0 0))
    (uuid 3ff5b76c-fa7c-42a8-b87e-dac29bcb715b)
  )
  (wire (pts (xy 171.45 134.62) (xy 186.69 134.62))
    (stroke (width 0) (type default) (color 0 0 0 0))
    (uuid 40152d57-df93-48dc-8de9-b24439fb3726)
  )
  (wire (pts (xy 205.74 96.52) (xy 205.74 59.69))
    (stroke (width 0) (type default) (color 0 0 0 0))
    (uuid 40479724-26d7-42ac-ac31-1c4f913484cc)
  )
  (wire (pts (xy 49.53 52.07) (xy 53.34 52.07))
    (stroke (width 0) (type default) (color 0 0 0 0))
    (uuid 42f7c212-0ff9-4bc8-b76e-0b1ccdda2eb9)
  )
  (wire (pts (xy 246.38 22.86) (xy 223.52 22.86))
    (stroke (width 0) (type default) (color 0 0 0 0))
    (uuid 46b23b80-440f-4bcc-9b8c-39c742070a64)
  )
  (wire (pts (xy 33.02 158.75) (xy 39.37 158.75))
    (stroke (width 0) (type default) (color 0 0 0 0))
    (uuid 46c2abb0-195d-4ae3-8587-ef453e5a6be6)
  )
  (wire (pts (xy 167.64 68.58) (xy 167.64 76.2))
    (stroke (width 0) (type default) (color 0 0 0 0))
    (uuid 472c6d28-2cf0-4453-a891-0611dc785bd8)
  )
  (wire (pts (xy 49.53 31.75) (xy 49.53 39.37))
    (stroke (width 0) (type default) (color 0 0 0 0))
    (uuid 47df68ed-0e54-4749-a9f2-71c1abfab475)
  )
  (wire (pts (xy 33.02 118.11) (xy 33.02 140.97))
    (stroke (width 0) (type default) (color 0 0 0 0))
    (uuid 4835fc71-1cb9-4640-9b4e-309d32541049)
  )
  (wire (pts (xy 88.9 34.29) (xy 107.95 34.29))
    (stroke (width 0) (type default) (color 0 0 0 0))
    (uuid 48695ddc-da7d-433d-a751-d0abff5a8b1e)
  )
  (wire (pts (xy 71.12 16.51) (xy 71.12 19.05))
    (stroke (width 0) (type default) (color 0 0 0 0))
    (uuid 48a41f28-8b6d-4c1d-a281-c0ed3795216c)
  )
  (wire (pts (xy 245.11 105.41) (xy 205.74 105.41))
    (stroke (width 0) (type default) (color 0 0 0 0))
    (uuid 49eb3b9c-3e6f-4084-a4b8-ba2bae645fad)
  )
  (wire (pts (xy 236.22 38.1) (xy 236.22 35.56))
    (stroke (width 0) (type default) (color 0 0 0 0))
    (uuid 4b607fc5-d03f-4278-8219-88c31454f00a)
  )
  (wire (pts (xy 146.05 152.4) (xy 146.05 158.75))
    (stroke (width 0) (type default) (color 0 0 0 0))
    (uuid 4c283d00-13e5-4b1e-a455-1593e896fdee)
  )
  (wire (pts (xy 49.53 26.67) (xy 53.34 26.67))
    (stroke (width 0) (type default) (color 0 0 0 0))
    (uuid 513cf814-8750-4d89-9c55-9cfba7299c00)
  )
  (wire (pts (xy 50.8 64.77) (xy 50.8 67.31))
    (stroke (width 0) (type default) (color 0 0 0 0))
    (uuid 52091a44-c859-4137-91e9-d0b2bc493d20)
  )
  (wire (pts (xy 44.45 115.57) (xy 48.26 115.57))
    (stroke (width 0) (type default) (color 0 0 0 0))
    (uuid 557d20b5-5976-4ab8-ab24-0c3d261bb2a9)
  )
  (wire (pts (xy 49.53 52.07) (xy 46.99 52.07))
    (stroke (width 0) (type default) (color 0 0 0 0))
    (uuid 56cd8b1d-c578-437b-ac09-01d50043d8d5)
  )
  (wire (pts (xy 147.32 34.29) (xy 151.13 34.29))
    (stroke (width 0) (type default) (color 0 0 0 0))
    (uuid 57a0b0bf-398e-43d7-ac94-aa69501851fe)
  )
  (wire (pts (xy 27.94 72.39) (xy 27.94 82.55))
    (stroke (width 0) (type default) (color 0 0 0 0))
    (uuid 58673ef7-8f64-4e4a-86a2-dbc049e11e51)
  )
  (wire (pts (xy 223.52 39.37) (xy 220.98 39.37))
    (stroke (width 0) (type default) (color 0 0 0 0))
    (uuid 5969cce2-001a-433d-a6d2-3e6bc5d5b9cd)
  )
  (wire (pts (xy 219.71 148.59) (xy 212.09 148.59))
    (stroke (width 0) (type default) (color 0 0 0 0))
    (uuid 5b30ecab-7238-4987-9afc-6dcf358b32ff)
  )
  (wire (pts (xy 107.95 82.55) (xy 116.84 82.55))
    (stroke (width 0) (type default) (color 0 0 0 0))
    (uuid 5fb7447c-f187-422d-a8aa-2f35f8117090)
  )
  (wire (pts (xy 49.53 39.37) (xy 49.53 52.07))
    (stroke (width 0) (type default) (color 0 0 0 0))
    (uuid 617996f1-3ad1-4275-9eb3-b4fd4e4d1f88)
  )
  (wire (pts (xy 205.74 29.21) (xy 205.74 59.69))
    (stroke (width 0) (type default) (color 0 0 0 0))
    (uuid 61e61974-2983-4969-9575-4eea9eb4c39e)
  )
  (wire (pts (xy 229.87 143.51) (xy 229.87 139.7))
    (stroke (width 0) (type default) (color 0 0 0 0))
    (uuid 6277cba4-29df-4285-a82c-f0afcc3dc3d4)
  )
  (wire (pts (xy 186.69 110.49) (xy 186.69 134.62))
    (stroke (width 0) (type default) (color 0 0 0 0))
    (uuid 62b2472b-b8b5-448f-9d74-d1720cd5aedb)
  )
  (wire (pts (xy 45.72 138.43) (xy 45.72 140.97))
    (stroke (width 0) (type default) (color 0 0 0 0))
    (uuid 6421d644-286f-4012-bd3e-48ab37761ef5)
  )
  (wire (pts (xy 34.29 82.55) (xy 40.64 82.55))
    (stroke (width 0) (type default) (color 0 0 0 0))
    (uuid 6a2bb803-efeb-4901-ad9d-0ffbd3619cf5)
  )
  (wire (pts (xy 26.67 158.75) (xy 33.02 158.75))
    (stroke (width 0) (type default) (color 0 0 0 0))
    (uuid 6acc7c07-a4c6-44d0-9515-0e73545d0260)
  )
  (wire (pts (xy 254 139.7) (xy 254 143.51))
    (stroke (width 0) (type default) (color 0 0 0 0))
    (uuid 6ec6671e-56f1-42fd-ad8c-abe64708ba89)
  )
  (wire (pts (xy 215.9 22.86) (xy 205.74 22.86))
    (stroke (width 0) (type default) (color 0 0 0 0))
    (uuid 7231c188-9218-431b-aff5-b4bfa2a3009b)
  )
  (wire (pts (xy 233.68 77.47) (xy 233.68 80.01))
    (stroke (width 0) (type default) (color 0 0 0 0))
    (uuid 73f10d5b-4707-4e2a-af7e-f16bd94fda43)
  )
  (wire (pts (xy 87.63 128.27) (xy 90.17 128.27))
    (stroke (width 0) (type default) (color 0 0 0 0))
    (uuid 76859654-76b2-49a4-b74b-ca4463b0c666)
  )
  (wire (pts (xy 186.69 110.49) (xy 190.5 110.49))
    (stroke (width 0) (type default) (color 0 0 0 0))
    (uuid 78615780-6955-40d1-b1f6-6940ebb5c475)
  )
  (wire (pts (xy 40.64 46.99) (xy 40.64 64.77))
    (stroke (width 0) (type default) (color 0 0 0 0))
    (uuid 7b7fd00f-d0a4-4fd9-875d-5fb23fc1ca5d)
  )
  (wire (pts (xy 116.84 34.29) (xy 147.32 34.29))
    (stroke (width 0) (type default) (color 0 0 0 0))
    (uuid 7fa64f1c-da05-4f09-9b6f-92941a816de4)
  )
  (wire (pts (xy 223.52 35.56) (xy 223.52 39.37))
    (stroke (width 0) (type default) (color 0 0 0 0))
    (uuid 80ca5690-76b1-4fe5-a00b-c69af53941fc)
  )
  (wire (pts (xy 52.07 133.35) (xy 49.53 133.35))
    (stroke (width 0) (type default) (color 0 0 0 0))
    (uuid 80ed97ba-26c6-4865-ba6f-9541aec267d6)
  )
  (wire (pts (xy 121.92 43.18) (xy 116.84 43.18))
    (stroke (width 0) (type default) (color 0 0 0 0))
    (uuid 8103d5eb-5c57-4271-8c03-7dc2355aebd0)
  )
  (wire (pts (xy 71.12 64.77) (xy 71.12 82.55))
    (stroke (width 0) (type default) (color 0 0 0 0))
    (uuid 817999c3-6428-4bac-96f6-0e05a155c534)
  )
  (wire (pts (xy 172.72 58.42) (xy 187.96 58.42))
    (stroke (width 0) (type default) (color 0 0 0 0))
    (uuid 82a2bf5f-ab0f-4d1f-ae8b-063f5ed04cf5)
  )
  (wire (pts (xy 149.86 134.62) (xy 149.86 110.49))
    (stroke (width 0) (type default) (color 0 0 0 0))
    (uuid 874bcd7c-55a7-44b9-ad64-37885d2f9dd0)
  )
  (wire (pts (xy 48.26 102.87) (xy 52.07 102.87))
    (stroke (width 0) (type default) (color 0 0 0 0))
    (uuid 876084bd-00c7-4315-8a96-13dd546bd404)
  )
  (wire (pts (xy 236.22 77.47) (xy 236.22 80.01))
    (stroke (width 0) (type default) (color 0 0 0 0))
    (uuid 8b2a1ca0-7b13-4ffe-a528-b7056691a8a2)
  )
  (wire (pts (xy 229.87 139.7) (xy 254 139.7))
    (stroke (width 0) (type default) (color 0 0 0 0))
    (uuid 8bf95624-4fe1-41d9-a19c-09592b1730cc)
  )
  (wire (pts (xy 154.94 58.42) (xy 151.13 58.42))
    (stroke (width 0) (type default) (color 0 0 0 0))
    (uuid 8d816448-79d6-4392-b0c6-6eb2af6fd777)
  )
  (wire (pts (xy 187.96 34.29) (xy 187.96 58.42))
    (stroke (width 0) (type default) (color 0 0 0 0))
    (uuid 8dc92bab-5d65-451d-b5e9-7d9e65be9fbd)
  )
  (wire (pts (xy 254 77.47) (xy 254 96.52))
    (stroke (width 0) (type default) (color 0 0 0 0))
    (uuid 8f089596-a7b1-4f9d-8969-0373a5c97ab1)
  )
  (wire (pts (xy 166.37 144.78) (xy 166.37 152.4))
    (stroke (width 0) (type default) (color 0 0 0 0))
    (uuid 8f8d8eff-82fa-404e-8313-91875f94fc0b)
  )
  (wire (pts (xy 151.13 34.29) (xy 154.94 34.29))
    (stroke (width 0) (type default) (color 0 0 0 0))
    (uuid 8fee751f-26ac-4f05-8f9c-419b9782840f)
  )
  (wire (pts (xy 107.95 71.12) (xy 107.95 82.55))
    (stroke (width 0) (type default) (color 0 0 0 0))
    (uuid 9011c32b-c2e8-4430-99de-5214e2374c39)
  )
  (wire (pts (xy 33.02 148.59) (xy 33.02 158.75))
    (stroke (width 0) (type default) (color 0 0 0 0))
    (uuid 92ef0b8a-7e25-4183-8c5c-ab9180ea3e22)
  )
  (wire (pts (xy 88.9 46.99) (xy 91.44 46.99))
    (stroke (width 0) (type default) (color 0 0 0 0))
    (uuid 9320e01e-b1ef-4e49-8aa2-e86f25b2d9bc)
  )
  (wire (pts (xy 88.9 54.61) (xy 91.44 54.61))
    (stroke (width 0) (type default) (color 0 0 0 0))
    (uuid 93f021e3-1b02-4bdd-9480-ce4a140f3c46)
  )
  (wire (pts (xy 46.99 52.07) (xy 46.99 54.61))
    (stroke (width 0) (type default) (color 0 0 0 0))
    (uuid 9454813e-0d28-42a9-a260-8698de024db8)
  )
  (wire (pts (xy 158.75 118.11) (xy 158.75 120.65))
    (stroke (width 0) (type default) (color 0 0 0 0))
    (uuid 94d18e60-cf80-484b-9598-0d151037ead0)
  )
  (wire (pts (xy 48.26 115.57) (xy 48.26 128.27))
    (stroke (width 0) (type default) (color 0 0 0 0))
    (uuid 9589d543-503e-4fe8-b7c3-90e6e5800281)
  )
  (wire (pts (xy 248.92 38.1) (xy 236.22 38.1))
    (stroke (width 0) (type default) (color 0 0 0 0))
    (uuid 968d828b-ec90-4489-8964-2e2160c6b722)
  )
  (wire (pts (xy 116.84 82.55) (xy 147.32 82.55))
    (stroke (width 0) (type default) (color 0 0 0 0))
    (uuid 968da795-1bdc-4806-9428-ab83310d12ea)
  )
  (wire (pts (xy 27.94 82.55) (xy 34.29 82.55))
    (stroke (width 0) (type default) (color 0 0 0 0))
    (uuid 97883230-f71f-41dc-b58b-b55ba056211c)
  )
  (wire (pts (xy 149.86 110.49) (xy 153.67 110.49))
    (stroke (width 0) (type default) (color 0 0 0 0))
    (uuid 97f82998-bf73-4066-b1b4-b1c2889a9789)
  )
  (wire (pts (xy 166.37 120.65) (xy 158.75 120.65))
    (stroke (width 0) (type default) (color 0 0 0 0))
    (uuid 9801fd1a-6757-4caa-9945-f10a65c0e971)
  )
  (wire (pts (xy 121.92 40.64) (xy 116.84 40.64))
    (stroke (width 0) (type default) (color 0 0 0 0))
    (uuid 9813ec4c-9c25-4801-a3e7-873af50a03f8)
  )
  (wire (pts (xy 205.74 105.41) (xy 205.74 135.89))
    (stroke (width 0) (type default) (color 0 0 0 0))
    (uuid 98780c56-7761-4768-9f97-ef07ddfb19c4)
  )
  (wire (pts (xy 205.74 96.52) (xy 205.74 105.41))
    (stroke (width 0) (type default) (color 0 0 0 0))
    (uuid 99607bbe-7aee-4dfa-8e1c-1eb9b56657cf)
  )
  (wire (pts (xy 246.38 22.86) (xy 246.38 41.91))
    (stroke (width 0) (type default) (color 0 0 0 0))
    (uuid 99b8ea6b-2841-4424-8df2-34f54c2b164b)
  )
  (wire (pts (xy 45.72 128.27) (xy 45.72 130.81))
    (stroke (width 0) (type default) (color 0 0 0 0))
    (uuid 9a9926ff-26ce-47c2-9492-08fa65354e76)
  )
  (wire (pts (xy 34.29 72.39) (xy 34.29 82.55))
    (stroke (width 0) (type default) (color 0 0 0 0))
    (uuid 9c39ba7e-bbdc-4ddf-b49d-be653f0dc2df)
  )
  (wire (pts (xy 120.65 119.38) (xy 115.57 119.38))
    (stroke (width 0) (type default) (color 0 0 0 0))
    (uuid 9c4f3ba3-ade3-451b-bba1-f120bf812b6f)
  )
  (wire (pts (xy 27.94 36.83) (xy 27.94 64.77))
    (stroke (width 0) (type default) (color 0 0 0 0))
    (uuid 9d5dc54c-f2b8-4e44-8bd3-a264dfe97fa6)
  )
  (wire (pts (xy 88.9 52.07) (xy 91.44 52.07))
    (stroke (width 0) (type default) (color 0 0 0 0))
    (uuid 9d7332c0-a5ed-4350-a75c-a1fceccb6a03)
  )
  (wire (pts (xy 87.63 130.81) (xy 90.17 130.81))
    (stroke (width 0) (type default) (color 0 0 0 0))
    (uuid a0ae1e08-7be7-4505-9f7b-efba9987faa9)
  )
  (wire (pts (xy 69.85 140.97) (xy 69.85 158.75))
    (stroke (width 0) (type default) (color 0 0 0 0))
    (uuid a0dc94bb-1112-485b-8b55-7800faf06a4a)
  )
  (wire (pts (xy 106.68 110.49) (xy 106.68 139.7))
    (stroke (width 0) (type default) (color 0 0 0 0))
    (uuid a1a447d4-3900-4443-b70e-688d30b659a7)
  )
  (wire (pts (xy 223.52 59.69) (xy 205.74 59.69))
    (stroke (width 0) (type default) (color 0 0 0 0))
    (uuid a2b6f544-9240-4103-8978-9f49d8b63f64)
  )
  (wire (pts (xy 215.9 16.51) (xy 205.74 16.51))
    (stroke (width 0) (type default) (color 0 0 0 0))
    (uuid a3240414-e1da-44e3-bdaf-40d809239fcc)
  )
  (wire (pts (xy 212.09 135.89) (xy 205.74 135.89))
    (stroke (width 0) (type default) (color 0 0 0 0))
    (uuid a5063827-e05a-4b28-8e32-ce8fded738b6)
  )
  (wire (pts (xy 46.99 64.77) (xy 50.8 64.77))
    (stroke (width 0) (type default) (color 0 0 0 0))
    (uuid a5dbeb33-5c35-4190-aca3-8c5e67756551)
  )
  (wire (pts (xy 243.84 156.21) (xy 243.84 148.59))
    (stroke (width 0) (type default) (color 0 0 0 0))
    (uuid a7e7fdba-32a7-4835-9a0c-7e5ded13ad64)
  )
  (wire (pts (xy 254 135.89) (xy 219.71 135.89))
    (stroke (width 0) (type default) (color 0 0 0 0))
    (uuid ae9e91c1-2950-4758-b229-cad92b88c28d)
  )
  (wire (pts (xy 33.02 118.11) (xy 52.07 118.11))
    (stroke (width 0) (type default) (color 0 0 0 0))
    (uuid af506248-6960-463e-a35c-b3a97f3c0ad3)
  )
  (wire (pts (xy 146.05 110.49) (xy 149.86 110.49))
    (stroke (width 0) (type default) (color 0 0 0 0))
    (uuid b1ed6afb-6b18-4cf8-85d9-34ce34e33a78)
  )
  (wire (pts (xy 87.63 110.49) (xy 106.68 110.49))
    (stroke (width 0) (type default) (color 0 0 0 0))
    (uuid b25c7fdb-8f6e-4443-8a69-4ccf15c959aa)
  )
  (wire (pts (xy 153.67 134.62) (xy 149.86 134.62))
    (stroke (width 0) (type default) (color 0 0 0 0))
    (uuid b4d270e3-61e9-44cf-974f-54202eba86b4)
  )
  (wire (pts (xy 107.95 34.29) (xy 107.95 63.5))
    (stroke (width 0) (type default) (color 0 0 0 0))
    (uuid b6001736-c481-4ed8-8ae2-02fc707d177a)
  )
  (wire (pts (xy 49.53 140.97) (xy 49.53 143.51))
    (stroke (width 0) (type default) (color 0 0 0 0))
    (uuid b7243371-6e98-4462-b065-e027fb598f5d)
  )
  (wire (pts (xy 254 96.52) (xy 224.79 96.52))
    (stroke (width 0) (type default) (color 0 0 0 0))
    (uuid b78bad44-81ed-4380-b075-f68f9f833ae6)
  )
  (wire (pts (xy 241.3 29.21) (xy 223.52 29.21))
    (stroke (width 0) (type default) (color 0 0 0 0))
    (uuid bdbcb2af-cc02-4b0f-9d5f-db82534338f0)
  )
  (wire (pts (xy 69.85 92.71) (xy 69.85 95.25))
    (stroke (width 0) (type default) (color 0 0 0 0))
    (uuid c0222b31-dc48-4864-b6e1-eca21bb948b4)
  )
  (wire (pts (xy 219.71 156.21) (xy 212.09 156.21))
    (stroke (width 0) (type default) (color 0 0 0 0))
    (uuid c065a1a8-82c7-49af-82ac-df3dd6bbd015)
  )
  (wire (pts (xy 246.38 148.59) (xy 243.84 148.59))
    (stroke (width 0) (type default) (color 0 0 0 0))
    (uuid c19028d4-368c-490d-98dc-79f5aabd69b9)
  )
  (wire (pts (xy 115.57 110.49) (xy 146.05 110.49))
    (stroke (width 0) (type default) (color 0 0 0 0))
    (uuid c40b83c5-128d-4f47-b693-a94f1ca39220)
  )
  (wire (pts (xy 115.57 116.84) (xy 115.57 110.49))
    (stroke (width 0) (type default) (color 0 0 0 0))
    (uuid c4c58c1e-7a32-4d46-a323-b3de92d49436)
  )
  (wire (pts (xy 158.75 144.78) (xy 158.75 152.4))
    (stroke (width 0) (type default) (color 0 0 0 0))
    (uuid c696ee96-9fce-41dd-b1e4-8acb2e52660c)
  )
  (wire (pts (xy 50.8 57.15) (xy 50.8 64.77))
    (stroke (width 0) (type default) (color 0 0 0 0))
    (uuid ca6f8717-38e3-4be4-996f-10cfa6929e45)
  )
  (wire (pts (xy 46.99 62.23) (xy 46.99 64.77))
    (stroke (width 0) (type default) (color 0 0 0 0))
    (uuid cacf46f0-2d10-4d98-b2c9-9dd128cbd561)
  )
  (wire (pts (xy 205.74 16.51) (xy 201.93 16.51))
    (stroke (width 0) (type default) (color 0 0 0 0))
    (uuid cbbcbecf-c4e5-43a8-8457-6acdafce6a64)
  )
  (wire (pts (xy 115.57 158.75) (xy 146.05 158.75))
    (stroke (width 0) (type default) (color 0 0 0 0))
    (uuid d026bbb2-3ed0-4e23-acaa-72a396995703)
  )
  (wire (pts (xy 254 162.56) (xy 257.81 162.56))
    (stroke (width 0) (type default) (color 0 0 0 0))
    (uuid d1493e40-d966-4dd0-b374-582204a2f583)
  )
  (wire (pts (xy 271.78 59.69) (xy 269.24 59.69))
    (stroke (width 0) (type default) (color 0 0 0 0))
    (uuid d1f41f0a-beb5-4771-91cf-36c268617212)
  )
  (wire (pts (xy 165.1 34.29) (xy 187.96 34.29))
    (stroke (width 0) (type default) (color 0 0 0 0))
    (uuid d3bac258-012e-4871-b340-59d2203d9a03)
  )
  (wire (pts (xy 115.57 110.49) (xy 106.68 110.49))
    (stroke (width 0) (type default) (color 0 0 0 0))
    (uuid d5c92d15-b20c-46b3-a4dd-25261ec50bab)
  )
  (wire (pts (xy 39.37 123.19) (xy 39.37 140.97))
    (stroke (width 0) (type default) (color 0 0 0 0))
    (uuid d9f8ba31-e370-4f46-b47b-23e523d07042)
  )
  (wire (pts (xy 254 135.89) (xy 254 139.7))
    (stroke (width 0) (type default) (color 0 0 0 0))
    (uuid da0231f4-c288-44f4-9e94-210791e7a8a8)
  )
  (wire (pts (xy 120.65 116.84) (xy 115.57 116.84))
    (stroke (width 0) (type default) (color 0 0 0 0))
    (uuid dc305df8-92ee-43fc-aa5e-58197137da8c)
  )
  (wire (pts (xy 226.06 35.56) (xy 223.52 35.56))
    (stroke (width 0) (type default) (color 0 0 0 0))
    (uuid dc94c954-61df-4dfb-a6c6-d56e491ea5e7)
  )
  (wire (pts (xy 243.84 148.59) (xy 240.03 148.59))
    (stroke (width 0) (type default) (color 0 0 0 0))
    (uuid dc9bddaf-a56a-4d1b-a0a4-e62caebf8936)
  )
  (wire (pts (xy 254 153.67) (xy 254 162.56))
    (stroke (width 0) (type default) (color 0 0 0 0))
    (uuid dfaad060-2ddf-4735-833b-f67d378c42df)
  )
  (wire (pts (xy 248.92 38.1) (xy 248.92 41.91))
    (stroke (width 0) (type default) (color 0 0 0 0))
    (uuid e1c5daf4-6a7f-487d-ae70-97d91d912d00)
  )
  (wire (pts (xy 160.02 68.58) (xy 160.02 76.2))
    (stroke (width 0) (type default) (color 0 0 0 0))
    (uuid e3b02b22-4b29-4c69-9d7f-ee449f894fd3)
  )
  (wire (pts (xy 146.05 110.49) (xy 146.05 144.78))
    (stroke (width 0) (type default) (color 0 0 0 0))
    (uuid e4081511-5db8-4a93-937a-9da44ea108d5)
  )
  (wire (pts (xy 251.46 16.51) (xy 223.52 16.51))
    (stroke (width 0) (type default) (color 0 0 0 0))
    (uuid e52b2514-5d37-4347-b28c-6dd912c32a10)
  )
  (wire (pts (xy 52.07 107.95) (xy 48.26 107.95))
    (stroke (width 0) (type default) (color 0 0 0 0))
    (uuid e5e0c811-ca48-4507-9c38-8ba732beb21a)
  )
  (wire (pts (xy 106.68 158.75) (xy 115.57 158.75))
    (stroke (width 0) (type default) (color 0 0 0 0))
    (uuid e6057dd8-68b2-4c1b-8115-522ca36c5bb0)
  )
  (wire (pts (xy 217.17 96.52) (xy 205.74 96.52))
    (stroke (width 0) (type default) (color 0 0 0 0))
    (uuid e63c2216-899b-4073-8b4d-f98407ba9746)
  )
  (wire (pts (xy 261.62 38.1) (xy 261.62 41.91))
    (stroke (width 0) (type default) (color 0 0 0 0))
    (uuid e646ac69-5be5-4367-b99b-5d09b432a408)
  )
  (wire (pts (xy 26.67 113.03) (xy 26.67 140.97))
    (stroke (width 0) (type default) (color 0 0 0 0))
    (uuid e7da2f98-40a8-4795-ae2f-56daf08e3574)
  )
  (wire (pts (xy 116.84 40.64) (xy 116.84 34.29))
    (stroke (width 0) (type default) (color 0 0 0 0))
    (uuid e9cedddc-39a7-45ba-bf59-2cc7eeee5e70)
  )
  (wire (pts (xy 147.32 34.29) (xy 147.32 68.58))
    (stroke (width 0) (type default) (color 0 0 0 0))
    (uuid ec1f80ba-1881-4d5f-b758-93b78670f8a7)
  )
  (wire (pts (xy 256.54 38.1) (xy 248.92 38.1))
    (stroke (width 0) (type default) (color 0 0 0 0))
    (uuid ec3124af-d7a3-483a-b882-ec0ace4e5f34)
  )
  (wire (pts (xy 115.57 119.38) (xy 115.57 158.75))
    (stroke (width 0) (type default) (color 0 0 0 0))
    (uuid ec3abe07-e901-4cb7-b077-9eb1cbd94073)
  )
  (wire (pts (xy 240.03 156.21) (xy 243.84 156.21))
    (stroke (width 0) (type default) (color 0 0 0 0))
    (uuid efebec7a-6867-48cd-8f83-fb3279769da3)
  )
  (wire (pts (xy 26.67 148.59) (xy 26.67 158.75))
    (stroke (width 0) (type default) (color 0 0 0 0))
    (uuid f188ea85-e2a0-4ed8-bf76-f69335cdbd46)
  )
  (wire (pts (xy 40.64 72.39) (xy 40.64 82.55))
    (stroke (width 0) (type default) (color 0 0 0 0))
    (uuid f239a8ba-067c-44f8-9dc5-59a008f0515c)
  )
  (wire (pts (xy 229.87 161.29) (xy 229.87 162.56))
    (stroke (width 0) (type default) (color 0 0 0 0))
    (uuid f40e3463-e3a6-4687-babf-aff67156ca1e)
  )
  (wire (pts (xy 26.67 158.75) (xy 26.67 162.56))
    (stroke (width 0) (type default) (color 0 0 0 0))
    (uuid f47fa148-9692-4ec9-a2b5-581f9300cbd8)
  )
  (wire (pts (xy 48.26 128.27) (xy 52.07 128.27))
    (stroke (width 0) (type default) (color 0 0 0 0))
    (uuid f607a5da-32ca-479f-93c5-c9b3a668a276)
  )
  (wire (pts (xy 241.3 77.47) (xy 241.3 80.01))
    (stroke (width 0) (type default) (color 0 0 0 0))
    (uuid f6676711-759b-4a4a-b8a6-27cc37ebf43c)
  )
  (wire (pts (xy 48.26 107.95) (xy 48.26 115.57))
    (stroke (width 0) (type default) (color 0 0 0 0))
    (uuid f80365b9-ae0a-4909-a92b-60d288f7f274)
  )
  (wire (pts (xy 167.64 44.45) (xy 160.02 44.45))
    (stroke (width 0) (type default) (color 0 0 0 0))
    (uuid f848302f-f63d-410a-a425-89bc4dcd0d38)
  )
  (wire (pts (xy 49.53 39.37) (xy 53.34 39.37))
    (stroke (width 0) (type default) (color 0 0 0 0))
    (uuid f90ec030-eba9-49cd-9bc0-de1294c4bd4b)
  )
  (wire (pts (xy 205.74 16.51) (xy 205.74 22.86))
    (stroke (width 0) (type default) (color 0 0 0 0))
    (uuid fdc6b5f2-6b90-4af2-b289-e11a47e62dcf)
  )
  (wire (pts (xy 107.95 82.55) (xy 71.12 82.55))
    (stroke (width 0) (type default) (color 0 0 0 0))
    (uuid fe5fe255-498a-4b3a-a6fb-cf2c416f05b3)
  )
  (wire (pts (xy 53.34 46.99) (xy 40.64 46.99))
    (stroke (width 0) (type default) (color 0 0 0 0))
    (uuid ffd007d7-6153-4cb5-9e7c-2e548a0b407e)
  )

  (global_label "PG-3" (shape input) (at 241.3 80.01 270) (fields_autoplaced)
    (effects (font (size 1.27 1.27)) (justify right))
    (uuid 03e4499c-e2bc-43ad-91e4-6d1ab0939350)
    (property "Intersheet References" "${INTERSHEET_REFS}" (id 0) (at 241.2206 87.745 90)
      (effects (font (size 1.27 1.27)) (justify right) hide)
    )
  )
  (global_label "CE-1" (shape input) (at 50.8 67.31 270) (fields_autoplaced)
    (effects (font (size 1.27 1.27)) (justify right))
    (uuid 1297ca60-b616-4422-81f5-6ec9e256092b)
    (property "Intersheet References" "${INTERSHEET_REFS}" (id 0) (at 50.7206 74.9241 90)
      (effects (font (size 1.27 1.27)) (justify right) hide)
    )
  )
  (global_label "PG-2" (shape input) (at 90.17 123.19 0) (fields_autoplaced)
    (effects (font (size 1.27 1.27)) (justify left))
    (uuid 17777a74-a0af-4687-9e6a-c1c1340fa925)
    (property "Intersheet References" "${INTERSHEET_REFS}" (id 0) (at 97.905 123.1106 0)
      (effects (font (size 1.27 1.27)) (justify left) hide)
    )
  )
  (global_label "CE-3" (shape input) (at 220.98 39.37 180) (fields_autoplaced)
    (effects (font (size 1.27 1.27)) (justify right))
    (uuid 20101cb2-a413-4612-970a-f05a91cf770c)
    (property "Intersheet References" "${INTERSHEET_REFS}" (id 0) (at 213.3659 39.2906 0)
      (effects (font (size 1.27 1.27)) (justify right) hide)
    )
  )
  (global_label "MPPT_OUT" (shape input) (at 69.85 92.71 180) (fields_autoplaced)
    (effects (font (size 1.27 1.27)) (justify right))
    (uuid 25cfd0de-5008-42fd-9d23-b15c87178eb6)
    (property "Intersheet References" "${INTERSHEET_REFS}" (id 0) (at 57.8817 92.7894 0)
      (effects (font (size 1.27 1.27)) (justify right) hide)
    )
  )
  (global_label "BAT_I+" (shape input) (at 190.5 110.49 0) (fields_autoplaced)
    (effects (font (size 1.27 1.27)) (justify left))
    (uuid 35233615-53cb-4f97-a106-7161df91a320)
    (property "Intersheet References" "${INTERSHEET_REFS}" (id 0) (at 199.3841 110.4106 0)
      (effects (font (size 1.27 1.27)) (justify left) hide)
    )
  )
  (global_label "PG-1" (shape input) (at 91.44 46.99 0) (fields_autoplaced)
    (effects (font (size 1.27 1.27)) (justify left))
    (uuid 3562e59b-4729-44cd-a2b2-8baa6e87f310)
    (property "Intersheet References" "${INTERSHEET_REFS}" (id 0) (at 99.175 46.9106 0)
      (effects (font (size 1.27 1.27)) (justify left) hide)
    )
  )
  (global_label "STAT2-1" (shape input) (at 91.44 54.61 0) (fields_autoplaced)
    (effects (font (size 1.27 1.27)) (justify left))
    (uuid 35b860e1-9315-45c2-a064-20bad1b23f9e)
    (property "Intersheet References" "${INTERSHEET_REFS}" (id 0) (at 102.0779 54.5306 0)
      (effects (font (size 1.27 1.27)) (justify left) hide)
    )
  )
  (global_label "BAT-FB" (shape input) (at 261.62 38.1 90) (fields_autoplaced)
    (effects (font (size 1.27 1.27)) (justify left))
    (uuid 5302651c-86aa-4095-916a-462f5a776eb9)
    (property "Intersheet References" "${INTERSHEET_REFS}" (id 0) (at 261.6994 28.4298 90)
      (effects (font (size 1.27 1.27)) (justify left) hide)
    )
  )
  (global_label "STAT2-3" (shape input) (at 233.68 80.01 270) (fields_autoplaced)
    (effects (font (size 1.27 1.27)) (justify right))
    (uuid 6e10dd81-3d52-4a2b-b267-4d331d78b144)
    (property "Intersheet References" "${INTERSHEET_REFS}" (id 0) (at 233.6006 90.6479 90)
      (effects (font (size 1.27 1.27)) (justify right) hide)
    )
  )
  (global_label "BAT_I+" (shape input) (at 257.81 162.56 0) (fields_autoplaced)
    (effects (font (size 1.27 1.27)) (justify left))
    (uuid 78c54dd9-6698-4839-a37b-9d2af9faa66b)
    (property "Intersheet References" "${INTERSHEET_REFS}" (id 0) (at 266.6941 162.4806 0)
      (effects (font (size 1.27 1.27)) (justify left) hide)
    )
  )
  (global_label "MPPT_OUT" (shape input) (at 71.12 16.51 180) (fields_autoplaced)
    (effects (font (size 1.27 1.27)) (justify right))
    (uuid 928360db-4caf-4482-90ca-3fb3c5fcf879)
    (property "Intersheet References" "${INTERSHEET_REFS}" (id 0) (at 59.1517 16.5894 0)
      (effects (font (size 1.27 1.27)) (justify right) hide)
    )
  )
  (global_label "BAT-FB" (shape input) (at 48.26 102.87 180) (fields_autoplaced)
    (effects (font (size 1.27 1.27)) (justify right))
    (uuid ac81dc34-b7d5-4567-ac10-c2d66cd777b4)
    (property "Intersheet References" "${INTERSHEET_REFS}" (id 0) (at 38.5898 102.7906 0)
      (effects (font (size 1.27 1.27)) (justify right) hide)
    )
  )
  (global_label "STAT1-1" (shape input) (at 91.44 52.07 0) (fields_autoplaced)
    (effects (font (size 1.27 1.27)) (justify left))
    (uuid b6d8a001-f61b-4a77-a48e-938f1241ed27)
    (property "Intersheet References" "${INTERSHEET_REFS}" (id 0) (at 102.0779 51.9906 0)
      (effects (font (size 1.27 1.27)) (justify left) hide)
    )
  )
  (global_label "STAT1-3" (shape input) (at 236.22 80.01 270) (fields_autoplaced)
    (effects (font (size 1.27 1.27)) (justify right))
    (uuid ba9393ad-79a2-4685-aecd-f5eecb3974f7)
    (property "Intersheet References" "${INTERSHEET_REFS}" (id 0) (at 236.1406 90.6479 90)
      (effects (font (size 1.27 1.27)) (justify right) hide)
    )
  )
  (global_label "STAT1-2" (shape input) (at 90.17 128.27 0) (fields_autoplaced)
    (effects (font (size 1.27 1.27)) (justify left))
    (uuid bb9aa10b-df93-4f12-a39e-ed3a894a9d7b)
    (property "Intersheet References" "${INTERSHEET_REFS}" (id 0) (at 100.8079 128.1906 0)
      (effects (font (size 1.27 1.27)) (justify left) hide)
    )
  )
  (global_label "MPPT_OUT" (shape input) (at 271.78 59.69 270) (fields_autoplaced)
    (effects (font (size 1.27 1.27)) (justify right))
    (uuid bdc971ba-2851-456c-be40-f7771cd731b7)
    (property "Intersheet References" "${INTERSHEET_REFS}" (id 0) (at 271.8594 71.6583 90)
      (effects (font (size 1.27 1.27)) (justify right) hide)
    )
  )
  (global_label "CE-2" (shape input) (at 49.53 143.51 270) (fields_autoplaced)
    (effects (font (size 1.27 1.27)) (justify right))
    (uuid c542181b-8440-4142-8bd1-c527153eb79d)
    (property "Intersheet References" "${INTERSHEET_REFS}" (id 0) (at 49.4506 151.1241 90)
      (effects (font (size 1.27 1.27)) (justify right) hide)
    )
  )
  (global_label "BAT-FB" (shape input) (at 49.53 26.67 180) (fields_autoplaced)
    (effects (font (size 1.27 1.27)) (justify right))
    (uuid dbeb7e35-39b8-4592-92a5-39baa9fe3bf2)
    (property "Intersheet References" "${INTERSHEET_REFS}" (id 0) (at 39.8598 26.5906 0)
      (effects (font (size 1.27 1.27)) (justify right) hide)
    )
  )
  (global_label "STAT2-2" (shape input) (at 90.17 130.81 0) (fields_autoplaced)
    (effects (font (size 1.27 1.27)) (justify left))
    (uuid dc63286c-35fa-48e0-9f04-bd9f04f54247)
    (property "Intersheet References" "${INTERSHEET_REFS}" (id 0) (at 100.8079 130.7306 0)
      (effects (font (size 1.27 1.27)) (justify left) hide)
    )
  )
  (global_label "BAT_I+" (shape input) (at 191.77 34.29 0) (fields_autoplaced)
    (effects (font (size 1.27 1.27)) (justify left))
    (uuid fb94767a-38d2-4820-a668-cd1d43999152)
    (property "Intersheet References" "${INTERSHEET_REFS}" (id 0) (at 200.6541 34.2106 0)
      (effects (font (size 1.27 1.27)) (justify left) hide)
    )
  )

  (symbol (lib_id "CubeSat1 Library:MOLEX2") (at 123.19 111.76 0) (unit 1)
    (in_bom yes) (on_board yes) (fields_autoplaced)
    (uuid 0349b66e-5e6c-4a2a-a98f-ee440603de5d)
    (property "Reference" "M2-7" (id 0) (at 138.43 116.8399 0)
      (effects (font (size 1.27 1.27)) (justify left))
    )
    (property "Value" "MOLEX2" (id 1) (at 138.43 119.3799 0)
      (effects (font (size 1.27 1.27)) (justify left))
    )
    (property "Footprint" "Molex_CLIK-Mate_502382-0270_1x02-1MP_P1.25mm_Vertical" (id 2) (at 123.19 111.76 0)
      (effects (font (size 1.27 1.27)) hide)
    )
    (property "Datasheet" "" (id 3) (at 123.19 111.76 0)
      (effects (font (size 1.27 1.27)) hide)
    )
    (pin "1" (uuid 80380bb6-8ea1-414b-98bc-2805efd52ec2))
    (pin "2" (uuid ae096341-3952-4880-af8b-6adfd613c509))
  )

  (symbol (lib_id "Device:R") (at 40.64 68.58 0) (unit 1)
    (in_bom yes) (on_board yes) (fields_autoplaced)
    (uuid 044b8665-c36b-478b-a7bb-15465b093fb3)
    (property "Reference" "R61" (id 0) (at 43.18 67.3099 0)
      (effects (font (size 1.27 1.27)) (justify left))
    )
    (property "Value" "10K" (id 1) (at 43.18 69.8499 0)
      (effects (font (size 1.27 1.27)) (justify left))
    )
    (property "Footprint" "Resistor_SMD:R_0603_1608Metric" (id 2) (at 38.862 68.58 90)
      (effects (font (size 1.27 1.27)) hide)
    )
    (property "Datasheet" "~" (id 3) (at 40.64 68.58 0)
      (effects (font (size 1.27 1.27)) hide)
    )
    (pin "1" (uuid 0a6bbe94-0202-4dbe-97de-5cae453aa2e3))
    (pin "2" (uuid a49d2be5-02ed-42ff-ab24-92acd12c9bc1))
  )

  (symbol (lib_id "Device:C") (at 146.05 148.59 0) (unit 1)
    (in_bom yes) (on_board yes) (fields_autoplaced)
    (uuid 04b82d34-00e7-4044-9223-a29cdaa76c9a)
    (property "Reference" "C58" (id 0) (at 149.86 147.3199 0)
      (effects (font (size 1.27 1.27)) (justify left))
    )
    (property "Value" "10u" (id 1) (at 149.86 149.8599 0)
      (effects (font (size 1.27 1.27)) (justify left))
    )
    (property "Footprint" "Capacitor_SMD:C_0603_1608Metric" (id 2) (at 147.0152 152.4 0)
      (effects (font (size 1.27 1.27)) hide)
    )
    (property "Datasheet" "~" (id 3) (at 146.05 148.59 0)
      (effects (font (size 1.27 1.27)) hide)
    )
    (pin "1" (uuid 358cfbb4-11f7-49ab-b541-2a067bc12e65))
    (pin "2" (uuid d34e00b8-da74-4b1d-b225-3a462c9f1779))
  )

  (symbol (lib_id "Device:R") (at 219.71 29.21 270) (unit 1)
    (in_bom yes) (on_board yes)
    (uuid 13bb9f9b-b19a-474d-9baf-fb5befa2cdf8)
    (property "Reference" "R70" (id 0) (at 215.9 31.75 90))
    (property "Value" "10K" (id 1) (at 220.98 31.75 90))
    (property "Footprint" "Resistor_SMD:R_0603_1608Metric" (id 2) (at 219.71 27.432 90)
      (effects (font (size 1.27 1.27)) hide)
    )
    (property "Datasheet" "~" (id 3) (at 219.71 29.21 0)
      (effects (font (size 1.27 1.27)) hide)
    )
    (pin "1" (uuid e0dfc551-c1e9-4dc6-b41e-d2269b76ed96))
    (pin "2" (uuid 3abe3e93-9ef3-4dad-9df3-67f464a89efe))
  )

  (symbol (lib_name "LM74610SOP-8_2") (lib_id "CubeSat1 Library:LM74610SOP-8") (at 162.56 120.65 0) (unit 1)
    (in_bom yes) (on_board yes) (fields_autoplaced)
    (uuid 18178162-9d6a-4e30-a823-33196038379e)
    (property "Reference" "U$18" (id 0) (at 177.8 130.2893 0))
    (property "Value" "LM74610SOP-8" (id 1) (at 177.8 132.8293 0))
    (property "Footprint" "SOIC-8-1EP_3.9x4.9mm_P1.27mm_EP2.41x3.3mm" (id 2) (at 162.56 120.65 0)
      (effects (font (size 1.27 1.27)) hide)
    )
    (property "Datasheet" "" (id 3) (at 162.56 120.65 0)
      (effects (font (size 1.27 1.27)) hide)
    )
    (pin "1" (uuid 1ed3e22a-2e27-4c3e-8f9c-afe0da9766bf))
    (pin "2" (uuid 7457f649-8602-4303-92fa-aefe43a0a529))
    (pin "4" (uuid c05093b7-f3a3-421c-a39a-580416d794c7))
    (pin "6" (uuid c7ad6045-15c7-447f-8bb3-005c62f7bc55))
    (pin "7" (uuid db8fbf2b-2a9a-4f0c-9244-4d5ef39064c3))
    (pin "8" (uuid 2b3223b6-fc56-4aa5-8563-5b1c56255ec5))
  )

  (symbol (lib_id "Device:R") (at 229.87 35.56 270) (unit 1)
    (in_bom yes) (on_board yes)
    (uuid 200acf2c-7978-47e5-9c2f-f7088dd4d91b)
    (property "Reference" "R98" (id 0) (at 231.14 33.02 90)
      (effects (font (size 1.27 1.27)) (justify left))
    )
    (property "Value" "10K" (id 1) (at 226.06 33.02 90)
      (effects (font (size 1.27 1.27)) (justify left))
    )
    (property "Footprint" "Resistor_SMD:R_0201_0603Metric" (id 2) (at 229.87 33.782 90)
      (effects (font (size 1.27 1.27)) hide)
    )
    (property "Datasheet" "~" (id 3) (at 229.87 35.56 0)
      (effects (font (size 1.27 1.27)) hide)
    )
    (pin "1" (uuid 35edc652-c829-4fd2-96a9-406faccc172e))
    (pin "2" (uuid c31e863a-cb86-454f-bea8-535e34ef3a01))
  )

  (symbol (lib_id "Device:R") (at 33.02 144.78 0) (unit 1)
    (in_bom yes) (on_board yes)
    (uuid 2446cef5-4cfb-4207-9acb-530ad2d564fa)
    (property "Reference" "R66" (id 0) (at 34.29 143.51 0)
      (effects (font (size 1.27 1.27)) (justify left))
    )
    (property "Value" "100k" (id 1) (at 34.29 146.05 0)
      (effects (font (size 1.27 1.27)) (justify left))
    )
    (property "Footprint" "Resistor_SMD:R_0603_1608Metric" (id 2) (at 31.242 144.78 90)
      (effects (font (size 1.27 1.27)) hide)
    )
    (property "Datasheet" "~" (id 3) (at 33.02 144.78 0)
      (effects (font (size 1.27 1.27)) hide)
    )
    (pin "1" (uuid 5a5f3ce6-7c8b-4803-ba3e-023b70d8f647))
    (pin "2" (uuid 6cd7c8ee-e9fa-4b6e-a8be-ceb9d20a2d1f))
  )

  (symbol (lib_id "power:GND") (at 27.94 86.36 0) (unit 1)
    (in_bom yes) (on_board yes) (fields_autoplaced)
    (uuid 259d2a8f-bea4-4177-a4bc-b7bb50d08952)
    (property "Reference" "#PWR?" (id 0) (at 27.94 92.71 0)
      (effects (font (size 1.27 1.27)) hide)
    )
    (property "Value" "GND" (id 1) (at 27.94 91.44 0))
    (property "Footprint" "" (id 2) (at 27.94 86.36 0)
      (effects (font (size 1.27 1.27)) hide)
    )
    (property "Datasheet" "" (id 3) (at 27.94 86.36 0)
      (effects (font (size 1.27 1.27)) hide)
    )
    (pin "1" (uuid d8c6ac82-f72e-4fa7-8d5c-5614867cd306))
  )

  (symbol (lib_id "Device:C") (at 147.32 72.39 0) (unit 1)
    (in_bom yes) (on_board yes) (fields_autoplaced)
    (uuid 27055241-fffe-4a01-a40c-f5a060746fba)
    (property "Reference" "C57" (id 0) (at 151.13 71.1199 0)
      (effects (font (size 1.27 1.27)) (justify left))
    )
    (property "Value" "10u" (id 1) (at 151.13 73.6599 0)
      (effects (font (size 1.27 1.27)) (justify left))
    )
    (property "Footprint" "Capacitor_SMD:C_0603_1608Metric" (id 2) (at 148.2852 76.2 0)
      (effects (font (size 1.27 1.27)) hide)
    )
    (property "Datasheet" "~" (id 3) (at 147.32 72.39 0)
      (effects (font (size 1.27 1.27)) hide)
    )
    (pin "1" (uuid 013f234a-bd53-4e73-881f-9864800be992))
    (pin "2" (uuid f986ff1e-9c34-44ce-aa7d-2f7dff6c003a))
  )

  (symbol (lib_id "Transistor_FET:2N7000") (at 158.75 113.03 270) (mirror x) (unit 1)
    (in_bom yes) (on_board yes) (fields_autoplaced)
    (uuid 27e158ff-cc33-4b99-a566-c8ab9e6e757e)
    (property "Reference" "Q14" (id 0) (at 158.75 102.87 90))
    (property "Value" "SQ418EY" (id 1) (at 158.75 105.41 90))
    (property "Footprint" "Package_TO_SOT_THT:TO-92_Inline" (id 2) (at 156.845 107.95 0)
      (effects (font (size 1.27 1.27) italic) (justify left) hide)
    )
    (property "Datasheet" "https://www.vishay.com/docs/70226/70226.pdf" (id 3) (at 158.75 113.03 0)
      (effects (font (size 1.27 1.27)) (justify left) hide)
    )
    (pin "1" (uuid 2d7a9c49-09c8-441e-ab44-a905f680edfd))
    (pin "2" (uuid 607af6c4-dfe8-400b-9581-45950be75b62))
    (pin "3" (uuid ce7989f7-7752-4eec-83a2-d6379bd11683))
  )

  (symbol (lib_id "Device:C") (at 220.98 96.52 270) (unit 1)
    (in_bom yes) (on_board yes) (fields_autoplaced)
    (uuid 2a4aac29-2ee8-40ab-a596-e34d1746bb1f)
    (property "Reference" "C64" (id 0) (at 220.98 88.9 90))
    (property "Value" "10U" (id 1) (at 220.98 91.44 90))
    (property "Footprint" "Capacitor_SMD:C_0201_0603Metric" (id 2) (at 217.17 97.4852 0)
      (effects (font (size 1.27 1.27)) hide)
    )
    (property "Datasheet" "~" (id 3) (at 220.98 96.52 0)
      (effects (font (size 1.27 1.27)) hide)
    )
    (pin "1" (uuid 1f6ef921-d596-47c3-84fa-d59189cf4370))
    (pin "2" (uuid 1cec8396-f4ea-4dd2-a8e7-260702cb0c09))
  )

  (symbol (lib_id "Device:C") (at 212.09 152.4 0) (unit 1)
    (in_bom yes) (on_board yes) (fields_autoplaced)
    (uuid 34fbcd6d-0496-4bb0-ac27-5cec066c1561)
    (property "Reference" "C77" (id 0) (at 215.9 151.1299 0)
      (effects (font (size 1.27 1.27)) (justify left))
    )
    (property "Value" "2,2u" (id 1) (at 215.9 153.6699 0)
      (effects (font (size 1.27 1.27)) (justify left))
    )
    (property "Footprint" "Capacitor_SMD:C_0603_1608Metric" (id 2) (at 213.0552 156.21 0)
      (effects (font (size 1.27 1.27)) hide)
    )
    (property "Datasheet" "~" (id 3) (at 212.09 152.4 0)
      (effects (font (size 1.27 1.27)) hide)
    )
    (pin "1" (uuid eb69f84a-a0ab-4839-998d-8c1e6ad80cd4))
    (pin "2" (uuid 1ee11d4e-ff37-4f3c-8689-23c47f9536e6))
  )

  (symbol (lib_id "Device:R") (at 39.37 144.78 0) (unit 1)
    (in_bom yes) (on_board yes) (fields_autoplaced)
    (uuid 37cbfbc7-47f3-4229-b5b7-b032e952666e)
    (property "Reference" "R67" (id 0) (at 41.91 143.5099 0)
      (effects (font (size 1.27 1.27)) (justify left))
    )
    (property "Value" "10K" (id 1) (at 41.91 146.0499 0)
      (effects (font (size 1.27 1.27)) (justify left))
    )
    (property "Footprint" "Resistor_SMD:R_0603_1608Metric" (id 2) (at 37.592 144.78 90)
      (effects (font (size 1.27 1.27)) hide)
    )
    (property "Datasheet" "~" (id 3) (at 39.37 144.78 0)
      (effects (font (size 1.27 1.27)) hide)
    )
    (pin "1" (uuid 69713094-833b-4e3e-a127-e6265e5a8331))
    (pin "2" (uuid 78d576b3-06a1-4d33-96c3-df6238448934))
  )

  (symbol (lib_id "Device:R") (at 26.67 144.78 0) (unit 1)
    (in_bom yes) (on_board yes)
    (uuid 3bdaa391-0c47-418d-8019-b0cc211fe045)
    (property "Reference" "R65" (id 0) (at 27.94 143.51 0)
      (effects (font (size 1.27 1.27)) (justify left))
    )
    (property "Value" "1k" (id 1) (at 27.94 146.05 0)
      (effects (font (size 1.27 1.27)) (justify left))
    )
    (property "Footprint" "Resistor_SMD:R_0603_1608Metric" (id 2) (at 24.892 144.78 90)
      (effects (font (size 1.27 1.27)) hide)
    )
    (property "Datasheet" "~" (id 3) (at 26.67 144.78 0)
      (effects (font (size 1.27 1.27)) hide)
    )
    (pin "1" (uuid f84fd553-8fbf-48a0-a082-d2978a8e07f1))
    (pin "2" (uuid 48c0dee9-0296-498b-a1d7-ac9741a64eb9))
  )

  (symbol (lib_id "CubeSat1 Library:MOLEX2") (at 124.46 35.56 0) (unit 1)
    (in_bom yes) (on_board yes) (fields_autoplaced)
    (uuid 3f967d12-f300-44ca-a9a9-d7ac3d332194)
    (property "Reference" "M2-8" (id 0) (at 139.7 40.6399 0)
      (effects (font (size 1.27 1.27)) (justify left))
    )
    (property "Value" "MOLEX2" (id 1) (at 139.7 43.1799 0)
      (effects (font (size 1.27 1.27)) (justify left))
    )
    (property "Footprint" "Molex_CLIK-Mate_502382-0270_1x02-1MP_P1.25mm_Vertical" (id 2) (at 124.46 35.56 0)
      (effects (font (size 1.27 1.27)) hide)
    )
    (property "Datasheet" "" (id 3) (at 124.46 35.56 0)
      (effects (font (size 1.27 1.27)) hide)
    )
    (pin "1" (uuid 0a73a8ac-6bfc-47d6-bf17-619fcf9c56bd))
    (pin "2" (uuid 4673a860-2a0c-4a45-a080-e594fa0df059))
  )

  (symbol (lib_id "power:GND") (at 201.93 16.51 270) (unit 1)
    (in_bom yes) (on_board yes) (fields_autoplaced)
    (uuid 4493b9ab-7980-4d5b-a253-e38f9695a5c1)
    (property "Reference" "#PWR?" (id 0) (at 195.58 16.51 0)
      (effects (font (size 1.27 1.27)) hide)
    )
    (property "Value" "GND" (id 1) (at 196.85 16.51 0))
    (property "Footprint" "" (id 2) (at 201.93 16.51 0)
      (effects (font (size 1.27 1.27)) hide)
    )
    (property "Datasheet" "" (id 3) (at 201.93 16.51 0)
      (effects (font (size 1.27 1.27)) hide)
    )
    (pin "1" (uuid 64eafa5f-cce6-450b-bf00-725ef834243c))
  )

  (symbol (lib_id "Battery_Management:MCP73871") (at 69.85 118.11 0) (unit 1)
    (in_bom yes) (on_board yes) (fields_autoplaced)
    (uuid 44b9e86a-3f5d-498a-a6e7-1ddd058c5c27)
    (property "Reference" "MCP5" (id 0) (at 71.8694 92.71 0)
      (effects (font (size 1.27 1.27)) (justify left))
    )
    (property "Value" "MCP73871" (id 1) (at 71.8694 95.25 0)
      (effects (font (size 1.27 1.27)) (justify left))
    )
    (property "Footprint" "Package_DFN_QFN:QFN-20-1EP_4x4mm_P0.5mm_EP2.5x2.5mm" (id 2) (at 74.93 140.97 0)
      (effects (font (size 1.27 1.27) italic) (justify left) hide)
    )
    (property "Datasheet" "http://www.mouser.com/ds/2/268/22090a-52174.pdf" (id 3) (at 66.04 104.14 0)
      (effects (font (size 1.27 1.27)) hide)
    )
    (pin "1" (uuid d7bd2150-bdf5-438a-85a3-e47efc1c02cf))
    (pin "10" (uuid 5ad8eae6-27ec-471a-b38a-6132bf126fb3))
    (pin "11" (uuid b92a0cc5-2fc0-4be1-8ec6-56ba460a29db))
    (pin "12" (uuid 77c96de8-1763-4db5-89cc-a34f05abbdea))
    (pin "13" (uuid cacdbfb5-4c1b-4520-bcdf-fa329f9dfc34))
    (pin "14" (uuid 0625255d-a7f9-4fbc-9c24-2c8179a03c4d))
    (pin "15" (uuid 0e655d91-b356-4569-88e3-f354e3dc7910))
    (pin "16" (uuid a442ab11-a61f-434d-b85a-9725cb839d46))
    (pin "17" (uuid 285c4fe1-a343-4f38-bc21-0b5e45781ebb))
    (pin "18" (uuid 6fdfb182-f3dc-431e-8913-800dd5b2aab2))
    (pin "19" (uuid c5415771-11e3-47a8-ae34-b3698f814975))
    (pin "2" (uuid 1eefcad5-728b-426b-9784-3c612c64ce57))
    (pin "20" (uuid 507b945c-ca39-4848-a5be-83a0ec64b1c9))
    (pin "21" (uuid adb6b7eb-fcc9-4029-b620-60a370e4cf89))
    (pin "3" (uuid 7bbc10b5-b634-4367-8e31-2a617a4cf3c9))
    (pin "4" (uuid a59d5ec2-33f7-47e4-a013-d26d889aa1b9))
    (pin "5" (uuid 0e14c615-3a5a-4c60-b103-08d8bafda195))
    (pin "6" (uuid 9822aca1-220d-414a-abb5-34d07633cda7))
    (pin "7" (uuid 10304fec-18ac-4269-8509-c7605f1373fa))
    (pin "8" (uuid 40ee7236-bd1c-46f0-a7f7-1fbb3be1f4b4))
    (pin "9" (uuid d69946d7-dd5e-4d74-874f-6136dc2f4704))
  )

  (symbol (lib_id "Battery_Management:MCP73871") (at 71.12 41.91 0) (unit 1)
    (in_bom yes) (on_board yes) (fields_autoplaced)
    (uuid 4629bcc2-b158-46fc-ad9f-89544365d06a)
    (property "Reference" "MCP4" (id 0) (at 73.1394 16.51 0)
      (effects (font (size 1.27 1.27)) (justify left))
    )
    (property "Value" "MCP73871" (id 1) (at 73.1394 19.05 0)
      (effects (font (size 1.27 1.27)) (justify left))
    )
    (property "Footprint" "Package_DFN_QFN:QFN-20-1EP_4x4mm_P0.5mm_EP2.5x2.5mm" (id 2) (at 76.2 64.77 0)
      (effects (font (size 1.27 1.27) italic) (justify left) hide)
    )
    (property "Datasheet" "http://www.mouser.com/ds/2/268/22090a-52174.pdf" (id 3) (at 67.31 27.94 0)
      (effects (font (size 1.27 1.27)) hide)
    )
    (pin "1" (uuid cbac52b8-35b7-42f0-8f8b-1a7890a0d7d4))
    (pin "10" (uuid b605063c-f09f-4420-a959-cc381ef7964a))
    (pin "11" (uuid 0a23ddad-d59d-43b5-a55c-78d3183a42f8))
    (pin "12" (uuid d9546de1-0da8-4646-a66c-e8887e5d53bd))
    (pin "13" (uuid 296de1d8-7754-43a0-8fe4-a02c561489c0))
    (pin "14" (uuid d4eb9b34-d577-4517-a344-f050803e35b2))
    (pin "15" (uuid 7c3c8d30-bc2f-4562-8f33-ec7ecab563a1))
    (pin "16" (uuid d30d0acb-1183-4838-8264-99f2ac4e3f75))
    (pin "17" (uuid 219c9bc7-f967-4a52-91f2-5d50f770ac04))
    (pin "18" (uuid 2015b672-4b85-403e-a2c0-fe13f7ca03c8))
    (pin "19" (uuid 96973e38-8939-45d1-874a-b331b9e75cac))
    (pin "2" (uuid ae64e7ec-00b4-4b2e-b6f8-c0ae52f66a37))
    (pin "20" (uuid 3300dcb4-da12-4626-98e0-04f14fe7a2b1))
    (pin "21" (uuid 4afff425-edb8-4b3a-83cb-9349096b5462))
    (pin "3" (uuid 1836576d-a124-4dfb-9c7f-56c890664fb1))
    (pin "4" (uuid cca042ee-a1a6-4bfb-84e9-70e62b083fa8))
    (pin "5" (uuid b0a09093-fde7-4417-8d01-e28afc6a883a))
    (pin "6" (uuid d9d7aad0-c739-4de4-855c-25c1cdf0bd4c))
    (pin "7" (uuid b6e3c2ba-24a8-4fd9-b154-ff29422a39ec))
    (pin "8" (uuid 68806ee5-4d80-4e68-9eeb-5c4c95526b77))
    (pin "9" (uuid 58177b1a-2f53-400b-85e4-ebcdcef860e7))
  )

  (symbol (lib_id "Battery_Management:MCP73871") (at 246.38 59.69 270) (unit 1)
    (in_bom yes) (on_board yes) (fields_autoplaced)
    (uuid 47549fd6-c628-4f30-abbd-1d39454442de)
    (property "Reference" "MCP6" (id 0) (at 273.05 53.1112 90))
    (property "Value" "MCP73871" (id 1) (at 273.05 55.6512 90))
    (property "Footprint" "Package_DFN_QFN:QFN-20-1EP_4x4mm_P0.5mm_EP2.5x2.5mm" (id 2) (at 223.52 64.77 0)
      (effects (font (size 1.27 1.27) italic) (justify left) hide)
    )
    (property "Datasheet" "http://www.mouser.com/ds/2/268/22090a-52174.pdf" (id 3) (at 260.35 55.88 0)
      (effects (font (size 1.27 1.27)) hide)
    )
    (pin "1" (uuid afa4847b-1da0-4657-ae81-d0eb3d05b2a0))
    (pin "10" (uuid 64eab726-a794-4bae-b06d-4c5949515d65))
    (pin "11" (uuid 8ea04dfe-b0c7-4b7e-ba01-4a48bb9c93e6))
    (pin "12" (uuid 88b23cf9-0464-4c3d-a564-5c49eee21fbf))
    (pin "13" (uuid bf5ef587-ee5a-4775-8a49-188a76d564b9))
    (pin "14" (uuid 1e4265b4-5b28-4e52-9cb4-bd41366f459e))
    (pin "15" (uuid 4fd0d3a6-60a1-45ef-90f4-1f70a2f7cef2))
    (pin "16" (uuid 2e39e57f-ce5a-40d5-a961-d975cf2ee30f))
    (pin "17" (uuid 0845cdb2-cbb2-4a5c-b855-ad0f3d88e8d8))
    (pin "18" (uuid 23190f3e-50b8-4da5-9098-e4cc7b9d6699))
    (pin "19" (uuid d5e816f0-c002-4764-8be2-a582ee610028))
    (pin "2" (uuid 6b3475fa-2389-48e4-a2f5-e246a77460a1))
    (pin "20" (uuid 36d05afb-6154-47be-b8d9-0c91d068b3a1))
    (pin "21" (uuid 7d6453a6-c4c6-43ff-b7db-24f0d930d19c))
    (pin "3" (uuid cbbf22be-a1e1-4156-a046-d10dcf80ffbb))
    (pin "4" (uuid 10a22a5a-6399-4ec5-835b-340066f96fc6))
    (pin "5" (uuid 474ecdc0-50b7-445b-b71c-b9f6fdbec02b))
    (pin "6" (uuid ed95b026-dbf4-4553-bd0f-02bad3998417))
    (pin "7" (uuid 536d787d-5d63-46bd-ae08-1c48622f46e1))
    (pin "8" (uuid 5cd99931-33a9-4362-9c45-63cee82cdc55))
    (pin "9" (uuid 0f0e13a4-e55d-4c52-a1b9-2080066ffdce))
  )

  (symbol (lib_id "Device:C") (at 163.83 76.2 90) (unit 1)
    (in_bom yes) (on_board yes) (fields_autoplaced)
    (uuid 478c9ec0-c28c-4187-9aa8-afb3d3d189de)
    (property "Reference" "C76" (id 0) (at 163.83 68.58 90))
    (property "Value" "2,2u" (id 1) (at 163.83 71.12 90))
    (property "Footprint" "Capacitor_SMD:C_0603_1608Metric" (id 2) (at 167.64 75.2348 0)
      (effects (font (size 1.27 1.27)) hide)
    )
    (property "Datasheet" "~" (id 3) (at 163.83 76.2 0)
      (effects (font (size 1.27 1.27)) hide)
    )
    (pin "1" (uuid af44119d-7207-4af6-9993-155da0733915))
    (pin "2" (uuid 5fa0da65-29c9-4c2c-8f92-60b18fa3b455))
  )

  (symbol (lib_id "power:GND") (at 26.67 162.56 0) (unit 1)
    (in_bom yes) (on_board yes) (fields_autoplaced)
    (uuid 4b5e0ca1-e2ca-4d50-81e7-d2c09fcbf569)
    (property "Reference" "#PWR?" (id 0) (at 26.67 168.91 0)
      (effects (font (size 1.27 1.27)) hide)
    )
    (property "Value" "GND" (id 1) (at 26.67 167.64 0))
    (property "Footprint" "" (id 2) (at 26.67 162.56 0)
      (effects (font (size 1.27 1.27)) hide)
    )
    (property "Datasheet" "" (id 3) (at 26.67 162.56 0)
      (effects (font (size 1.27 1.27)) hide)
    )
    (pin "1" (uuid 38c37cf7-7ec0-4a5a-bc29-c28124da4573))
  )

  (symbol (lib_id "power:+3V3") (at 248.92 34.29 0) (unit 1)
    (in_bom yes) (on_board yes) (fields_autoplaced)
    (uuid 50c167ab-a6da-41a6-8095-05285db6dc76)
    (property "Reference" "#PWR?" (id 0) (at 248.92 38.1 0)
      (effects (font (size 1.27 1.27)) hide)
    )
    (property "Value" "+3V3" (id 1) (at 248.9201 30.48 90)
      (effects (font (size 1.27 1.27)) (justify left))
    )
    (property "Footprint" "" (id 2) (at 248.92 34.29 0)
      (effects (font (size 1.27 1.27)) hide)
    )
    (property "Datasheet" "" (id 3) (at 248.92 34.29 0)
      (effects (font (size 1.27 1.27)) hide)
    )
    (pin "1" (uuid af85ef3e-3f24-43ac-9853-7c5138de6508))
  )

  (symbol (lib_id "Device:R") (at 34.29 68.58 0) (unit 1)
    (in_bom yes) (on_board yes)
    (uuid 591d40a9-7e44-45fc-b757-6c0d7cce287f)
    (property "Reference" "R60" (id 0) (at 35.56 67.31 0)
      (effects (font (size 1.27 1.27)) (justify left))
    )
    (property "Value" "100k" (id 1) (at 35.56 69.85 0)
      (effects (font (size 1.27 1.27)) (justify left))
    )
    (property "Footprint" "Resistor_SMD:R_0603_1608Metric" (id 2) (at 32.512 68.58 90)
      (effects (font (size 1.27 1.27)) hide)
    )
    (property "Datasheet" "~" (id 3) (at 34.29 68.58 0)
      (effects (font (size 1.27 1.27)) hide)
    )
    (pin "1" (uuid 88a8abc2-815c-44b2-b7cd-87f5ce546ffd))
    (pin "2" (uuid 8cf5ae1b-d057-44da-95c2-8b81739d70c4))
  )

  (symbol (lib_id "CubeSat1 Library:LM74610SOP-8") (at 243.84 152.4 270) (unit 1)
    (in_bom yes) (on_board yes) (fields_autoplaced)
    (uuid 692273ac-f890-42ad-a6f1-57cf11faa6f3)
    (property "Reference" "U$19" (id 0) (at 231.5211 140.97 90)
      (effects (font (size 1.27 1.27)) (justify left))
    )
    (property "Value" "LM74610SOP-8" (id 1) (at 231.5211 143.51 90)
      (effects (font (size 1.27 1.27)) (justify left))
    )
    (property "Footprint" "SOIC-8-1EP_3.9x4.9mm_P1.27mm_EP2.41x3.3mm" (id 2) (at 243.84 152.4 0)
      (effects (font (size 1.27 1.27)) hide)
    )
    (property "Datasheet" "" (id 3) (at 243.84 152.4 0)
      (effects (font (size 1.27 1.27)) hide)
    )
    (pin "1" (uuid 6d9bf48b-0b53-46c7-b58e-e4d3ca56c48e))
    (pin "2" (uuid 73098d8c-5f52-4ec5-81b7-02c8d2ec3a66))
    (pin "4" (uuid c1214fd1-3fa3-49ce-bdb9-a3204e31e3c3))
    (pin "6" (uuid 4f303b61-3cbc-4d27-92d3-a13a8d73034d))
    (pin "7" (uuid 726d7d79-49d2-44c8-9a38-202029290172))
    (pin "8" (uuid dd56e00d-e531-439a-acab-bd06f9a41b09))
  )

  (symbol (lib_id "Device:R") (at 219.71 22.86 270) (unit 1)
    (in_bom yes) (on_board yes)
    (uuid 72892a32-a2db-4702-8803-d21cc726cc12)
    (property "Reference" "R69" (id 0) (at 220.98 25.4 90)
      (effects (font (size 1.27 1.27)) (justify left))
    )
    (property "Value" "100k" (id 1) (at 215.9 25.4 90)
      (effects (font (size 1.27 1.27)) (justify left))
    )
    (property "Footprint" "Resistor_SMD:R_0603_1608Metric" (id 2) (at 219.71 21.082 90)
      (effects (font (size 1.27 1.27)) hide)
    )
    (property "Datasheet" "~" (id 3) (at 219.71 22.86 0)
      (effects (font (size 1.27 1.27)) hide)
    )
    (pin "1" (uuid 561e7035-2f5f-4b1d-be09-1aee5a3f481a))
    (pin "2" (uuid a932757b-59fa-44a1-9297-63794c136cf6))
  )

  (symbol (lib_id "Device:C") (at 107.95 67.31 0) (unit 1)
    (in_bom yes) (on_board yes) (fields_autoplaced)
    (uuid 764bddcc-aa05-4358-8890-54729da0855b)
    (property "Reference" "C62" (id 0) (at 111.76 66.0399 0)
      (effects (font (size 1.27 1.27)) (justify left))
    )
    (property "Value" "10U" (id 1) (at 111.76 68.5799 0)
      (effects (font (size 1.27 1.27)) (justify left))
    )
    (property "Footprint" "Capacitor_SMD:C_0201_0603Metric" (id 2) (at 108.9152 71.12 0)
      (effects (font (size 1.27 1.27)) hide)
    )
    (property "Datasheet" "~" (id 3) (at 107.95 67.31 0)
      (effects (font (size 1.27 1.27)) hide)
    )
    (pin "1" (uuid 4e368570-7210-4060-8a47-22654ef6b9e4))
    (pin "2" (uuid c409ba7c-2aa7-4bf4-a888-7fb856773996))
  )

  (symbol (lib_id "Device:C") (at 106.68 143.51 0) (unit 1)
    (in_bom yes) (on_board yes) (fields_autoplaced)
    (uuid 78bf2225-b27f-44ce-84fb-0087691aa0b0)
    (property "Reference" "C63" (id 0) (at 110.49 142.2399 0)
      (effects (font (size 1.27 1.27)) (justify left))
    )
    (property "Value" "10U" (id 1) (at 110.49 144.7799 0)
      (effects (font (size 1.27 1.27)) (justify left))
    )
    (property "Footprint" "Capacitor_SMD:C_0201_0603Metric" (id 2) (at 107.6452 147.32 0)
      (effects (font (size 1.27 1.27)) hide)
    )
    (property "Datasheet" "~" (id 3) (at 106.68 143.51 0)
      (effects (font (size 1.27 1.27)) hide)
    )
    (pin "1" (uuid 1a0c01e7-ce2b-4102-a1b6-d2cf6acdb676))
    (pin "2" (uuid 51f4af1e-6273-48eb-9d99-c5a88a669e65))
  )

  (symbol (lib_id "Device:C") (at 162.56 152.4 90) (unit 1)
    (in_bom yes) (on_board yes) (fields_autoplaced)
    (uuid 7d487fa6-47bf-4093-b130-05ddea606653)
    (property "Reference" "C51" (id 0) (at 162.56 144.78 90))
    (property "Value" "2,2u" (id 1) (at 162.56 147.32 90))
    (property "Footprint" "Capacitor_SMD:C_0603_1608Metric" (id 2) (at 166.37 151.4348 0)
      (effects (font (size 1.27 1.27)) hide)
    )
    (property "Datasheet" "~" (id 3) (at 162.56 152.4 0)
      (effects (font (size 1.27 1.27)) hide)
    )
    (pin "1" (uuid e59d1972-202c-4ab5-95c0-4f4606e70895))
    (pin "2" (uuid f0f0a4a6-7649-46ad-a974-90fa860543bf))
  )

  (symbol (lib_id "power:+3V3") (at 45.72 39.37 90) (unit 1)
    (in_bom yes) (on_board yes) (fields_autoplaced)
    (uuid 9e600cf1-2d97-4db5-bda2-bb0f0a09ede6)
    (property "Reference" "#PWR?" (id 0) (at 49.53 39.37 0)
      (effects (font (size 1.27 1.27)) hide)
    )
    (property "Value" "+3V3" (id 1) (at 41.91 39.3699 90)
      (effects (font (size 1.27 1.27)) (justify left))
    )
    (property "Footprint" "" (id 2) (at 45.72 39.37 0)
      (effects (font (size 1.27 1.27)) hide)
    )
    (property "Datasheet" "" (id 3) (at 45.72 39.37 0)
      (effects (font (size 1.27 1.27)) hide)
    )
    (pin "1" (uuid 29493cc3-d937-478c-b4a9-880099678ab6))
  )

  (symbol (lib_id "Transistor_FET:2N7000") (at 160.02 36.83 270) (mirror x) (unit 1)
    (in_bom yes) (on_board yes) (fields_autoplaced)
    (uuid b5f07eba-4836-49b5-adc6-0d1256bef98c)
    (property "Reference" "Q13" (id 0) (at 160.02 26.67 90))
    (property "Value" "SQ418EY" (id 1) (at 160.02 29.21 90))
    (property "Footprint" "Package_TO_SOT_THT:TO-92_Inline" (id 2) (at 158.115 31.75 0)
      (effects (font (size 1.27 1.27) italic) (justify left) hide)
    )
    (property "Datasheet" "https://www.vishay.com/docs/70226/70226.pdf" (id 3) (at 160.02 36.83 0)
      (effects (font (size 1.27 1.27)) (justify left) hide)
    )
    (pin "1" (uuid 36caaa0c-7b35-45d6-b0aa-1a5ad0b98fda))
    (pin "2" (uuid d34808a4-7d22-4adf-be29-783cf8e4e448))
    (pin "3" (uuid c44f35a5-4166-4d72-8646-3463aa6f7632))
  )

  (symbol (lib_id "Device:R") (at 45.72 134.62 0) (unit 1)
    (in_bom yes) (on_board yes)
    (uuid b944264c-f3e0-4e71-9f9f-2dba079ef7dc)
    (property "Reference" "R97" (id 0) (at 40.64 133.35 0)
      (effects (font (size 1.27 1.27)) (justify left))
    )
    (property "Value" "10K" (id 1) (at 40.64 135.89 0)
      (effects (font (size 1.27 1.27)) (justify left))
    )
    (property "Footprint" "Resistor_SMD:R_0201_0603Metric" (id 2) (at 43.942 134.62 90)
      (effects (font (size 1.27 1.27)) hide)
    )
    (property "Datasheet" "~" (id 3) (at 45.72 134.62 0)
      (effects (font (size 1.27 1.27)) hide)
    )
    (pin "1" (uuid 0918a716-3225-4495-af65-de2389ec28a8))
    (pin "2" (uuid 9da7701d-6365-474d-917c-1e6d9ee14429))
  )

  (symbol (lib_id "Device:R") (at 27.94 68.58 0) (unit 1)
    (in_bom yes) (on_board yes)
    (uuid bb9bd878-0d98-4cd7-af60-8c77669ebbf1)
    (property "Reference" "R59" (id 0) (at 29.21 67.31 0)
      (effects (font (size 1.27 1.27)) (justify left))
    )
    (property "Value" "1k" (id 1) (at 29.21 69.85 0)
      (effects (font (size 1.27 1.27)) (justify left))
    )
    (property "Footprint" "Resistor_SMD:R_0603_1608Metric" (id 2) (at 26.162 68.58 90)
      (effects (font (size 1.27 1.27)) hide)
    )
    (property "Datasheet" "~" (id 3) (at 27.94 68.58 0)
      (effects (font (size 1.27 1.27)) hide)
    )
    (pin "1" (uuid 74e0bf29-3aec-48eb-8cf2-e1eef92a4445))
    (pin "2" (uuid bc5ede7d-63d7-4b99-a4bb-403997d9412a))
  )

  (symbol (lib_id "power:+3V3") (at 44.45 115.57 90) (unit 1)
    (in_bom yes) (on_board yes) (fields_autoplaced)
    (uuid c0a68859-5e8c-411b-9fe8-2113f2b57a2d)
    (property "Reference" "#PWR?" (id 0) (at 48.26 115.57 0)
      (effects (font (size 1.27 1.27)) hide)
    )
    (property "Value" "+3V3" (id 1) (at 40.64 115.5699 90)
      (effects (font (size 1.27 1.27)) (justify left))
    )
    (property "Footprint" "" (id 2) (at 44.45 115.57 0)
      (effects (font (size 1.27 1.27)) hide)
    )
    (property "Datasheet" "" (id 3) (at 44.45 115.57 0)
      (effects (font (size 1.27 1.27)) hide)
    )
    (pin "1" (uuid fc85fabe-1850-467d-97b1-66cc12191ef8))
  )

  (symbol (lib_id "Device:R") (at 219.71 16.51 270) (unit 1)
    (in_bom yes) (on_board yes)
    (uuid c29d62c6-f6af-410c-8ff8-0fa4bf5774c7)
    (property "Reference" "R68" (id 0) (at 219.71 19.05 90)
      (effects (font (size 1.27 1.27)) (justify left))
    )
    (property "Value" "1k" (id 1) (at 217.17 19.05 90)
      (effects (font (size 1.27 1.27)) (justify left))
    )
    (property "Footprint" "Resistor_SMD:R_0603_1608Metric" (id 2) (at 219.71 14.732 90)
      (effects (font (size 1.27 1.27)) hide)
    )
    (property "Datasheet" "~" (id 3) (at 219.71 16.51 0)
      (effects (font (size 1.27 1.27)) hide)
    )
    (pin "1" (uuid 6b3b8be3-9576-4cbb-8c6e-f17f779aaaef))
    (pin "2" (uuid afed3c8b-4544-454b-86cb-9526c0dc5c16))
  )

  (symbol (lib_name "LM74610SOP-8_1") (lib_id "CubeSat1 Library:LM74610SOP-8") (at 163.83 44.45 0) (unit 1)
    (in_bom yes) (on_board yes) (fields_autoplaced)
    (uuid caad7f8d-9ef5-43a4-a8f4-7967a050e573)
    (property "Reference" "U$17" (id 0) (at 179.07 54.0893 0))
    (property "Value" "LM74610SOP-8" (id 1) (at 179.07 56.6293 0))
    (property "Footprint" "SOIC-8-1EP_3.9x4.9mm_P1.27mm_EP2.41x3.3mm" (id 2) (at 163.83 44.45 0)
      (effects (font (size 1.27 1.27)) hide)
    )
    (property "Datasheet" "" (id 3) (at 163.83 44.45 0)
      (effects (font (size 1.27 1.27)) hide)
    )
    (pin "1" (uuid 370a0289-0b12-46f2-9f85-ba1f703ff6a8))
    (pin "2" (uuid 5cadc90f-3a32-44dd-a597-53de93dd7e40))
    (pin "4" (uuid 80c6aea3-2302-4d6c-b511-a72acb73e95d))
    (pin "6" (uuid 32054882-2272-4a18-9434-93a3d86ef8aa))
    (pin "7" (uuid d6b6efa2-201f-48d1-b095-e99ec3f8d706))
    (pin "8" (uuid c7062164-2487-49f2-b22d-8f37e41119d6))
  )

  (symbol (lib_id "CubeSat1 Library:MOLEX2") (at 252.73 113.03 270) (unit 1)
    (in_bom yes) (on_board yes) (fields_autoplaced)
    (uuid cc553dd2-0c06-457e-8226-06412d345669)
    (property "Reference" "M2-6" (id 0) (at 250.19 118.7449 90)
      (effects (font (size 1.27 1.27)) (justify left))
    )
    (property "Value" "MOLEX2" (id 1) (at 250.19 121.2849 90)
      (effects (font (size 1.27 1.27)) (justify left))
    )
    (property "Footprint" "Molex_CLIK-Mate_502382-0270_1x02-1MP_P1.25mm_Vertical" (id 2) (at 252.73 113.03 0)
      (effects (font (size 1.27 1.27)) hide)
    )
    (property "Datasheet" "" (id 3) (at 252.73 113.03 0)
      (effects (font (size 1.27 1.27)) hide)
    )
    (pin "1" (uuid 1bd1a63b-93eb-497b-b1a7-3efd8587bf31))
    (pin "2" (uuid 0741db97-3653-4f4c-b0f2-7862385b0b92))
  )

  (symbol (lib_id "Device:C") (at 215.9 135.89 270) (unit 1)
    (in_bom yes) (on_board yes) (fields_autoplaced)
    (uuid d704ac09-5a71-493f-8ded-9b06194d2571)
    (property "Reference" "C78" (id 0) (at 215.9 128.27 90))
    (property "Value" "10u" (id 1) (at 215.9 130.81 90))
    (property "Footprint" "Capacitor_SMD:C_0603_1608Metric" (id 2) (at 212.09 136.8552 0)
      (effects (font (size 1.27 1.27)) hide)
    )
    (property "Datasheet" "~" (id 3) (at 215.9 135.89 0)
      (effects (font (size 1.27 1.27)) hide)
    )
    (pin "1" (uuid 6842eeac-a53c-47a8-84c4-a75a2e84b1d4))
    (pin "2" (uuid 0dfa6c21-8951-4c9b-bdd3-2657054ea36f))
  )

  (symbol (lib_id "Transistor_FET:2N7000") (at 251.46 148.59 0) (mirror x) (unit 1)
    (in_bom yes) (on_board yes) (fields_autoplaced)
    (uuid dca51eef-1944-43cd-80b6-788eda937e7e)
    (property "Reference" "Q15" (id 0) (at 257.81 147.3199 0)
      (effects (font (size 1.27 1.27)) (justify left))
    )
    (property "Value" "SQ418EY" (id 1) (at 257.81 149.8599 0)
      (effects (font (size 1.27 1.27)) (justify left))
    )
    (property "Footprint" "Package_TO_SOT_THT:TO-92_Inline" (id 2) (at 256.54 146.685 0)
      (effects (font (size 1.27 1.27) italic) (justify left) hide)
    )
    (property "Datasheet" "https://www.vishay.com/docs/70226/70226.pdf" (id 3) (at 251.46 148.59 0)
      (effects (font (size 1.27 1.27)) (justify left) hide)
    )
    (pin "1" (uuid dd370687-5a05-4707-be9e-10c60a8005c7))
    (pin "2" (uuid 28e01f1d-262e-4cd2-8461-116e3a31a55d))
    (pin "3" (uuid eb7e0088-3927-4d5d-bf64-3793443643e5))
  )

  (symbol (lib_id "Device:R") (at 46.99 58.42 0) (unit 1)
    (in_bom yes) (on_board yes)
    (uuid f8e5fba8-f439-4929-b49f-53efa5189914)
    (property "Reference" "R96" (id 0) (at 41.91 57.15 0)
      (effects (font (size 1.27 1.27)) (justify left))
    )
    (property "Value" "10K" (id 1) (at 41.91 59.69 0)
      (effects (font (size 1.27 1.27)) (justify left))
    )
    (property "Footprint" "Resistor_SMD:R_0201_0603Metric" (id 2) (at 45.212 58.42 90)
      (effects (font (size 1.27 1.27)) hide)
    )
    (property "Datasheet" "~" (id 3) (at 46.99 58.42 0)
      (effects (font (size 1.27 1.27)) hide)
    )
    (pin "1" (uuid f9999a36-c340-496f-9b47-703164308dc8))
    (pin "2" (uuid f8456370-3245-4017-b195-25a1eaa54cdf))
  )
)
