(kicad_sch (version 20211123) (generator eeschema)

  (uuid 26904943-12f5-4b8b-9f04-ddfd5bfcc55e)

  (paper "A4")

  (lib_symbols
    (symbol "Device:R" (pin_numbers hide) (pin_names (offset 0)) (in_bom yes) (on_board yes)
      (property "Reference" "R" (id 0) (at 2.032 0 90)
        (effects (font (size 1.27 1.27)))
      )
      (property "Value" "R" (id 1) (at 0 0 90)
        (effects (font (size 1.27 1.27)))
      )
      (property "Footprint" "" (id 2) (at -1.778 0 90)
        (effects (font (size 1.27 1.27)) hide)
      )
      (property "Datasheet" "~" (id 3) (at 0 0 0)
        (effects (font (size 1.27 1.27)) hide)
      )
      (property "ki_keywords" "R res resistor" (id 4) (at 0 0 0)
        (effects (font (size 1.27 1.27)) hide)
      )
      (property "ki_description" "Resistor" (id 5) (at 0 0 0)
        (effects (font (size 1.27 1.27)) hide)
      )
      (property "ki_fp_filters" "R_*" (id 6) (at 0 0 0)
        (effects (font (size 1.27 1.27)) hide)
      )
      (symbol "R_0_1"
        (rectangle (start -1.016 -2.54) (end 1.016 2.54)
          (stroke (width 0.254) (type default) (color 0 0 0 0))
          (fill (type none))
        )
      )
      (symbol "R_1_1"
        (pin passive line (at 0 3.81 270) (length 1.27)
          (name "~" (effects (font (size 1.27 1.27))))
          (number "1" (effects (font (size 1.27 1.27))))
        )
        (pin passive line (at 0 -3.81 90) (length 1.27)
          (name "~" (effects (font (size 1.27 1.27))))
          (number "2" (effects (font (size 1.27 1.27))))
        )
      )
    )
    (symbol "power:GND" (power) (pin_names (offset 0)) (in_bom yes) (on_board yes)
      (property "Reference" "#PWR" (id 0) (at 0 -6.35 0)
        (effects (font (size 1.27 1.27)) hide)
      )
      (property "Value" "GND" (id 1) (at 0 -3.81 0)
        (effects (font (size 1.27 1.27)))
      )
      (property "Footprint" "" (id 2) (at 0 0 0)
        (effects (font (size 1.27 1.27)) hide)
      )
      (property "Datasheet" "" (id 3) (at 0 0 0)
        (effects (font (size 1.27 1.27)) hide)
      )
      (property "ki_keywords" "power-flag" (id 4) (at 0 0 0)
        (effects (font (size 1.27 1.27)) hide)
      )
      (property "ki_description" "Power symbol creates a global label with name \"GND\" , ground" (id 5) (at 0 0 0)
        (effects (font (size 1.27 1.27)) hide)
      )
      (symbol "GND_0_1"
        (polyline
          (pts
            (xy 0 0)
            (xy 0 -1.27)
            (xy 1.27 -1.27)
            (xy 0 -2.54)
            (xy -1.27 -1.27)
            (xy 0 -1.27)
          )
          (stroke (width 0) (type default) (color 0 0 0 0))
          (fill (type none))
        )
      )
      (symbol "GND_1_1"
        (pin power_in line (at 0 0 270) (length 0) hide
          (name "GND" (effects (font (size 1.27 1.27))))
          (number "1" (effects (font (size 1.27 1.27))))
        )
      )
    )
  )

  (junction (at 62.23 81.28) (diameter 0) (color 0 0 0 0)
    (uuid 36b6cb3e-0e2b-46af-844b-2789c84a0250)
  )
  (junction (at 214.63 36.83) (diameter 0) (color 0 0 0 0)
    (uuid 494dd54a-5a6a-4c43-bfa0-65b6711f6611)
  )
  (junction (at 62.23 157.48) (diameter 0) (color 0 0 0 0)
    (uuid 55cc279b-3c74-41f2-847d-37792f216d27)
  )
  (junction (at 214.63 135.89) (diameter 0) (color 0 0 0 0)
    (uuid 7f1e8ed5-c342-4f54-b807-f7b260edbb56)
  )
  (junction (at 146.05 36.83) (diameter 0) (color 0 0 0 0)
    (uuid 91585dc9-d336-4ca1-8449-1c0b4ed75283)
  )
  (junction (at 62.23 118.11) (diameter 0) (color 0 0 0 0)
    (uuid 9b2a5875-53d7-4485-9b70-d2bbb94c29e0)
  )
  (junction (at 62.23 36.83) (diameter 0) (color 0 0 0 0)
    (uuid c134b822-315d-4b07-a4cc-6f880501ab35)
  )
  (junction (at 146.05 81.28) (diameter 0) (color 0 0 0 0)
    (uuid c73ebffd-cffc-4b1b-a7dd-e34051198594)
  )
  (junction (at 214.63 81.28) (diameter 0) (color 0 0 0 0)
    (uuid e10da0c5-a836-46f3-9368-ac903de2dbd1)
  )

  (wire (pts (xy 54.61 81.28) (xy 62.23 81.28))
    (stroke (width 0) (type default) (color 0 0 0 0))
    (uuid 019ad997-2212-4f66-9fd1-3c6706b10bb6)
  )
  (wire (pts (xy 214.63 144.78) (xy 214.63 135.89))
    (stroke (width 0) (type default) (color 0 0 0 0))
    (uuid 0896b457-e006-423c-9942-b6734310fded)
  )
  (wire (pts (xy 146.05 36.83) (xy 152.4 36.83))
    (stroke (width 0) (type default) (color 0 0 0 0))
    (uuid 0b9534de-9c62-4817-8f33-ea769c9e8a64)
  )
  (wire (pts (xy 212.09 45.72) (xy 214.63 45.72))
    (stroke (width 0) (type default) (color 0 0 0 0))
    (uuid 0cf1609f-2681-4e0e-ab1a-c5dcfa328eaa)
  )
  (wire (pts (xy 83.82 166.37) (xy 83.82 157.48))
    (stroke (width 0) (type default) (color 0 0 0 0))
    (uuid 1cdf8613-9e93-40f9-a608-4f2b23e58e29)
  )
  (wire (pts (xy 143.51 45.72) (xy 146.05 45.72))
    (stroke (width 0) (type default) (color 0 0 0 0))
    (uuid 21586b3d-cfda-466c-bad9-defa98e309ae)
  )
  (wire (pts (xy 121.92 81.28) (xy 130.81 81.28))
    (stroke (width 0) (type default) (color 0 0 0 0))
    (uuid 2234f6b8-5eb8-421c-b416-78d54a20700a)
  )
  (wire (pts (xy 214.63 90.17) (xy 214.63 81.28))
    (stroke (width 0) (type default) (color 0 0 0 0))
    (uuid 27a4ff79-8a69-4a4b-8085-2998ff7c9262)
  )
  (wire (pts (xy 54.61 36.83) (xy 62.23 36.83))
    (stroke (width 0) (type default) (color 0 0 0 0))
    (uuid 2d4e066e-1c33-4634-9d07-ed94f5b6cf94)
  )
  (wire (pts (xy 59.69 127) (xy 62.23 127))
    (stroke (width 0) (type default) (color 0 0 0 0))
    (uuid 2f867e3f-fd50-4197-8522-6485eae4945d)
  )
  (wire (pts (xy 62.23 81.28) (xy 68.58 81.28))
    (stroke (width 0) (type default) (color 0 0 0 0))
    (uuid 2fa65ebc-9fe1-42f0-92ba-3a26e8928e07)
  )
  (wire (pts (xy 190.5 135.89) (xy 199.39 135.89))
    (stroke (width 0) (type default) (color 0 0 0 0))
    (uuid 32d7f8a9-2b3b-44f7-ac16-c133bc6522b4)
  )
  (wire (pts (xy 236.22 81.28) (xy 228.6 81.28))
    (stroke (width 0) (type default) (color 0 0 0 0))
    (uuid 3565eaa7-585a-45a3-bbc4-fbb025a4b401)
  )
  (wire (pts (xy 138.43 36.83) (xy 146.05 36.83))
    (stroke (width 0) (type default) (color 0 0 0 0))
    (uuid 36802fb0-10a6-4216-9e45-c827f8682146)
  )
  (wire (pts (xy 214.63 81.28) (xy 220.98 81.28))
    (stroke (width 0) (type default) (color 0 0 0 0))
    (uuid 3b07f287-c13d-4bf8-85db-86694d5b3e38)
  )
  (wire (pts (xy 62.23 90.17) (xy 62.23 81.28))
    (stroke (width 0) (type default) (color 0 0 0 0))
    (uuid 429b0100-28fc-4934-a3d0-924a1cde7575)
  )
  (wire (pts (xy 236.22 90.17) (xy 236.22 81.28))
    (stroke (width 0) (type default) (color 0 0 0 0))
    (uuid 431e59ed-76db-4f07-a792-e90812d68772)
  )
  (wire (pts (xy 212.09 90.17) (xy 214.63 90.17))
    (stroke (width 0) (type default) (color 0 0 0 0))
    (uuid 497dad53-7596-4685-947b-a46716501062)
  )
  (wire (pts (xy 62.23 157.48) (xy 68.58 157.48))
    (stroke (width 0) (type default) (color 0 0 0 0))
    (uuid 4af961eb-1d58-4c91-83e8-f0e1d382873b)
  )
  (wire (pts (xy 83.82 45.72) (xy 83.82 36.83))
    (stroke (width 0) (type default) (color 0 0 0 0))
    (uuid 50a743e5-7fd5-41a8-af2a-b25984f51989)
  )
  (wire (pts (xy 59.69 45.72) (xy 62.23 45.72))
    (stroke (width 0) (type default) (color 0 0 0 0))
    (uuid 55c35995-47d3-4b9c-9723-db2e1aaf8d3d)
  )
  (wire (pts (xy 236.22 135.89) (xy 228.6 135.89))
    (stroke (width 0) (type default) (color 0 0 0 0))
    (uuid 5e87854e-f2ed-4804-b47e-451c60516c65)
  )
  (wire (pts (xy 146.05 90.17) (xy 146.05 81.28))
    (stroke (width 0) (type default) (color 0 0 0 0))
    (uuid 60f4135e-a923-4d92-9b7e-5b3cc7c49b08)
  )
  (wire (pts (xy 214.63 45.72) (xy 214.63 36.83))
    (stroke (width 0) (type default) (color 0 0 0 0))
    (uuid 68245183-01e9-4c9d-83cc-b6041e8e33bc)
  )
  (wire (pts (xy 207.01 81.28) (xy 214.63 81.28))
    (stroke (width 0) (type default) (color 0 0 0 0))
    (uuid 6b365fa8-2567-4f56-b1e5-7ff292bd7b0d)
  )
  (wire (pts (xy 167.64 45.72) (xy 167.64 36.83))
    (stroke (width 0) (type default) (color 0 0 0 0))
    (uuid 71b47552-1b11-4275-97fa-9fcd575911c9)
  )
  (wire (pts (xy 167.64 36.83) (xy 160.02 36.83))
    (stroke (width 0) (type default) (color 0 0 0 0))
    (uuid 73b10c1c-c24c-45a1-9df4-19208c004f52)
  )
  (wire (pts (xy 207.01 135.89) (xy 214.63 135.89))
    (stroke (width 0) (type default) (color 0 0 0 0))
    (uuid 76c4c230-d5c0-479f-8d14-0024a8086803)
  )
  (wire (pts (xy 121.92 36.83) (xy 130.81 36.83))
    (stroke (width 0) (type default) (color 0 0 0 0))
    (uuid 77812e52-6c65-4389-ba04-8fd86365043b)
  )
  (wire (pts (xy 38.1 81.28) (xy 46.99 81.28))
    (stroke (width 0) (type default) (color 0 0 0 0))
    (uuid 79b899a8-603b-458a-85b4-f9b501036640)
  )
  (wire (pts (xy 190.5 81.28) (xy 199.39 81.28))
    (stroke (width 0) (type default) (color 0 0 0 0))
    (uuid 7f8e1e5b-48e6-49c8-883e-c5ec05b09285)
  )
  (wire (pts (xy 38.1 36.83) (xy 46.99 36.83))
    (stroke (width 0) (type default) (color 0 0 0 0))
    (uuid 81e51bb2-9750-415a-a6ff-a380b01652e4)
  )
  (wire (pts (xy 146.05 45.72) (xy 146.05 36.83))
    (stroke (width 0) (type default) (color 0 0 0 0))
    (uuid 876d9a9d-3ece-462e-90c6-52976a799513)
  )
  (wire (pts (xy 59.69 90.17) (xy 62.23 90.17))
    (stroke (width 0) (type default) (color 0 0 0 0))
    (uuid 87c98974-f9ab-4033-8122-c8ff270a52d7)
  )
  (wire (pts (xy 83.82 90.17) (xy 83.82 81.28))
    (stroke (width 0) (type default) (color 0 0 0 0))
    (uuid 89e50c76-39aa-4949-bc46-0454880b0e6f)
  )
  (wire (pts (xy 167.64 90.17) (xy 167.64 81.28))
    (stroke (width 0) (type default) (color 0 0 0 0))
    (uuid 8ab89791-df4d-4a40-af4d-e198022ff8a3)
  )
  (wire (pts (xy 62.23 118.11) (xy 68.58 118.11))
    (stroke (width 0) (type default) (color 0 0 0 0))
    (uuid 8f660f2a-5d8c-49c7-b6f1-f1932a2bde2c)
  )
  (wire (pts (xy 214.63 135.89) (xy 220.98 135.89))
    (stroke (width 0) (type default) (color 0 0 0 0))
    (uuid 9741f932-7eb7-407c-af2b-b9e985edaecf)
  )
  (wire (pts (xy 83.82 36.83) (xy 76.2 36.83))
    (stroke (width 0) (type default) (color 0 0 0 0))
    (uuid 99b8d67e-b0fe-424c-892d-d331a3a2f572)
  )
  (wire (pts (xy 236.22 144.78) (xy 236.22 135.89))
    (stroke (width 0) (type default) (color 0 0 0 0))
    (uuid 9ebfada0-f041-456b-81de-ef96a6ce12a2)
  )
  (wire (pts (xy 236.22 36.83) (xy 228.6 36.83))
    (stroke (width 0) (type default) (color 0 0 0 0))
    (uuid 9f79bfe4-05fa-4076-b1c9-fcc3f145edda)
  )
  (wire (pts (xy 38.1 157.48) (xy 46.99 157.48))
    (stroke (width 0) (type default) (color 0 0 0 0))
    (uuid 9f84d0d9-b9c5-4bd5-87bf-a14f6c490acc)
  )
  (wire (pts (xy 83.82 157.48) (xy 76.2 157.48))
    (stroke (width 0) (type default) (color 0 0 0 0))
    (uuid ad506353-1979-42c8-bd8e-e1243215023d)
  )
  (wire (pts (xy 190.5 36.83) (xy 199.39 36.83))
    (stroke (width 0) (type default) (color 0 0 0 0))
    (uuid b2788332-c129-4e44-a1d7-cbb26f0aa745)
  )
  (wire (pts (xy 54.61 157.48) (xy 62.23 157.48))
    (stroke (width 0) (type default) (color 0 0 0 0))
    (uuid c45a3965-af4e-47f2-86a7-1d1bbe51ff44)
  )
  (wire (pts (xy 59.69 166.37) (xy 62.23 166.37))
    (stroke (width 0) (type default) (color 0 0 0 0))
    (uuid c493395b-8f93-49d4-98c2-e2407b72b3be)
  )
  (wire (pts (xy 83.82 118.11) (xy 76.2 118.11))
    (stroke (width 0) (type default) (color 0 0 0 0))
    (uuid c9fb7f3d-26f0-4922-8908-5bbe8f13aad5)
  )
  (wire (pts (xy 54.61 118.11) (xy 62.23 118.11))
    (stroke (width 0) (type default) (color 0 0 0 0))
    (uuid d4c4771c-de29-4560-90db-3b46a7cbfe0f)
  )
  (wire (pts (xy 214.63 36.83) (xy 220.98 36.83))
    (stroke (width 0) (type default) (color 0 0 0 0))
    (uuid d4db9fb6-a00a-4105-bbfa-c9b6715d47ad)
  )
  (wire (pts (xy 207.01 36.83) (xy 214.63 36.83))
    (stroke (width 0) (type default) (color 0 0 0 0))
    (uuid d6f4d7a5-d05f-475a-9083-39e9aef524bc)
  )
  (wire (pts (xy 62.23 45.72) (xy 62.23 36.83))
    (stroke (width 0) (type default) (color 0 0 0 0))
    (uuid d7262796-7f12-4a92-b0a5-ffc35c02597a)
  )
  (wire (pts (xy 62.23 166.37) (xy 62.23 157.48))
    (stroke (width 0) (type default) (color 0 0 0 0))
    (uuid dcf5a942-2ed9-41bc-8223-bed5005640d6)
  )
  (wire (pts (xy 167.64 81.28) (xy 160.02 81.28))
    (stroke (width 0) (type default) (color 0 0 0 0))
    (uuid de19d31a-e7b3-475e-bca1-cc739f5b66e4)
  )
  (wire (pts (xy 83.82 81.28) (xy 76.2 81.28))
    (stroke (width 0) (type default) (color 0 0 0 0))
    (uuid e1591865-a2a2-4fb0-8384-5f3de2097b30)
  )
  (wire (pts (xy 62.23 127) (xy 62.23 118.11))
    (stroke (width 0) (type default) (color 0 0 0 0))
    (uuid e1da5a1d-e99b-453f-88d9-ccc95c885765)
  )
  (wire (pts (xy 236.22 45.72) (xy 236.22 36.83))
    (stroke (width 0) (type default) (color 0 0 0 0))
    (uuid e44b6647-1d4d-474c-9946-ebec719ba949)
  )
  (wire (pts (xy 138.43 81.28) (xy 146.05 81.28))
    (stroke (width 0) (type default) (color 0 0 0 0))
    (uuid e4d40eca-3916-4b66-8368-9a4ef7787dcf)
  )
  (wire (pts (xy 62.23 36.83) (xy 68.58 36.83))
    (stroke (width 0) (type default) (color 0 0 0 0))
    (uuid e833716e-21e1-4826-be36-bff0c7fc8731)
  )
  (wire (pts (xy 38.1 118.11) (xy 46.99 118.11))
    (stroke (width 0) (type default) (color 0 0 0 0))
    (uuid ead08581-ea5f-4f7b-8bc2-50444a6e96ce)
  )
  (wire (pts (xy 143.51 90.17) (xy 146.05 90.17))
    (stroke (width 0) (type default) (color 0 0 0 0))
    (uuid f0655057-3282-481b-9587-230a294e75c3)
  )
  (wire (pts (xy 146.05 81.28) (xy 152.4 81.28))
    (stroke (width 0) (type default) (color 0 0 0 0))
    (uuid f201f608-078a-49ee-b37d-ce56b6b01a9f)
  )
  (wire (pts (xy 212.09 144.78) (xy 214.63 144.78))
    (stroke (width 0) (type default) (color 0 0 0 0))
    (uuid f3293aa6-0a12-455e-a022-6d88505b1db6)
  )
  (wire (pts (xy 83.82 127) (xy 83.82 118.11))
    (stroke (width 0) (type default) (color 0 0 0 0))
    (uuid f44dce32-731a-432a-aa5d-5b591e5d0f0d)
  )

  (global_label "5V_L2" (shape input) (at 38.1 118.11 180) (fields_autoplaced)
    (effects (font (size 1.27 1.27)) (justify right))
    (uuid 19e65524-edbf-4f38-98aa-f2a8cdcfbc25)
    (property "Intersheet References" "${INTERSHEET_REFS}" (id 0) (at 30.1836 118.0306 0)
      (effects (font (size 1.27 1.27)) (justify right) hide)
    )
  )
  (global_label "5V_L1" (shape input) (at 38.1 81.28 180) (fields_autoplaced)
    (effects (font (size 1.27 1.27)) (justify right))
    (uuid 1d797021-5d70-4c88-96fc-245f21b18290)
    (property "Intersheet References" "${INTERSHEET_REFS}" (id 0) (at 30.1836 81.2006 0)
      (effects (font (size 1.27 1.27)) (justify right) hide)
    )
  )
  (global_label "ADC1_V" (shape input) (at 59.69 45.72 180) (fields_autoplaced)
    (effects (font (size 1.27 1.27)) (justify right))
    (uuid 3e3b2f79-308c-4ce6-8280-bd8c35c45c7d)
    (property "Intersheet References" "${INTERSHEET_REFS}" (id 0) (at 50.3826 45.6406 0)
      (effects (font (size 1.27 1.27)) (justify right) hide)
    )
  )
  (global_label "MMPT_OUT" (shape input) (at 38.1 157.48 180) (fields_autoplaced)
    (effects (font (size 1.27 1.27)) (justify right))
    (uuid 3eec5f1b-283e-4530-9cb3-b8895d7bec5b)
    (property "Intersheet References" "${INTERSHEET_REFS}" (id 0) (at 25.9502 157.4006 0)
      (effects (font (size 1.27 1.27)) (justify right) hide)
    )
  )
  (global_label "ADC7_V" (shape input) (at 212.09 90.17 180) (fields_autoplaced)
    (effects (font (size 1.27 1.27)) (justify right))
    (uuid 52616b00-0701-488b-80fe-c48488adb326)
    (property "Intersheet References" "${INTERSHEET_REFS}" (id 0) (at 202.7826 90.0906 0)
      (effects (font (size 1.27 1.27)) (justify right) hide)
    )
  )
  (global_label "BAT_I+" (shape input) (at 190.5 135.89 180) (fields_autoplaced)
    (effects (font (size 1.27 1.27)) (justify right))
    (uuid 5b22cbe9-d183-4e1c-80dd-ec8ea7534acf)
    (property "Intersheet References" "${INTERSHEET_REFS}" (id 0) (at 181.6159 135.8106 0)
      (effects (font (size 1.27 1.27)) (justify right) hide)
    )
  )
  (global_label "3V3_L3" (shape input) (at 190.5 36.83 180) (fields_autoplaced)
    (effects (font (size 1.27 1.27)) (justify right))
    (uuid 6818a53a-678b-4f5f-b07c-4ef6a99deb55)
    (property "Intersheet References" "${INTERSHEET_REFS}" (id 0) (at 181.374 36.7506 0)
      (effects (font (size 1.27 1.27)) (justify right) hide)
    )
  )
  (global_label "12V" (shape input) (at 38.1 36.83 180) (fields_autoplaced)
    (effects (font (size 1.27 1.27)) (justify right))
    (uuid 6924afad-1534-4328-97bf-c2bb5704e9bb)
    (property "Intersheet References" "${INTERSHEET_REFS}" (id 0) (at 32.1793 36.7506 0)
      (effects (font (size 1.27 1.27)) (justify right) hide)
    )
  )
  (global_label "3V3_L1" (shape input) (at 121.92 36.83 180) (fields_autoplaced)
    (effects (font (size 1.27 1.27)) (justify right))
    (uuid 6981508b-f5e0-4650-be51-c4ca6510dd39)
    (property "Intersheet References" "${INTERSHEET_REFS}" (id 0) (at 112.794 36.7506 0)
      (effects (font (size 1.27 1.27)) (justify right) hide)
    )
  )
  (global_label "ADC16_V" (shape input) (at 59.69 166.37 180) (fields_autoplaced)
    (effects (font (size 1.27 1.27)) (justify right))
    (uuid 77e0c49a-0ff5-4b93-8acd-4a4219eeafbf)
    (property "Intersheet References" "${INTERSHEET_REFS}" (id 0) (at 49.1731 166.2906 0)
      (effects (font (size 1.27 1.27)) (justify right) hide)
    )
  )
  (global_label "3V3_L4" (shape input) (at 190.5 81.28 180) (fields_autoplaced)
    (effects (font (size 1.27 1.27)) (justify right))
    (uuid 83a594de-17c2-428a-a8f7-8611dd1e3dd8)
    (property "Intersheet References" "${INTERSHEET_REFS}" (id 0) (at 181.374 81.2006 0)
      (effects (font (size 1.27 1.27)) (justify right) hide)
    )
  )
  (global_label "ADC2_V" (shape input) (at 59.69 90.17 180) (fields_autoplaced)
    (effects (font (size 1.27 1.27)) (justify right))
    (uuid a0ddc658-2171-47c9-89bb-477e7dd096f4)
    (property "Intersheet References" "${INTERSHEET_REFS}" (id 0) (at 50.3826 90.0906 0)
      (effects (font (size 1.27 1.27)) (justify right) hide)
    )
  )
  (global_label "ADC5_V" (shape input) (at 143.51 90.17 180) (fields_autoplaced)
    (effects (font (size 1.27 1.27)) (justify right))
    (uuid ad627f22-26b1-4336-a69c-ab3613abd3b9)
    (property "Intersheet References" "${INTERSHEET_REFS}" (id 0) (at 134.2026 90.0906 0)
      (effects (font (size 1.27 1.27)) (justify right) hide)
    )
  )
  (global_label "3V3_L2" (shape input) (at 121.92 81.28 180) (fields_autoplaced)
    (effects (font (size 1.27 1.27)) (justify right))
    (uuid af1d012d-f7c9-4322-9e9e-6309c06f0581)
    (property "Intersheet References" "${INTERSHEET_REFS}" (id 0) (at 112.794 81.2006 0)
      (effects (font (size 1.27 1.27)) (justify right) hide)
    )
  )
  (global_label "ADC8_V" (shape input) (at 212.09 144.78 180) (fields_autoplaced)
    (effects (font (size 1.27 1.27)) (justify right))
    (uuid b2ddc067-2ca9-4e78-b46b-7b0020e10cad)
    (property "Intersheet References" "${INTERSHEET_REFS}" (id 0) (at 202.7826 144.7006 0)
      (effects (font (size 1.27 1.27)) (justify right) hide)
    )
  )
  (global_label "ADC3_V" (shape input) (at 59.69 127 180) (fields_autoplaced)
    (effects (font (size 1.27 1.27)) (justify right))
    (uuid cc1f3d51-779c-4509-ba4a-18e32fddd567)
    (property "Intersheet References" "${INTERSHEET_REFS}" (id 0) (at 50.3826 126.9206 0)
      (effects (font (size 1.27 1.27)) (justify right) hide)
    )
  )
  (global_label "ADC4_V" (shape input) (at 143.51 45.72 180) (fields_autoplaced)
    (effects (font (size 1.27 1.27)) (justify right))
    (uuid dbe94de1-074a-4286-8bb6-fe7627e61940)
    (property "Intersheet References" "${INTERSHEET_REFS}" (id 0) (at 134.2026 45.6406 0)
      (effects (font (size 1.27 1.27)) (justify right) hide)
    )
  )
  (global_label "ADC6_V" (shape input) (at 212.09 45.72 180) (fields_autoplaced)
    (effects (font (size 1.27 1.27)) (justify right))
    (uuid f8cb3c56-016f-46cd-a5d4-691d070eeaf1)
    (property "Intersheet References" "${INTERSHEET_REFS}" (id 0) (at 202.7826 45.6406 0)
      (effects (font (size 1.27 1.27)) (justify right) hide)
    )
  )

  (symbol (lib_id "Device:R") (at 50.8 81.28 90) (unit 1)
    (in_bom yes) (on_board yes) (fields_autoplaced)
    (uuid 102fde7d-117b-4cfa-b270-31a1f2d9a02b)
    (property "Reference" "R54" (id 0) (at 50.8 74.93 90))
    (property "Value" "100K" (id 1) (at 50.8 77.47 90))
    (property "Footprint" "Resistor_SMD:R_0603_1608Metric" (id 2) (at 50.8 83.058 90)
      (effects (font (size 1.27 1.27)) hide)
    )
    (property "Datasheet" "~" (id 3) (at 50.8 81.28 0)
      (effects (font (size 1.27 1.27)) hide)
    )
    (pin "1" (uuid cc085f3b-30e1-4da9-bec5-96a40fbcf7af))
    (pin "2" (uuid 0abe61c2-85c3-43db-9b74-03f0a49f9b2e))
  )

  (symbol (lib_id "Device:R") (at 224.79 135.89 90) (unit 1)
    (in_bom yes) (on_board yes) (fields_autoplaced)
    (uuid 159b5f49-f5b7-4a4b-ad10-17e448f5bb52)
    (property "Reference" "R40" (id 0) (at 224.79 129.54 90))
    (property "Value" "90k" (id 1) (at 224.79 132.08 90))
    (property "Footprint" "Resistor_SMD:R_0603_1608Metric" (id 2) (at 224.79 137.668 90)
      (effects (font (size 1.27 1.27)) hide)
    )
    (property "Datasheet" "~" (id 3) (at 224.79 135.89 0)
      (effects (font (size 1.27 1.27)) hide)
    )
    (pin "1" (uuid 30985570-6546-48da-bec3-d91d794d7cb0))
    (pin "2" (uuid 85b7e91d-d6c1-4717-9a1b-16f78d9f010d))
  )

  (symbol (lib_id "Device:R") (at 224.79 36.83 90) (unit 1)
    (in_bom yes) (on_board yes) (fields_autoplaced)
    (uuid 2b2b48b1-6c8d-4e5a-baea-2d00ee9bd769)
    (property "Reference" "R74" (id 0) (at 224.79 30.48 90))
    (property "Value" "154k" (id 1) (at 224.79 33.02 90))
    (property "Footprint" "Resistor_SMD:R_0603_1608Metric" (id 2) (at 224.79 38.608 90)
      (effects (font (size 1.27 1.27)) hide)
    )
    (property "Datasheet" "~" (id 3) (at 224.79 36.83 0)
      (effects (font (size 1.27 1.27)) hide)
    )
    (pin "1" (uuid cd0a1bed-02b0-4819-8e33-303288fdfeb3))
    (pin "2" (uuid 4ae27a10-6eb9-4158-bd5f-802bca9c0361))
  )

  (symbol (lib_id "power:GND") (at 83.82 45.72 0) (unit 1)
    (in_bom yes) (on_board yes) (fields_autoplaced)
    (uuid 2bbd5fc1-b41d-4930-ab02-d9ba2117734c)
    (property "Reference" "#PWR0144" (id 0) (at 83.82 52.07 0)
      (effects (font (size 1.27 1.27)) hide)
    )
    (property "Value" "GND" (id 1) (at 83.82 50.8 0))
    (property "Footprint" "" (id 2) (at 83.82 45.72 0)
      (effects (font (size 1.27 1.27)) hide)
    )
    (property "Datasheet" "" (id 3) (at 83.82 45.72 0)
      (effects (font (size 1.27 1.27)) hide)
    )
    (pin "1" (uuid 95aa5bac-3168-4120-8a06-c2583a6d5c58))
  )

  (symbol (lib_id "power:GND") (at 167.64 90.17 0) (unit 1)
    (in_bom yes) (on_board yes) (fields_autoplaced)
    (uuid 30017652-fb7e-411a-815c-58e351edb792)
    (property "Reference" "#PWR0148" (id 0) (at 167.64 96.52 0)
      (effects (font (size 1.27 1.27)) hide)
    )
    (property "Value" "GND" (id 1) (at 167.64 95.25 0))
    (property "Footprint" "" (id 2) (at 167.64 90.17 0)
      (effects (font (size 1.27 1.27)) hide)
    )
    (property "Datasheet" "" (id 3) (at 167.64 90.17 0)
      (effects (font (size 1.27 1.27)) hide)
    )
    (pin "1" (uuid 859466a9-546f-4e91-98a3-bac8feebf175))
  )

  (symbol (lib_id "power:GND") (at 167.64 45.72 0) (unit 1)
    (in_bom yes) (on_board yes) (fields_autoplaced)
    (uuid 37683c0d-0dbf-4f8b-8f81-06e508798750)
    (property "Reference" "#PWR0149" (id 0) (at 167.64 52.07 0)
      (effects (font (size 1.27 1.27)) hide)
    )
    (property "Value" "GND" (id 1) (at 167.64 50.8 0))
    (property "Footprint" "" (id 2) (at 167.64 45.72 0)
      (effects (font (size 1.27 1.27)) hide)
    )
    (property "Datasheet" "" (id 3) (at 167.64 45.72 0)
      (effects (font (size 1.27 1.27)) hide)
    )
    (pin "1" (uuid 6c7c4557-a579-46db-84a7-089af5d9785d))
  )

  (symbol (lib_id "Device:R") (at 50.8 157.48 90) (unit 1)
    (in_bom yes) (on_board yes) (fields_autoplaced)
    (uuid 391f6822-a41a-4d25-a06a-0de0698dde49)
    (property "Reference" "R41" (id 0) (at 50.8 151.13 90))
    (property "Value" "100k" (id 1) (at 50.8 153.67 90))
    (property "Footprint" "Resistor_SMD:R_0603_1608Metric" (id 2) (at 50.8 159.258 90)
      (effects (font (size 1.27 1.27)) hide)
    )
    (property "Datasheet" "~" (id 3) (at 50.8 157.48 0)
      (effects (font (size 1.27 1.27)) hide)
    )
    (pin "1" (uuid e5d2f832-6839-404f-9cd4-46dc9a480670))
    (pin "2" (uuid b5187a56-d51f-43c6-8886-bb7b00189935))
  )

  (symbol (lib_id "Device:R") (at 72.39 157.48 90) (unit 1)
    (in_bom yes) (on_board yes) (fields_autoplaced)
    (uuid 3e3691e9-854f-40f3-9960-ad7f388830bc)
    (property "Reference" "R44" (id 0) (at 72.39 151.13 90))
    (property "Value" "66k" (id 1) (at 72.39 153.67 90))
    (property "Footprint" "Resistor_SMD:R_0603_1608Metric" (id 2) (at 72.39 159.258 90)
      (effects (font (size 1.27 1.27)) hide)
    )
    (property "Datasheet" "~" (id 3) (at 72.39 157.48 0)
      (effects (font (size 1.27 1.27)) hide)
    )
    (pin "1" (uuid 3493d5e6-3eb8-4de3-9d20-c501030b6363))
    (pin "2" (uuid a652ba54-2e00-4a33-9c32-fe514ed4f579))
  )

  (symbol (lib_id "Device:R") (at 224.79 81.28 90) (unit 1)
    (in_bom yes) (on_board yes) (fields_autoplaced)
    (uuid 44137a50-4300-48b2-94e9-ac3039c9b564)
    (property "Reference" "R76" (id 0) (at 224.79 74.93 90))
    (property "Value" "154k" (id 1) (at 224.79 77.47 90))
    (property "Footprint" "Resistor_SMD:R_0603_1608Metric" (id 2) (at 224.79 83.058 90)
      (effects (font (size 1.27 1.27)) hide)
    )
    (property "Datasheet" "~" (id 3) (at 224.79 81.28 0)
      (effects (font (size 1.27 1.27)) hide)
    )
    (pin "1" (uuid 2dcb97b0-8537-4c14-b7eb-d645b9602292))
    (pin "2" (uuid 24301140-6680-4d20-9565-a84730d4a4cc))
  )

  (symbol (lib_id "Device:R") (at 156.21 81.28 90) (unit 1)
    (in_bom yes) (on_board yes) (fields_autoplaced)
    (uuid 50a6d484-67ff-40c3-9d58-2a088e0ae124)
    (property "Reference" "R64" (id 0) (at 156.21 74.93 90))
    (property "Value" "154k" (id 1) (at 156.21 77.47 90))
    (property "Footprint" "Resistor_SMD:R_0603_1608Metric" (id 2) (at 156.21 83.058 90)
      (effects (font (size 1.27 1.27)) hide)
    )
    (property "Datasheet" "~" (id 3) (at 156.21 81.28 0)
      (effects (font (size 1.27 1.27)) hide)
    )
    (pin "1" (uuid 2484496a-cad4-4290-8d48-e8a68226d81c))
    (pin "2" (uuid 18984a72-6f31-413b-8c12-012f27f4f516))
  )

  (symbol (lib_id "Device:R") (at 72.39 118.11 90) (unit 1)
    (in_bom yes) (on_board yes) (fields_autoplaced)
    (uuid 55c9657c-0a61-4f95-a2c6-e7b51daae03e)
    (property "Reference" "R57" (id 0) (at 72.39 111.76 90))
    (property "Value" "66k" (id 1) (at 72.39 114.3 90))
    (property "Footprint" "Resistor_SMD:R_0603_1608Metric" (id 2) (at 72.39 119.888 90)
      (effects (font (size 1.27 1.27)) hide)
    )
    (property "Datasheet" "~" (id 3) (at 72.39 118.11 0)
      (effects (font (size 1.27 1.27)) hide)
    )
    (pin "1" (uuid 4558987f-28dc-4180-a0c1-59c30f88aa7d))
    (pin "2" (uuid 58aaa03b-7fe8-43ae-92c0-24f7eb16b2bb))
  )

  (symbol (lib_id "power:GND") (at 83.82 127 0) (unit 1)
    (in_bom yes) (on_board yes) (fields_autoplaced)
    (uuid 5b3e61c5-efa1-4b9c-93e2-d2854dabd959)
    (property "Reference" "#PWR0152" (id 0) (at 83.82 133.35 0)
      (effects (font (size 1.27 1.27)) hide)
    )
    (property "Value" "GND" (id 1) (at 83.82 132.08 0))
    (property "Footprint" "" (id 2) (at 83.82 127 0)
      (effects (font (size 1.27 1.27)) hide)
    )
    (property "Datasheet" "" (id 3) (at 83.82 127 0)
      (effects (font (size 1.27 1.27)) hide)
    )
    (pin "1" (uuid 3be08e7a-120a-45a8-91ee-01e1fb420d78))
  )

  (symbol (lib_id "Device:R") (at 156.21 36.83 90) (unit 1)
    (in_bom yes) (on_board yes) (fields_autoplaced)
    (uuid 5f9e843a-3a60-49db-b539-928c6c38a070)
    (property "Reference" "R62" (id 0) (at 156.21 30.48 90))
    (property "Value" "154k" (id 1) (at 156.21 33.02 90))
    (property "Footprint" "Resistor_SMD:R_0603_1608Metric" (id 2) (at 156.21 38.608 90)
      (effects (font (size 1.27 1.27)) hide)
    )
    (property "Datasheet" "~" (id 3) (at 156.21 36.83 0)
      (effects (font (size 1.27 1.27)) hide)
    )
    (pin "1" (uuid 5cb5fb18-e558-46e5-8966-b000466cb020))
    (pin "2" (uuid b507043e-9f8a-4f57-b977-4cda8bdc6738))
  )

  (symbol (lib_id "Device:R") (at 203.2 135.89 90) (unit 1)
    (in_bom yes) (on_board yes) (fields_autoplaced)
    (uuid 6529b792-152a-4c79-9134-b5a60850788a)
    (property "Reference" "R39" (id 0) (at 203.2 129.54 90))
    (property "Value" "100k" (id 1) (at 203.2 132.08 90))
    (property "Footprint" "Resistor_SMD:R_0603_1608Metric" (id 2) (at 203.2 137.668 90)
      (effects (font (size 1.27 1.27)) hide)
    )
    (property "Datasheet" "~" (id 3) (at 203.2 135.89 0)
      (effects (font (size 1.27 1.27)) hide)
    )
    (pin "1" (uuid 34461ac5-380d-4a8b-8aa5-85802c2e8a1c))
    (pin "2" (uuid 7706af23-6d55-4978-9c4e-3a6ee0ef33c8))
  )

  (symbol (lib_id "Device:R") (at 50.8 36.83 90) (unit 1)
    (in_bom yes) (on_board yes) (fields_autoplaced)
    (uuid 84a05ef3-0905-4613-a2a9-e492eeaa4cb2)
    (property "Reference" "R52" (id 0) (at 50.8 30.48 90))
    (property "Value" "100k" (id 1) (at 50.8 33.02 90))
    (property "Footprint" "Resistor_SMD:R_0603_1608Metric" (id 2) (at 50.8 38.608 90)
      (effects (font (size 1.27 1.27)) hide)
    )
    (property "Datasheet" "~" (id 3) (at 50.8 36.83 0)
      (effects (font (size 1.27 1.27)) hide)
    )
    (pin "1" (uuid c21beb8f-3117-47fd-b25c-68daddd427e1))
    (pin "2" (uuid b60e52fd-9d67-47c5-bb01-ba1f459ba7b2))
  )

  (symbol (lib_id "power:GND") (at 83.82 166.37 0) (unit 1)
    (in_bom yes) (on_board yes) (fields_autoplaced)
    (uuid 89345661-2d8e-4670-8eea-7eb23892c608)
    (property "Reference" "#PWR0151" (id 0) (at 83.82 172.72 0)
      (effects (font (size 1.27 1.27)) hide)
    )
    (property "Value" "GND" (id 1) (at 83.82 171.45 0))
    (property "Footprint" "" (id 2) (at 83.82 166.37 0)
      (effects (font (size 1.27 1.27)) hide)
    )
    (property "Datasheet" "" (id 3) (at 83.82 166.37 0)
      (effects (font (size 1.27 1.27)) hide)
    )
    (pin "1" (uuid 0780b152-af65-4048-a509-dd0ec1b7a339))
  )

  (symbol (lib_id "power:GND") (at 236.22 90.17 0) (unit 1)
    (in_bom yes) (on_board yes) (fields_autoplaced)
    (uuid a6589362-4d46-46a5-a415-ba836f63b02e)
    (property "Reference" "#PWR0145" (id 0) (at 236.22 96.52 0)
      (effects (font (size 1.27 1.27)) hide)
    )
    (property "Value" "GND" (id 1) (at 236.22 95.25 0))
    (property "Footprint" "" (id 2) (at 236.22 90.17 0)
      (effects (font (size 1.27 1.27)) hide)
    )
    (property "Datasheet" "" (id 3) (at 236.22 90.17 0)
      (effects (font (size 1.27 1.27)) hide)
    )
    (pin "1" (uuid 1b229935-bf5c-4e02-b409-a3ff25ff39fe))
  )

  (symbol (lib_id "power:GND") (at 236.22 144.78 0) (unit 1)
    (in_bom yes) (on_board yes) (fields_autoplaced)
    (uuid b24ba5e3-a342-464a-ad63-a0525f9ba7ae)
    (property "Reference" "#PWR0146" (id 0) (at 236.22 151.13 0)
      (effects (font (size 1.27 1.27)) hide)
    )
    (property "Value" "GND" (id 1) (at 236.22 149.86 0))
    (property "Footprint" "" (id 2) (at 236.22 144.78 0)
      (effects (font (size 1.27 1.27)) hide)
    )
    (property "Datasheet" "" (id 3) (at 236.22 144.78 0)
      (effects (font (size 1.27 1.27)) hide)
    )
    (pin "1" (uuid 3af89312-4921-4a6e-8b1c-7e58ac433898))
  )

  (symbol (lib_id "Device:R") (at 203.2 36.83 90) (unit 1)
    (in_bom yes) (on_board yes) (fields_autoplaced)
    (uuid b7b62e94-5d5b-4701-a65c-000de611ebcd)
    (property "Reference" "R73" (id 0) (at 203.2 30.48 90))
    (property "Value" "100k" (id 1) (at 203.2 33.02 90))
    (property "Footprint" "Resistor_SMD:R_0603_1608Metric" (id 2) (at 203.2 38.608 90)
      (effects (font (size 1.27 1.27)) hide)
    )
    (property "Datasheet" "~" (id 3) (at 203.2 36.83 0)
      (effects (font (size 1.27 1.27)) hide)
    )
    (pin "1" (uuid ea9ef389-b61a-4ef3-891d-e4e3fc86b58a))
    (pin "2" (uuid 6208cf7f-c166-4861-818d-f6456bc56968))
  )

  (symbol (lib_id "Device:R") (at 203.2 81.28 90) (unit 1)
    (in_bom yes) (on_board yes) (fields_autoplaced)
    (uuid baa5c6a2-a6b7-4783-95ea-0b26f54dbafd)
    (property "Reference" "R75" (id 0) (at 203.2 74.93 90))
    (property "Value" "100k" (id 1) (at 203.2 77.47 90))
    (property "Footprint" "Resistor_SMD:R_0603_1608Metric" (id 2) (at 203.2 83.058 90)
      (effects (font (size 1.27 1.27)) hide)
    )
    (property "Datasheet" "~" (id 3) (at 203.2 81.28 0)
      (effects (font (size 1.27 1.27)) hide)
    )
    (pin "1" (uuid 66f65413-6233-4330-b7da-45a1550f0f75))
    (pin "2" (uuid 16acf12a-22d4-4afe-834a-9957997d7578))
  )

  (symbol (lib_id "Device:R") (at 134.62 36.83 90) (unit 1)
    (in_bom yes) (on_board yes) (fields_autoplaced)
    (uuid c396849d-4fc3-4200-8deb-3d13a61aa9ab)
    (property "Reference" "R58" (id 0) (at 134.62 30.48 90))
    (property "Value" "100K" (id 1) (at 134.62 33.02 90))
    (property "Footprint" "Resistor_SMD:R_0603_1608Metric" (id 2) (at 134.62 38.608 90)
      (effects (font (size 1.27 1.27)) hide)
    )
    (property "Datasheet" "~" (id 3) (at 134.62 36.83 0)
      (effects (font (size 1.27 1.27)) hide)
    )
    (pin "1" (uuid 8b1f76a4-8424-48d9-8a53-50e1d1fbe8e2))
    (pin "2" (uuid 95f48de1-37a1-469c-a419-3f6c57e0fea3))
  )

  (symbol (lib_id "Device:R") (at 50.8 118.11 90) (unit 1)
    (in_bom yes) (on_board yes) (fields_autoplaced)
    (uuid cf3fece2-f4a1-45fd-b88d-7dc11587dc25)
    (property "Reference" "R56" (id 0) (at 50.8 111.76 90))
    (property "Value" "100k" (id 1) (at 50.8 114.3 90))
    (property "Footprint" "Resistor_SMD:R_0603_1608Metric" (id 2) (at 50.8 119.888 90)
      (effects (font (size 1.27 1.27)) hide)
    )
    (property "Datasheet" "~" (id 3) (at 50.8 118.11 0)
      (effects (font (size 1.27 1.27)) hide)
    )
    (pin "1" (uuid c57a6c6a-e472-4bcb-81b9-66186c3ecfd0))
    (pin "2" (uuid 19595cb2-8de7-4e6d-a371-be1c778bfbd2))
  )

  (symbol (lib_id "Device:R") (at 72.39 36.83 90) (unit 1)
    (in_bom yes) (on_board yes) (fields_autoplaced)
    (uuid eb0f2cd8-2bba-4ce2-94df-e820f74ffaaa)
    (property "Reference" "R53" (id 0) (at 72.39 30.48 90))
    (property "Value" "20k" (id 1) (at 72.39 33.02 90))
    (property "Footprint" "Resistor_SMD:R_0603_1608Metric" (id 2) (at 72.39 38.608 90)
      (effects (font (size 1.27 1.27)) hide)
    )
    (property "Datasheet" "~" (id 3) (at 72.39 36.83 0)
      (effects (font (size 1.27 1.27)) hide)
    )
    (pin "1" (uuid a45b3174-346b-49c9-9a84-d9c9a5ac9d78))
    (pin "2" (uuid ea859c9c-197b-4572-9e34-2047bd549f7f))
  )

  (symbol (lib_id "Device:R") (at 134.62 81.28 90) (unit 1)
    (in_bom yes) (on_board yes) (fields_autoplaced)
    (uuid eec27c41-7245-4703-9701-e2e22877f63f)
    (property "Reference" "R63" (id 0) (at 134.62 74.93 90))
    (property "Value" "100k" (id 1) (at 134.62 77.47 90))
    (property "Footprint" "Resistor_SMD:R_0603_1608Metric" (id 2) (at 134.62 83.058 90)
      (effects (font (size 1.27 1.27)) hide)
    )
    (property "Datasheet" "~" (id 3) (at 134.62 81.28 0)
      (effects (font (size 1.27 1.27)) hide)
    )
    (pin "1" (uuid 7c8805ac-379f-4c3a-a7bf-8b575a33e12d))
    (pin "2" (uuid ebc946a1-c07a-4777-96d0-f1021ce2d04e))
  )

  (symbol (lib_id "power:GND") (at 236.22 45.72 0) (unit 1)
    (in_bom yes) (on_board yes) (fields_autoplaced)
    (uuid efba3692-a2e4-42da-9f67-a9a28540b60b)
    (property "Reference" "#PWR0147" (id 0) (at 236.22 52.07 0)
      (effects (font (size 1.27 1.27)) hide)
    )
    (property "Value" "GND" (id 1) (at 236.22 50.8 0))
    (property "Footprint" "" (id 2) (at 236.22 45.72 0)
      (effects (font (size 1.27 1.27)) hide)
    )
    (property "Datasheet" "" (id 3) (at 236.22 45.72 0)
      (effects (font (size 1.27 1.27)) hide)
    )
    (pin "1" (uuid 86be7240-6a6e-4c05-a6ab-304a2a2807e1))
  )

  (symbol (lib_id "Device:R") (at 72.39 81.28 90) (unit 1)
    (in_bom yes) (on_board yes) (fields_autoplaced)
    (uuid f5051ae4-5b23-4903-ab0f-35466555524a)
    (property "Reference" "R55" (id 0) (at 72.39 74.93 90))
    (property "Value" "66k" (id 1) (at 72.39 77.47 90))
    (property "Footprint" "Resistor_SMD:R_0603_1608Metric" (id 2) (at 72.39 83.058 90)
      (effects (font (size 1.27 1.27)) hide)
    )
    (property "Datasheet" "~" (id 3) (at 72.39 81.28 0)
      (effects (font (size 1.27 1.27)) hide)
    )
    (pin "1" (uuid 7c01f82b-20cb-4ce5-aa0c-f4ecc6459b64))
    (pin "2" (uuid 26353f38-2f17-4548-8c53-76823c802868))
  )

  (symbol (lib_id "power:GND") (at 83.82 90.17 0) (unit 1)
    (in_bom yes) (on_board yes) (fields_autoplaced)
    (uuid f8ae93a7-706a-4c63-a214-18ea728bb8d7)
    (property "Reference" "#PWR0150" (id 0) (at 83.82 96.52 0)
      (effects (font (size 1.27 1.27)) hide)
    )
    (property "Value" "GND" (id 1) (at 83.82 95.25 0))
    (property "Footprint" "" (id 2) (at 83.82 90.17 0)
      (effects (font (size 1.27 1.27)) hide)
    )
    (property "Datasheet" "" (id 3) (at 83.82 90.17 0)
      (effects (font (size 1.27 1.27)) hide)
    )
    (pin "1" (uuid 7831593b-23cb-4923-aa06-adea2659c15a))
  )
)
